{"text_format":"3","workbook":"xlsx","n_sheets":17,"sheets":["Start","Students","Referrals","HealthFitnessLevel","Export_Data","Reports","Report","BMITable","BP List","Simplified BP table","BP Lookup Table","Lookup_Tables","ReportCard (2)","PACER Report","PACER Info","PACER Printoff","BPTable (2020)"],"not_rendered":{"images":6,"macros":1,"defined_names":6,"pivot_tables":4},"read":"whole","date_system":"1900"}

{"sheet":"Start","index":0,"n_rows":0,"n_cols":0,"rows_kept":0}

{"sheet":"Students","index":1,"n_rows":5,"n_cols":57,"rows_kept":5}
["LEA Code","School Code","System Name","School Name","Exam Date","Grade Level","Student ID Number","Student Last Name","Student First Name","Student Middle Name","Date of Birth","Gender","Height (inches)","Weight (pounds)","Systolic BP (Final)","Diastolic BP (Final)","Vision Exam","Hearing Exam","Scoliosis Exam","Dental Exam","Color Vision Exam","Referral Req","Comments","15M PACER Laps","20M PACER Laps","Street Address","City","State","ZIP Code","BMI","Weight Category","Systolic  Level","Diastolic Level","BP Final","BP Category","BMI 5th Perc","BMI 85th Perc","BMI 95th Perc","SBP 50th Perc","SBP 90th Perc","SBP 95th Perc","SBP 99th Perc","DBP 50th Perc","DBP 90th Perc","DBP 95th Perc","DBP 99th Perc","BP Row","SBP Addy","DBP Addy","Student Age","Quick SBP Check","Quick DBP Check","BP Result","Referral Needed","BP Normal Flag","Adult BP Measurement","Homeroom Teacher"]
[530,48,{"$f":"VLOOKUP(StudentTable[[#This Row],[LEA Code]],School_Listing[[System Code]:[System Name]],2,FALSE)","v":"LOUDON COUNTY"},{"$f":"VLOOKUP(StudentTable[[#This Row],[LEA Code]]&StudentTable[[#This Row],[School Code]],School_Listing[[Column1]:[School Name]],2,FALSE)","v":"North Middle School"},"2015-10-03","HS",1234567890,"Doe","Jane","G","2010-10-03","F",47.3,90,106,59,"NA","NA","NA","NA","NA",{"$f":"IFERROR(IF(OR(StudentTable[[#This Row],[Vision Exam]] = \"F\", StudentTable[[#This Row],[Hearing Exam]] = \"F\", StudentTable[[#This Row],[Scoliosis Exam]] = \"F\",StudentTable[[#This Row],[Dental Exam]]=\"F\", StudentTable[[#This Row],[Color Vision Exam]]=\"F\",NOT(OR(StudentTable[[#This Row],[Weight Category]] = \"Healthy Weight\",StudentTable[[#This Row],[Weight Category]] = \"\")), NOT(OR(StudentTable[[#This Row],[BP Category]] =\"Normal\",StudentTable[[#This Row],[BP Category]] =\"\"))),\"Yes\", \"No\"),\"\")","v":"Yes"},{"$nulls":3},"123 West End","Nashville","TN",37115,{"$f":"IFERROR(StudentTable[[#This Row],[Weight (pounds)]]/(StudentTable[[#This Row],[Height (inches)]]^2)*703,\"\")","v":{"v":28.279749160815097,"d":"28.28"}},{"$f":"IF(StudentTable[[#This Row],[BMI]]=\"\",\"\",IFERROR(IF(StudentTable[[#This Row],[BMI]]<StudentTable[[#This Row],[BMI 5th Perc]],\"Underweight\",IF(AND(StudentTable[[#This Row],[BMI]]>=StudentTable[[#This Row],[BMI 5th Perc]],StudentTable[[#This Row],[BMI]]<StudentTable[[#This Row],[BMI 85th Perc]]),\"Healthy Weight\",IF(AND(StudentTable[[#This Row],[BMI]]>=StudentTable[[#This Row],[BMI 85th Perc]],StudentTable[[#This Row],[BMI]]<StudentTable[[#This Row],[BMI 95th Perc]]),\"Overweight\",IF(StudentTable[[#This Row],[BMI]]>=StudentTable[[#This Row],[BMI 95th Perc]],\"Obese\",\"Out-of-Bounds\")))),\"\"))","v":"Obese"},{"$f":"IF(StudentTable[[#This Row],[Systolic BP (Final)]]<>\"\",IF(StudentTable[[#This Row],[Systolic BP (Final)]]<StudentTable[[#This Row],[SBP 90th Perc]],0,IF(AND(StudentTable[[#This Row],[Systolic BP (Final)]]<StudentTable[[#This Row],[SBP 95th Perc]], StudentTable[[#This Row],[Systolic BP (Final)]]>=StudentTable[[#This Row],[SBP 90th Perc]]),1,IF(AND(StudentTable[[#This Row],[Systolic BP (Final)]]<StudentTable[[#This Row],[SBP 99th Perc]],StudentTable[[#This Row],[Systolic BP (Final)]]>=StudentTable[[#This Row],[SBP 95th Perc]]),2,IF(StudentTable[[#This Row],[Systolic BP (Final)]]>=StudentTable[[#This Row],[SBP 99th Perc]],3,\"\")))),\"\")","v":0},{"$f":"IF(StudentTable[[#This Row],[Diastolic BP (Final)]]<>\"\",IF(StudentTable[[#This Row],[Diastolic BP (Final)]]<StudentTable[[#This Row],[DBP 90th Perc]],0,IF(AND(StudentTable[[#This Row],[Diastolic BP (Final)]]<StudentTable[[#This Row],[DBP 95th Perc]], StudentTable[[#This Row],[Diastolic BP (Final)]]>=StudentTable[[#This Row],[DBP 90th Perc]]),1,IF(AND(StudentTable[[#This Row],[Diastolic BP (Final)]]<StudentTable[[#This Row],[DBP 99th Perc]],StudentTable[[#This Row],[Diastolic BP (Final)]]>=StudentTable[[#This Row],[DBP 95th Perc]]),2,IF(StudentTable[[#This Row],[Diastolic BP (Final)]]>=StudentTable[[#This Row],[DBP 99th Perc]],3,\"\")))),\"\")","v":0},{"$f":"IF(StudentTable[[#This Row],[Height (inches)]]=\"\",\"\",IF(StudentTable[[#This Row],[Systolic  Level]]<=StudentTable[[#This Row],[Diastolic Level]],StudentTable[Diastolic Level],StudentTable[Systolic  Level]))","v":0},{"$f":"IF(StudentTable[[#This Row],[Student Age]]>18,StudentTable[[#This Row],[Adult BP Measurement]],IF(OR(StudentTable[[#This Row],[Systolic BP (Final)]]>=StudentTable[[#This Row],[Quick SBP Check]],StudentTable[[#This Row],[Diastolic BP (Final)]]>=StudentTable[[#This Row],[Quick DBP Check]]),StudentTable[[#This Row],[BP Result]],\"Normal\"))","v":"Normal"},{"$f":"IFERROR(IF(StudentTable[[#This Row],[Gender]]=\"M\",VLOOKUP(ROUNDDOWN(YEARFRAC(StudentTable[[#This Row],[Exam Date]],StudentTable[[#This Row],[Date of Birth]],1)*12,1),BMITable!$A$3:$K$221,3,TRUE),IF(StudentTable[[#This Row],[Gender]]=\"F\",VLOOKUP(ROUNDDOWN(YEARFRAC(StudentTable[[#This Row],[Exam Date]],StudentTable[[#This Row],[Date of Birth]],1)*12,1),BMITable!$A$224:$K$442,3,TRUE),\"\")),\"\")","v":{"v":13.53336,"d":"13.53"}},{"$f":"IFERROR(IF(StudentTable[[#This Row],[Gender]]=\"M\",VLOOKUP(ROUNDDOWN(YEARFRAC(StudentTable[[#This Row],[Exam Date]],StudentTable[[#This Row],[Date of Birth]],1)*12,1),BMITable!$A$3:$K$221,8,TRUE),IF(StudentTable[[#This Row],[Gender]]=\"F\",VLOOKUP(ROUNDDOWN(YEARFRAC(StudentTable[[#This Row],[Exam Date]],StudentTable[[#This Row],[Date of Birth]],1)*12,1),BMITable!$A$224:$K$442,8,TRUE),\"\")),\"\")","v":{"v":16.78956,"d":"16.79"}},{"$f":"IFERROR(IF(StudentTable[[#This Row],[Gender]]=\"M\",VLOOKUP(ROUNDDOWN(YEARFRAC(StudentTable[[#This Row],[Exam Date]],StudentTable[[#This Row],[Date of Birth]],1)*12,1),BMITable!$A$3:$K$221,10,TRUE),IF(StudentTable[[#This Row],[Gender]]=\"F\",VLOOKUP(ROUNDDOWN(YEARFRAC(StudentTable[[#This Row],[Exam Date]],StudentTable[[#This Row],[Date of Birth]],1)*12,1),BMITable!$A$224:$K$442,10,TRUE),\"\")),\"\")","v":{"v":18.22355,"d":"18.22"}},{"$f":"IFERROR(IF(StudentTable[[#This Row],[Height (inches)]]<>\"\",HLOOKUP(StudentTable[[#This Row],[Height (inches)]],INDIRECT(StudentTable[[#This Row],[SBP Addy]]),2,TRUE),\"\"),\"\")","v":96},{"$f":"IFERROR(IF(StudentTable[[#This Row],[Height (inches)]]<>\"\",HLOOKUP(StudentTable[[#This Row],[Height (inches)]],INDIRECT(StudentTable[[#This Row],[SBP Addy]]),3,TRUE),\"\"),\"\")","v":110},{"$f":"IFERROR(IF(StudentTable[[#This Row],[Height (inches)]]<>\"\",HLOOKUP(StudentTable[[#This Row],[Height (inches)]],INDIRECT(StudentTable[[#This Row],[SBP Addy]]),4,TRUE),\"\"),\"\")","v":113},{"$f":"IFERROR(IF(StudentTable[[#This Row],[Height (inches)]]<>\"\",HLOOKUP(StudentTable[[#This Row],[Height (inches)]],INDIRECT(StudentTable[[#This Row],[SBP Addy]]),5,TRUE),\"\"),\"\")","v":125},{"$f":"IFERROR(IF(StudentTable[[#This Row],[Height (inches)]]<>\"\",HLOOKUP(StudentTable[[#This Row],[Height (inches)]],INDIRECT(StudentTable[[#This Row],[DBP Addy]]),2,TRUE),\"\"),\"\")","v":57},{"$f":"IFERROR(IF(StudentTable[[#This Row],[Height (inches)]]<>\"\",HLOOKUP(StudentTable[[#This Row],[Height (inches)]],INDIRECT(StudentTable[[#This Row],[DBP Addy]]),3,TRUE),\"\"),\"\")","v":69},{"$f":"IFERROR(IF(StudentTable[[#This Row],[Height (inches)]]<>\"\",HLOOKUP(StudentTable[[#This Row],[Height (inches)]],INDIRECT(StudentTable[[#This Row],[DBP Addy]]),4,TRUE),\"\"),\"\")","v":73},{"$f":"IFERROR(IF(StudentTable[[#This Row],[Height (inches)]]<>\"\",HLOOKUP(StudentTable[[#This Row],[Height (inches)]],INDIRECT(StudentTable[[#This Row],[DBP Addy]]),5,TRUE),\"\"),\"\")","v":85},{"$f":"IF(StudentTable[[#This Row],[Gender]]=\"M\",MATCH(ROUNDDOWN(YEARFRAC(StudentTable[[#This Row],[Exam Date]],StudentTable[[#This Row],[Date of Birth]]),0),'BP Lookup Table'!$A$3:$A$82,1)+ROW('BP Lookup Table'!$A$3:$A$82)-1,IF(StudentTable[[#This Row],[Gender]]=\"F\",MATCH(ROUNDDOWN(YEARFRAC(StudentTable[[#This Row],[Exam Date]],StudentTable[[#This Row],[Date of Birth]]),0),'BP Lookup Table'!$A$86:$A$161,1)+ROW('BP Lookup Table'!$A$86:$A$161)-1,\"\"))","v":101},{"$f":"IF(StudentTable[[#This Row],[BP Row]]<>\"\",\"'BP Lookup Table'!B\"&StudentTable[[#This Row],[BP Row]]&\":\"&\"I\"&StudentTable[[#This Row],[BP Row]]+4,\"\")","v":"'BP Lookup Table'!B101:I105"},{"$f":"IF(StudentTable[[#This Row],[BP Row]]<>\"\",\"'BP Lookup Table'!J\"&StudentTable[[#This Row],[BP Row]]&\":\"&\"Q\"&StudentTable[[#This Row],[BP Row]]+4,\"\")","v":"'BP Lookup Table'!J101:Q105"},{"$f":"ROUND(_xlfn.DAYS(StudentTable[[#This Row],[Exam Date]],StudentTable[[#This Row],[Date of Birth]])/365,0)","v":5},{"$f":"IF(StudentTable[[#This Row],[Gender]]=\"M\",INDEX('Simplified BP table'!$B$4:$B$21,MATCH(StudentTable[[#This Row],[Student Age]],'Simplified BP table'!$A$4:$A$21,0)),INDEX('Simplified BP table'!$D$4:$D$21,MATCH(StudentTable[[#This Row],[Student Age]],'Simplified BP table'!$A$4:$A$21,0)))","v":104},{"$f":"IF(StudentTable[[#This Row],[Gender]]=\"M\",INDEX('Simplified BP table'!$C$4:$C$21,MATCH(StudentTable[[#This Row],[Student Age]],'Simplified BP table'!$A$4:$A$21,0)),INDEX('Simplified BP table'!$E$4:$E$21,MATCH(StudentTable[[#This Row],[Student Age]],'Simplified BP table'!$A$4:$A$21,0)))","v":64},{"$f":"IF(StudentTable[[#This Row],[Student Age]]>=18,StudentTable[[#This Row],[Adult BP Measurement]],IF(StudentTable[[#This Row],[Height (inches)]]=\"\",\"Height Needed\",IFERROR(IF(StudentTable[[#This Row],[BP Final]]=0,\"Normal\",IF(StudentTable[[#This Row],[BP Final]]=1,\"Elevated BP\",IF(StudentTable[[#This Row],[BP Final]]=2,\"Stage 1 HT\",IF(StudentTable[[#This Row],[BP Final]]=3,\"Stage 2 HT\",\"Out of Range\")))),\"\")))","v":"Normal"},{"$f":"IF(OR(StudentTable[[#This Row],[Vision Exam]] = \"F\", StudentTable[[#This Row],[Hearing Exam]] = \"F\", StudentTable[[#This Row],[Scoliosis Exam]] = \"F\",StudentTable[[#This Row],[Dental Exam]]=\"F\", StudentTable[[#This Row],[Color Vision Exam]]=\"F\",StudentTable[[#This Row],[Weight Category]] <> \"Normal\", StudentTable[[#This Row],[BP Category]] <>\"Normal\"),\"Yes\", \"No\")","v":"Yes"},{"$f":"AND(OR(StudentTable[[#This Row],[Systolic BP (Final)]]>=StudentTable[[#This Row],[Quick SBP Check]],StudentTable[[#This Row],[Diastolic BP (Final)]]>=StudentTable[[#This Row],[Quick DBP Check]]),StudentTable[[#This Row],[BP Result]]=\"Normal\")","v":true},{"$f":"IF(AND(StudentTable[[#This Row],[Systolic BP (Final)]]< 120,StudentTable[[#This Row],[Diastolic BP (Final)]]<80),\"Normal\",IF(AND(StudentTable[[#This Row],[Systolic BP (Final)]]>=120,StudentTable[[#This Row],[Systolic BP (Final)]]<=129,StudentTable[[#This Row],[Diastolic BP (Final)]]<80),\"Elevated BP\",IF(OR(AND(StudentTable[[#This Row],[Systolic BP (Final)]]>=130,StudentTable[[#This Row],[Systolic BP (Final)]]<=139),AND(StudentTable[[#This Row],[Diastolic BP (Final)]]>=80,StudentTable[[#This Row],[Diastolic BP (Final)]]<=89)),\"Stage 1 HT\",IF(OR(StudentTable[[#This Row],[Systolic BP (Final)]]>=140,StudentTable[[#This Row],[Diastolic BP (Final)]]>=90),\"Stage 2 HT\",\"Out of Range\"))))","v":"Normal"},"Mr. Ramirez"]
[999,99,"Smith Co","Kennedy High School","2016-02-17",9,4199580,"A47","B47","C47","2001-08-10","F",63,91.6,121,81,"P","P","P","P","P",{"$f":"IFERROR(IF(OR(StudentTable[[#This Row],[Vision Exam]] = \"F\", StudentTable[[#This Row],[Hearing Exam]] = \"F\", StudentTable[[#This Row],[Scoliosis Exam]] = \"F\",StudentTable[[#This Row],[Dental Exam]]=\"F\", StudentTable[[#This Row],[Color Vision Exam]]=\"F\",NOT(OR(StudentTable[[#This Row],[Weight Category]] = \"Healthy Weight\",StudentTable[[#This Row],[Weight Category]] = \"\")), NOT(OR(StudentTable[[#This Row],[BP Category]] =\"Normal\",StudentTable[[#This Row],[BP Category]] =\"\"))),\"Yes\", \"No\"),\"\")","v":"Yes"},{"$nulls":7},{"$f":"IFERROR(StudentTable[[#This Row],[Weight (pounds)]]/(StudentTable[[#This Row],[Height (inches)]]^2)*703,\"\")","v":{"v":16.224439405391784,"d":"16.22"}},{"$f":"IF(StudentTable[[#This Row],[BMI]]=\"\",\"\",IFERROR(IF(StudentTable[[#This Row],[BMI]]<StudentTable[[#This Row],[BMI 5th Perc]],\"Underweight\",IF(AND(StudentTable[[#This Row],[BMI]]>=StudentTable[[#This Row],[BMI 5th Perc]],StudentTable[[#This Row],[BMI]]<StudentTable[[#This Row],[BMI 85th Perc]]),\"Healthy Weight\",IF(AND(StudentTable[[#This Row],[BMI]]>=StudentTable[[#This Row],[BMI 85th Perc]],StudentTable[[#This Row],[BMI]]<StudentTable[[#This Row],[BMI 95th Perc]]),\"Overweight\",IF(StudentTable[[#This Row],[BMI]]>=StudentTable[[#This Row],[BMI 95th Perc]],\"Obese\",\"Out-of-Bounds\")))),\"\"))","v":"Healthy Weight"},{"$f":"IF(StudentTable[[#This Row],[Systolic BP (Final)]]<>\"\",IF(StudentTable[[#This Row],[Systolic BP (Final)]]<StudentTable[[#This Row],[SBP 90th Perc]],0,IF(AND(StudentTable[[#This Row],[Systolic BP (Final)]]<StudentTable[[#This Row],[SBP 95th Perc]], StudentTable[[#This Row],[Systolic BP (Final)]]>=StudentTable[[#This Row],[SBP 90th Perc]]),1,IF(AND(StudentTable[[#This Row],[Systolic BP (Final)]]<StudentTable[[#This Row],[SBP 99th Perc]],StudentTable[[#This Row],[Systolic BP (Final)]]>=StudentTable[[#This Row],[SBP 95th Perc]]),2,IF(StudentTable[[#This Row],[Systolic BP (Final)]]>=StudentTable[[#This Row],[SBP 99th Perc]],3,\"\")))),\"\")","v":1},{"$f":"IF(StudentTable[[#This Row],[Diastolic BP (Final)]]<>\"\",IF(StudentTable[[#This Row],[Diastolic BP (Final)]]<StudentTable[[#This Row],[DBP 90th Perc]],0,IF(AND(StudentTable[[#This Row],[Diastolic BP (Final)]]<StudentTable[[#This Row],[DBP 95th Perc]], StudentTable[[#This Row],[Diastolic BP (Final)]]>=StudentTable[[#This Row],[DBP 90th Perc]]),1,IF(AND(StudentTable[[#This Row],[Diastolic BP (Final)]]<StudentTable[[#This Row],[DBP 99th Perc]],StudentTable[[#This Row],[Diastolic BP (Final)]]>=StudentTable[[#This Row],[DBP 95th Perc]]),2,IF(StudentTable[[#This Row],[Diastolic BP (Final)]]>=StudentTable[[#This Row],[DBP 99th Perc]],3,\"\")))),\"\")","v":2},{"$f":"IF(StudentTable[[#This Row],[Height (inches)]]=\"\",\"\",IF(StudentTable[[#This Row],[Systolic  Level]]<=StudentTable[[#This Row],[Diastolic Level]],StudentTable[Diastolic Level],StudentTable[Systolic  Level]))","v":2},{"$f":"IF(StudentTable[[#This Row],[Student Age]]>18,StudentTable[[#This Row],[Adult BP Measurement]],IF(OR(StudentTable[[#This Row],[Systolic BP (Final)]]>=StudentTable[[#This Row],[Quick SBP Check]],StudentTable[[#This Row],[Diastolic BP (Final)]]>=StudentTable[[#This Row],[Quick DBP Check]]),StudentTable[[#This Row],[BP Result]],\"Normal\"))","v":"Stage 1 HT"},{"$f":"IFERROR(IF(StudentTable[[#This Row],[Gender]]=\"M\",VLOOKUP(ROUNDDOWN(YEARFRAC(StudentTable[[#This Row],[Exam Date]],StudentTable[[#This Row],[Date of Birth]],1)*12,1),BMITable!$A$3:$K$221,3,TRUE),IF(StudentTable[[#This Row],[Gender]]=\"F\",VLOOKUP(ROUNDDOWN(YEARFRAC(StudentTable[[#This Row],[Exam Date]],StudentTable[[#This Row],[Date of Birth]],1)*12,1),BMITable!$A$224:$K$442,3,TRUE),\"\")),\"\")","v":{"v":16.01795,"d":"16.02"}},{"$f":"IFERROR(IF(StudentTable[[#This Row],[Gender]]=\"M\",VLOOKUP(ROUNDDOWN(YEARFRAC(StudentTable[[#This Row],[Exam Date]],StudentTable[[#This Row],[Date of Birth]],1)*12,1),BMITable!$A$3:$K$221,8,TRUE),IF(StudentTable[[#This Row],[Gender]]=\"F\",VLOOKUP(ROUNDDOWN(YEARFRAC(StudentTable[[#This Row],[Exam Date]],StudentTable[[#This Row],[Date of Birth]],1)*12,1),BMITable!$A$224:$K$442,8,TRUE),\"\")),\"\")","v":{"v":23.64723,"d":"23.65"}},{"$f":"IFERROR(IF(StudentTable[[#This Row],[Gender]]=\"M\",VLOOKUP(ROUNDDOWN(YEARFRAC(StudentTable[[#This Row],[Exam Date]],StudentTable[[#This Row],[Date of Birth]],1)*12,1),BMITable!$A$3:$K$221,10,TRUE),IF(StudentTable[[#This Row],[Gender]]=\"F\",VLOOKUP(ROUNDDOWN(YEARFRAC(StudentTable[[#This Row],[Exam Date]],StudentTable[[#This Row],[Date of Birth]],1)*12,1),BMITable!$A$224:$K$442,10,TRUE),\"\")),\"\")","v":{"v":27.6282,"d":"27.63"}},{"$f":"IFERROR(IF(StudentTable[[#This Row],[Height (inches)]]<>\"\",HLOOKUP(StudentTable[[#This Row],[Height (inches)]],INDIRECT(StudentTable[[#This Row],[SBP Addy]]),2,TRUE),\"\"),\"\")","v":107},{"$f":"IFERROR(IF(StudentTable[[#This Row],[Height (inches)]]<>\"\",HLOOKUP(StudentTable[[#This Row],[Height (inches)]],INDIRECT(StudentTable[[#This Row],[SBP Addy]]),3,TRUE),\"\"),\"\")","v":120},{"$f":"IFERROR(IF(StudentTable[[#This Row],[Height (inches)]]<>\"\",HLOOKUP(StudentTable[[#This Row],[Height (inches)]],INDIRECT(StudentTable[[#This Row],[SBP Addy]]),4,TRUE),\"\"),\"\")","v":124},{"$f":"IFERROR(IF(StudentTable[[#This Row],[Height (inches)]]<>\"\",HLOOKUP(StudentTable[[#This Row],[Height (inches)]],INDIRECT(StudentTable[[#This Row],[SBP Addy]]),5,TRUE),\"\"),\"\")","v":136},{"$f":"IFERROR(IF(StudentTable[[#This Row],[Height (inches)]]<>\"\",HLOOKUP(StudentTable[[#This Row],[Height (inches)]],INDIRECT(StudentTable[[#This Row],[DBP Addy]]),2,TRUE),\"\"),\"\")","v":64},{"$f":"IFERROR(IF(StudentTable[[#This Row],[Height (inches)]]<>\"\",HLOOKUP(StudentTable[[#This Row],[Height (inches)]],INDIRECT(StudentTable[[#This Row],[DBP Addy]]),3,TRUE),\"\"),\"\")","v":76},{"$f":"IFERROR(IF(StudentTable[[#This Row],[Height (inches)]]<>\"\",HLOOKUP(StudentTable[[#This Row],[Height (inches)]],INDIRECT(StudentTable[[#This Row],[DBP Addy]]),4,TRUE),\"\"),\"\")","v":80},{"$f":"IFERROR(IF(StudentTable[[#This Row],[Height (inches)]]<>\"\",HLOOKUP(StudentTable[[#This Row],[Height (inches)]],INDIRECT(StudentTable[[#This Row],[DBP Addy]]),5,TRUE),\"\"),\"\")","v":92},{"$f":"IF(StudentTable[[#This Row],[Gender]]=\"M\",MATCH(ROUNDDOWN(YEARFRAC(StudentTable[[#This Row],[Exam Date]],StudentTable[[#This Row],[Date of Birth]]),0),'BP Lookup Table'!$A$3:$A$82,1)+ROW('BP Lookup Table'!$A$3:$A$82)-1,IF(StudentTable[[#This Row],[Gender]]=\"F\",MATCH(ROUNDDOWN(YEARFRAC(StudentTable[[#This Row],[Exam Date]],StudentTable[[#This Row],[Date of Birth]]),0),'BP Lookup Table'!$A$86:$A$161,1)+ROW('BP Lookup Table'!$A$86:$A$161)-1,\"\"))","v":146},{"$f":"IF(StudentTable[[#This Row],[BP Row]]<>\"\",\"'BP Lookup Table'!B\"&StudentTable[[#This Row],[BP Row]]&\":\"&\"I\"&StudentTable[[#This Row],[BP Row]]+4,\"\")","v":"'BP Lookup Table'!B146:I150"},{"$f":"IF(StudentTable[[#This Row],[BP Row]]<>\"\",\"'BP Lookup Table'!J\"&StudentTable[[#This Row],[BP Row]]&\":\"&\"Q\"&StudentTable[[#This Row],[BP Row]]+4,\"\")","v":"'BP Lookup Table'!J146:Q150"},{"$f":"ROUND(_xlfn.DAYS(StudentTable[[#This Row],[Exam Date]],StudentTable[[#This Row],[Date of Birth]])/365,0)","v":15},{"$f":"IF(StudentTable[[#This Row],[Gender]]=\"M\",INDEX('Simplified BP table'!$B$4:$B$21,MATCH(StudentTable[[#This Row],[Student Age]],'Simplified BP table'!$A$4:$A$21,0)),INDEX('Simplified BP table'!$D$4:$D$21,MATCH(StudentTable[[#This Row],[Student Age]],'Simplified BP table'!$A$4:$A$21,0)))","v":120},{"$f":"IF(StudentTable[[#This Row],[Gender]]=\"M\",INDEX('Simplified BP table'!$C$4:$C$21,MATCH(StudentTable[[#This Row],[Student Age]],'Simplified BP table'!$A$4:$A$21,0)),INDEX('Simplified BP table'!$E$4:$E$21,MATCH(StudentTable[[#This Row],[Student Age]],'Simplified BP table'!$A$4:$A$21,0)))","v":80},{"$f":"IF(StudentTable[[#This Row],[Student Age]]>=18,StudentTable[[#This Row],[Adult BP Measurement]],IF(StudentTable[[#This Row],[Height (inches)]]=\"\",\"Height Needed\",IFERROR(IF(StudentTable[[#This Row],[BP Final]]=0,\"Normal\",IF(StudentTable[[#This Row],[BP Final]]=1,\"Elevated BP\",IF(StudentTable[[#This Row],[BP Final]]=2,\"Stage 1 HT\",IF(StudentTable[[#This Row],[BP Final]]=3,\"Stage 2 HT\",\"Out of Range\")))),\"\")))","v":"Stage 1 HT"},{"$f":"IF(OR(StudentTable[[#This Row],[Vision Exam]] = \"F\", StudentTable[[#This Row],[Hearing Exam]] = \"F\", StudentTable[[#This Row],[Scoliosis Exam]] = \"F\",StudentTable[[#This Row],[Dental Exam]]=\"F\", StudentTable[[#This Row],[Color Vision Exam]]=\"F\",StudentTable[[#This Row],[Weight Category]] <> \"Normal\", StudentTable[[#This Row],[BP Category]] <>\"Normal\"),\"Yes\", \"No\")","v":"Yes"},{"$f":"AND(OR(StudentTable[[#This Row],[Systolic BP (Final)]]>=StudentTable[[#This Row],[Quick SBP Check]],StudentTable[[#This Row],[Diastolic BP (Final)]]>=StudentTable[[#This Row],[Quick DBP Check]]),StudentTable[[#This Row],[BP Result]]=\"Normal\")","v":false},{"$f":"IF(AND(StudentTable[[#This Row],[Systolic BP (Final)]]< 120,StudentTable[[#This Row],[Diastolic BP (Final)]]<80),\"Normal\",IF(AND(StudentTable[[#This Row],[Systolic BP (Final)]]>=120,StudentTable[[#This Row],[Systolic BP (Final)]]<=129,StudentTable[[#This Row],[Diastolic BP (Final)]]<80),\"Elevated BP\",IF(OR(AND(StudentTable[[#This Row],[Systolic BP (Final)]]>=130,StudentTable[[#This Row],[Systolic BP (Final)]]<=139),AND(StudentTable[[#This Row],[Diastolic BP (Final)]]>=80,StudentTable[[#This Row],[Diastolic BP (Final)]]<=89)),\"Stage 1 HT\",IF(OR(StudentTable[[#This Row],[Systolic BP (Final)]]>=140,StudentTable[[#This Row],[Diastolic BP (Final)]]>=90),\"Stage 2 HT\",\"Out of Range\"))))","v":"Stage 1 HT"},"Mr. Ramirez"]
[999,99,"Smith Co","Kennedy High School","2020-02-17",10,4030237,"A48","B48","C48","2000-06-29","M",74,306.2,140,80,"F","F","F","F","F",{"$f":"IFERROR(IF(OR(StudentTable[[#This Row],[Vision Exam]] = \"F\", StudentTable[[#This Row],[Hearing Exam]] = \"F\", StudentTable[[#This Row],[Scoliosis Exam]] = \"F\",StudentTable[[#This Row],[Dental Exam]]=\"F\", StudentTable[[#This Row],[Color Vision Exam]]=\"F\",NOT(OR(StudentTable[[#This Row],[Weight Category]] = \"Healthy Weight\",StudentTable[[#This Row],[Weight Category]] = \"\")), NOT(OR(StudentTable[[#This Row],[BP Category]] =\"Normal\",StudentTable[[#This Row],[BP Category]] =\"\"))),\"Yes\", \"No\"),\"\")","v":"Yes"},{"$nulls":7},{"$f":"IFERROR(StudentTable[[#This Row],[Weight (pounds)]]/(StudentTable[[#This Row],[Height (inches)]]^2)*703,\"\")","v":{"v":39.309459459459454,"d":"39.31"}},{"$f":"IF(StudentTable[[#This Row],[BMI]]=\"\",\"\",IFERROR(IF(StudentTable[[#This Row],[BMI]]<StudentTable[[#This Row],[BMI 5th Perc]],\"Underweight\",IF(AND(StudentTable[[#This Row],[BMI]]>=StudentTable[[#This Row],[BMI 5th Perc]],StudentTable[[#This Row],[BMI]]<StudentTable[[#This Row],[BMI 85th Perc]]),\"Healthy Weight\",IF(AND(StudentTable[[#This Row],[BMI]]>=StudentTable[[#This Row],[BMI 85th Perc]],StudentTable[[#This Row],[BMI]]<StudentTable[[#This Row],[BMI 95th Perc]]),\"Overweight\",IF(StudentTable[[#This Row],[BMI]]>=StudentTable[[#This Row],[BMI 95th Perc]],\"Obese\",\"Out-of-Bounds\")))),\"\"))","v":"Obese"},{"$f":"IF(StudentTable[[#This Row],[Systolic BP (Final)]]<>\"\",IF(StudentTable[[#This Row],[Systolic BP (Final)]]<StudentTable[[#This Row],[SBP 90th Perc]],0,IF(AND(StudentTable[[#This Row],[Systolic BP (Final)]]<StudentTable[[#This Row],[SBP 95th Perc]], StudentTable[[#This Row],[Systolic BP (Final)]]>=StudentTable[[#This Row],[SBP 90th Perc]]),1,IF(AND(StudentTable[[#This Row],[Systolic BP (Final)]]<StudentTable[[#This Row],[SBP 99th Perc]],StudentTable[[#This Row],[Systolic BP (Final)]]>=StudentTable[[#This Row],[SBP 95th Perc]]),2,IF(StudentTable[[#This Row],[Systolic BP (Final)]]>=StudentTable[[#This Row],[SBP 99th Perc]],3,\"\")))),\"\")","v":2},{"$f":"IF(StudentTable[[#This Row],[Diastolic BP (Final)]]<>\"\",IF(StudentTable[[#This Row],[Diastolic BP (Final)]]<StudentTable[[#This Row],[DBP 90th Perc]],0,IF(AND(StudentTable[[#This Row],[Diastolic BP (Final)]]<StudentTable[[#This Row],[DBP 95th Perc]], StudentTable[[#This Row],[Diastolic BP (Final)]]>=StudentTable[[#This Row],[DBP 90th Perc]]),1,IF(AND(StudentTable[[#This Row],[Diastolic BP (Final)]]<StudentTable[[#This Row],[DBP 99th Perc]],StudentTable[[#This Row],[Diastolic BP (Final)]]>=StudentTable[[#This Row],[DBP 95th Perc]]),2,IF(StudentTable[[#This Row],[Diastolic BP (Final)]]>=StudentTable[[#This Row],[DBP 99th Perc]],3,\"\")))),\"\")","v":0},{"$f":"IF(StudentTable[[#This Row],[Height (inches)]]=\"\",\"\",IF(StudentTable[[#This Row],[Systolic  Level]]<=StudentTable[[#This Row],[Diastolic Level]],StudentTable[Diastolic Level],StudentTable[Systolic  Level]))","v":2},{"$f":"IF(StudentTable[[#This Row],[Student Age]]>18,StudentTable[[#This Row],[Adult BP Measurement]],IF(OR(StudentTable[[#This Row],[Systolic BP (Final)]]>=StudentTable[[#This Row],[Quick SBP Check]],StudentTable[[#This Row],[Diastolic BP (Final)]]>=StudentTable[[#This Row],[Quick DBP Check]]),StudentTable[[#This Row],[BP Result]],\"Normal\"))","v":"Stage 1 HT"},{"$f":"IFERROR(IF(StudentTable[[#This Row],[Gender]]=\"M\",VLOOKUP(ROUNDDOWN(YEARFRAC(StudentTable[[#This Row],[Exam Date]],StudentTable[[#This Row],[Date of Birth]],1)*12,1),BMITable!$A$3:$K$221,3,TRUE),IF(StudentTable[[#This Row],[Gender]]=\"F\",VLOOKUP(ROUNDDOWN(YEARFRAC(StudentTable[[#This Row],[Exam Date]],StudentTable[[#This Row],[Date of Birth]],1)*12,1),BMITable!$A$224:$K$442,3,TRUE),\"\")),\"\")","v":{"v":18.97844,"d":"18.98"}},{"$f":"IFERROR(IF(StudentTable[[#This Row],[Gender]]=\"M\",VLOOKUP(ROUNDDOWN(YEARFRAC(StudentTable[[#This Row],[Exam Date]],StudentTable[[#This Row],[Date of Birth]],1)*12,1),BMITable!$A$3:$K$221,8,TRUE),IF(StudentTable[[#This Row],[Gender]]=\"F\",VLOOKUP(ROUNDDOWN(YEARFRAC(StudentTable[[#This Row],[Exam Date]],StudentTable[[#This Row],[Date of Birth]],1)*12,1),BMITable!$A$224:$K$442,8,TRUE),\"\")),\"\")","v":{"v":26.77522,"d":"26.78"}},{"$f":"IFERROR(IF(StudentTable[[#This Row],[Gender]]=\"M\",VLOOKUP(ROUNDDOWN(YEARFRAC(StudentTable[[#This Row],[Exam Date]],StudentTable[[#This Row],[Date of Birth]],1)*12,1),BMITable!$A$3:$K$221,10,TRUE),IF(StudentTable[[#This Row],[Gender]]=\"F\",VLOOKUP(ROUNDDOWN(YEARFRAC(StudentTable[[#This Row],[Exam Date]],StudentTable[[#This Row],[Date of Birth]],1)*12,1),BMITable!$A$224:$K$442,10,TRUE),\"\")),\"\")","v":{"v":30.23276,"d":"30.23"}},{"$f":"IFERROR(IF(StudentTable[[#This Row],[Height (inches)]]<>\"\",HLOOKUP(StudentTable[[#This Row],[Height (inches)]],INDIRECT(StudentTable[[#This Row],[SBP Addy]]),2,TRUE),\"\"),\"\")","v":118},{"$f":"IFERROR(IF(StudentTable[[#This Row],[Height (inches)]]<>\"\",HLOOKUP(StudentTable[[#This Row],[Height (inches)]],INDIRECT(StudentTable[[#This Row],[SBP Addy]]),3,TRUE),\"\"),\"\")","v":134},{"$f":"IFERROR(IF(StudentTable[[#This Row],[Height (inches)]]<>\"\",HLOOKUP(StudentTable[[#This Row],[Height (inches)]],INDIRECT(StudentTable[[#This Row],[SBP Addy]]),4,TRUE),\"\"),\"\")","v":138},{"$f":"IFERROR(IF(StudentTable[[#This Row],[Height (inches)]]<>\"\",HLOOKUP(StudentTable[[#This Row],[Height (inches)]],INDIRECT(StudentTable[[#This Row],[SBP Addy]]),5,TRUE),\"\"),\"\")","v":150},{"$f":"IFERROR(IF(StudentTable[[#This Row],[Height (inches)]]<>\"\",HLOOKUP(StudentTable[[#This Row],[Height (inches)]],INDIRECT(StudentTable[[#This Row],[DBP Addy]]),2,TRUE),\"\"),\"\")","v":70},{"$f":"IFERROR(IF(StudentTable[[#This Row],[Height (inches)]]<>\"\",HLOOKUP(StudentTable[[#This Row],[Height (inches)]],INDIRECT(StudentTable[[#This Row],[DBP Addy]]),3,TRUE),\"\"),\"\")","v":83},{"$f":"IFERROR(IF(StudentTable[[#This Row],[Height (inches)]]<>\"\",HLOOKUP(StudentTable[[#This Row],[Height (inches)]],INDIRECT(StudentTable[[#This Row],[DBP Addy]]),4,TRUE),\"\"),\"\")","v":87},{"$f":"IFERROR(IF(StudentTable[[#This Row],[Height (inches)]]<>\"\",HLOOKUP(StudentTable[[#This Row],[Height (inches)]],INDIRECT(StudentTable[[#This Row],[DBP Addy]]),5,TRUE),\"\"),\"\")","v":99},{"$f":"IF(StudentTable[[#This Row],[Gender]]=\"M\",MATCH(ROUNDDOWN(YEARFRAC(StudentTable[[#This Row],[Exam Date]],StudentTable[[#This Row],[Date of Birth]]),0),'BP Lookup Table'!$A$3:$A$82,1)+ROW('BP Lookup Table'!$A$3:$A$82)-1,IF(StudentTable[[#This Row],[Gender]]=\"F\",MATCH(ROUNDDOWN(YEARFRAC(StudentTable[[#This Row],[Exam Date]],StudentTable[[#This Row],[Date of Birth]]),0),'BP Lookup Table'!$A$86:$A$161,1)+ROW('BP Lookup Table'!$A$86:$A$161)-1,\"\"))","v":78},{"$f":"IF(StudentTable[[#This Row],[BP Row]]<>\"\",\"'BP Lookup Table'!B\"&StudentTable[[#This Row],[BP Row]]&\":\"&\"I\"&StudentTable[[#This Row],[BP Row]]+4,\"\")","v":"'BP Lookup Table'!B78:I82"},{"$f":"IF(StudentTable[[#This Row],[BP Row]]<>\"\",\"'BP Lookup Table'!J\"&StudentTable[[#This Row],[BP Row]]&\":\"&\"Q\"&StudentTable[[#This Row],[BP Row]]+4,\"\")","v":"'BP Lookup Table'!J78:Q82"},{"$f":"ROUND(_xlfn.DAYS(StudentTable[[#This Row],[Exam Date]],StudentTable[[#This Row],[Date of Birth]])/365,0)","v":20},{"$f":"IF(StudentTable[[#This Row],[Gender]]=\"M\",INDEX('Simplified BP table'!$B$4:$B$21,MATCH(StudentTable[[#This Row],[Student Age]],'Simplified BP table'!$A$4:$A$21,0)),INDEX('Simplified BP table'!$D$4:$D$21,MATCH(StudentTable[[#This Row],[Student Age]],'Simplified BP table'!$A$4:$A$21,0)))","v":{"$error":"#N/A"}},{"$f":"IF(StudentTable[[#This Row],[Gender]]=\"M\",INDEX('Simplified BP table'!$C$4:$C$21,MATCH(StudentTable[[#This Row],[Student Age]],'Simplified BP table'!$A$4:$A$21,0)),INDEX('Simplified BP table'!$E$4:$E$21,MATCH(StudentTable[[#This Row],[Student Age]],'Simplified BP table'!$A$4:$A$21,0)))","v":{"$error":"#N/A"}},{"$f":"IF(StudentTable[[#This Row],[Student Age]]>=18,StudentTable[[#This Row],[Adult BP Measurement]],IF(StudentTable[[#This Row],[Height (inches)]]=\"\",\"Height Needed\",IFERROR(IF(StudentTable[[#This Row],[BP Final]]=0,\"Normal\",IF(StudentTable[[#This Row],[BP Final]]=1,\"Elevated BP\",IF(StudentTable[[#This Row],[BP Final]]=2,\"Stage 1 HT\",IF(StudentTable[[#This Row],[BP Final]]=3,\"Stage 2 HT\",\"Out of Range\")))),\"\")))","v":"Stage 1 HT"},{"$f":"IF(OR(StudentTable[[#This Row],[Vision Exam]] = \"F\", StudentTable[[#This Row],[Hearing Exam]] = \"F\", StudentTable[[#This Row],[Scoliosis Exam]] = \"F\",StudentTable[[#This Row],[Dental Exam]]=\"F\", StudentTable[[#This Row],[Color Vision Exam]]=\"F\",StudentTable[[#This Row],[Weight Category]] <> \"Normal\", StudentTable[[#This Row],[BP Category]] <>\"Normal\"),\"Yes\", \"No\")","v":"Yes"},{"$f":"AND(OR(StudentTable[[#This Row],[Systolic BP (Final)]]>=StudentTable[[#This Row],[Quick SBP Check]],StudentTable[[#This Row],[Diastolic BP (Final)]]>=StudentTable[[#This Row],[Quick DBP Check]]),StudentTable[[#This Row],[BP Result]]=\"Normal\")","v":{"$error":"#N/A"}},{"$f":"IF(AND(StudentTable[[#This Row],[Systolic BP (Final)]]< 120,StudentTable[[#This Row],[Diastolic BP (Final)]]<80),\"Normal\",IF(AND(StudentTable[[#This Row],[Systolic BP (Final)]]>=120,StudentTable[[#This Row],[Systolic BP (Final)]]<=129,StudentTable[[#This Row],[Diastolic BP (Final)]]<80),\"Elevated BP\",IF(OR(AND(StudentTable[[#This Row],[Systolic BP (Final)]]>=130,StudentTable[[#This Row],[Systolic BP (Final)]]<=139),AND(StudentTable[[#This Row],[Diastolic BP (Final)]]>=80,StudentTable[[#This Row],[Diastolic BP (Final)]]<=89)),\"Stage 1 HT\",IF(OR(StudentTable[[#This Row],[Systolic BP (Final)]]>=140,StudentTable[[#This Row],[Diastolic BP (Final)]]>=90),\"Stage 2 HT\",\"Out of Range\"))))","v":"Stage 1 HT"},"Mr. Ramirez"]
[999,99,"Smith Co","Kennedy High School","2015-10-03",10,4041417,"A49","B49","C49","2010-10-03","F",47.3,181.2,106,59,"P","P","P","P","P",{"$f":"IFERROR(IF(OR(StudentTable[[#This Row],[Vision Exam]] = \"F\", StudentTable[[#This Row],[Hearing Exam]] = \"F\", StudentTable[[#This Row],[Scoliosis Exam]] = \"F\",StudentTable[[#This Row],[Dental Exam]]=\"F\", StudentTable[[#This Row],[Color Vision Exam]]=\"F\",NOT(OR(StudentTable[[#This Row],[Weight Category]] = \"Healthy Weight\",StudentTable[[#This Row],[Weight Category]] = \"\")), NOT(OR(StudentTable[[#This Row],[BP Category]] =\"Normal\",StudentTable[[#This Row],[BP Category]] =\"\"))),\"Yes\", \"No\"),\"\")","v":"Yes"},{"$nulls":7},{"$f":"IFERROR(StudentTable[[#This Row],[Weight (pounds)]]/(StudentTable[[#This Row],[Height (inches)]]^2)*703,\"\")","v":{"v":56.93656164377439,"d":"56.94"}},{"$f":"IF(StudentTable[[#This Row],[BMI]]=\"\",\"\",IFERROR(IF(StudentTable[[#This Row],[BMI]]<StudentTable[[#This Row],[BMI 5th Perc]],\"Underweight\",IF(AND(StudentTable[[#This Row],[BMI]]>=StudentTable[[#This Row],[BMI 5th Perc]],StudentTable[[#This Row],[BMI]]<StudentTable[[#This Row],[BMI 85th Perc]]),\"Healthy Weight\",IF(AND(StudentTable[[#This Row],[BMI]]>=StudentTable[[#This Row],[BMI 85th Perc]],StudentTable[[#This Row],[BMI]]<StudentTable[[#This Row],[BMI 95th Perc]]),\"Overweight\",IF(StudentTable[[#This Row],[BMI]]>=StudentTable[[#This Row],[BMI 95th Perc]],\"Obese\",\"Out-of-Bounds\")))),\"\"))","v":"Obese"},{"$f":"IF(StudentTable[[#This Row],[Systolic BP (Final)]]<>\"\",IF(StudentTable[[#This Row],[Systolic BP (Final)]]<StudentTable[[#This Row],[SBP 90th Perc]],0,IF(AND(StudentTable[[#This Row],[Systolic BP (Final)]]<StudentTable[[#This Row],[SBP 95th Perc]], StudentTable[[#This Row],[Systolic BP (Final)]]>=StudentTable[[#This Row],[SBP 90th Perc]]),1,IF(AND(StudentTable[[#This Row],[Systolic BP (Final)]]<StudentTable[[#This Row],[SBP 99th Perc]],StudentTable[[#This Row],[Systolic BP (Final)]]>=StudentTable[[#This Row],[SBP 95th Perc]]),2,IF(StudentTable[[#This Row],[Systolic BP (Final)]]>=StudentTable[[#This Row],[SBP 99th Perc]],3,\"\")))),\"\")","v":0},{"$f":"IF(StudentTable[[#This Row],[Diastolic BP (Final)]]<>\"\",IF(StudentTable[[#This Row],[Diastolic BP (Final)]]<StudentTable[[#This Row],[DBP 90th Perc]],0,IF(AND(StudentTable[[#This Row],[Diastolic BP (Final)]]<StudentTable[[#This Row],[DBP 95th Perc]], StudentTable[[#This Row],[Diastolic BP (Final)]]>=StudentTable[[#This Row],[DBP 90th Perc]]),1,IF(AND(StudentTable[[#This Row],[Diastolic BP (Final)]]<StudentTable[[#This Row],[DBP 99th Perc]],StudentTable[[#This Row],[Diastolic BP (Final)]]>=StudentTable[[#This Row],[DBP 95th Perc]]),2,IF(StudentTable[[#This Row],[Diastolic BP (Final)]]>=StudentTable[[#This Row],[DBP 99th Perc]],3,\"\")))),\"\")","v":0},{"$f":"IF(StudentTable[[#This Row],[Height (inches)]]=\"\",\"\",IF(StudentTable[[#This Row],[Systolic  Level]]<=StudentTable[[#This Row],[Diastolic Level]],StudentTable[Diastolic Level],StudentTable[Systolic  Level]))","v":0},{"$f":"IF(StudentTable[[#This Row],[Student Age]]>18,StudentTable[[#This Row],[Adult BP Measurement]],IF(OR(StudentTable[[#This Row],[Systolic BP (Final)]]>=StudentTable[[#This Row],[Quick SBP Check]],StudentTable[[#This Row],[Diastolic BP (Final)]]>=StudentTable[[#This Row],[Quick DBP Check]]),StudentTable[[#This Row],[BP Result]],\"Normal\"))","v":"Normal"},{"$f":"IFERROR(IF(StudentTable[[#This Row],[Gender]]=\"M\",VLOOKUP(ROUNDDOWN(YEARFRAC(StudentTable[[#This Row],[Exam Date]],StudentTable[[#This Row],[Date of Birth]],1)*12,1),BMITable!$A$3:$K$221,3,TRUE),IF(StudentTable[[#This Row],[Gender]]=\"F\",VLOOKUP(ROUNDDOWN(YEARFRAC(StudentTable[[#This Row],[Exam Date]],StudentTable[[#This Row],[Date of Birth]],1)*12,1),BMITable!$A$224:$K$442,3,TRUE),\"\")),\"\")","v":{"v":13.53336,"d":"13.53"}},{"$f":"IFERROR(IF(StudentTable[[#This Row],[Gender]]=\"M\",VLOOKUP(ROUNDDOWN(YEARFRAC(StudentTable[[#This Row],[Exam Date]],StudentTable[[#This Row],[Date of Birth]],1)*12,1),BMITable!$A$3:$K$221,8,TRUE),IF(StudentTable[[#This Row],[Gender]]=\"F\",VLOOKUP(ROUNDDOWN(YEARFRAC(StudentTable[[#This Row],[Exam Date]],StudentTable[[#This Row],[Date of Birth]],1)*12,1),BMITable!$A$224:$K$442,8,TRUE),\"\")),\"\")","v":{"v":16.78956,"d":"16.79"}},{"$f":"IFERROR(IF(StudentTable[[#This Row],[Gender]]=\"M\",VLOOKUP(ROUNDDOWN(YEARFRAC(StudentTable[[#This Row],[Exam Date]],StudentTable[[#This Row],[Date of Birth]],1)*12,1),BMITable!$A$3:$K$221,10,TRUE),IF(StudentTable[[#This Row],[Gender]]=\"F\",VLOOKUP(ROUNDDOWN(YEARFRAC(StudentTable[[#This Row],[Exam Date]],StudentTable[[#This Row],[Date of Birth]],1)*12,1),BMITable!$A$224:$K$442,10,TRUE),\"\")),\"\")","v":{"v":18.22355,"d":"18.22"}},{"$f":"IFERROR(IF(StudentTable[[#This Row],[Height (inches)]]<>\"\",HLOOKUP(StudentTable[[#This Row],[Height (inches)]],INDIRECT(StudentTable[[#This Row],[SBP Addy]]),2,TRUE),\"\"),\"\")","v":96},{"$f":"IFERROR(IF(StudentTable[[#This Row],[Height (inches)]]<>\"\",HLOOKUP(StudentTable[[#This Row],[Height (inches)]],INDIRECT(StudentTable[[#This Row],[SBP Addy]]),3,TRUE),\"\"),\"\")","v":110},{"$f":"IFERROR(IF(StudentTable[[#This Row],[Height (inches)]]<>\"\",HLOOKUP(StudentTable[[#This Row],[Height (inches)]],INDIRECT(StudentTable[[#This Row],[SBP Addy]]),4,TRUE),\"\"),\"\")","v":113},{"$f":"IFERROR(IF(StudentTable[[#This Row],[Height (inches)]]<>\"\",HLOOKUP(StudentTable[[#This Row],[Height (inches)]],INDIRECT(StudentTable[[#This Row],[SBP Addy]]),5,TRUE),\"\"),\"\")","v":125},{"$f":"IFERROR(IF(StudentTable[[#This Row],[Height (inches)]]<>\"\",HLOOKUP(StudentTable[[#This Row],[Height (inches)]],INDIRECT(StudentTable[[#This Row],[DBP Addy]]),2,TRUE),\"\"),\"\")","v":57},{"$f":"IFERROR(IF(StudentTable[[#This Row],[Height (inches)]]<>\"\",HLOOKUP(StudentTable[[#This Row],[Height (inches)]],INDIRECT(StudentTable[[#This Row],[DBP Addy]]),3,TRUE),\"\"),\"\")","v":69},{"$f":"IFERROR(IF(StudentTable[[#This Row],[Height (inches)]]<>\"\",HLOOKUP(StudentTable[[#This Row],[Height (inches)]],INDIRECT(StudentTable[[#This Row],[DBP Addy]]),4,TRUE),\"\"),\"\")","v":73},{"$f":"IFERROR(IF(StudentTable[[#This Row],[Height (inches)]]<>\"\",HLOOKUP(StudentTable[[#This Row],[Height (inches)]],INDIRECT(StudentTable[[#This Row],[DBP Addy]]),5,TRUE),\"\"),\"\")","v":85},{"$f":"IF(StudentTable[[#This Row],[Gender]]=\"M\",MATCH(ROUNDDOWN(YEARFRAC(StudentTable[[#This Row],[Exam Date]],StudentTable[[#This Row],[Date of Birth]]),0),'BP Lookup Table'!$A$3:$A$82,1)+ROW('BP Lookup Table'!$A$3:$A$82)-1,IF(StudentTable[[#This Row],[Gender]]=\"F\",MATCH(ROUNDDOWN(YEARFRAC(StudentTable[[#This Row],[Exam Date]],StudentTable[[#This Row],[Date of Birth]]),0),'BP Lookup Table'!$A$86:$A$161,1)+ROW('BP Lookup Table'!$A$86:$A$161)-1,\"\"))","v":101},{"$f":"IF(StudentTable[[#This Row],[BP Row]]<>\"\",\"'BP Lookup Table'!B\"&StudentTable[[#This Row],[BP Row]]&\":\"&\"I\"&StudentTable[[#This Row],[BP Row]]+4,\"\")","v":"'BP Lookup Table'!B101:I105"},{"$f":"IF(StudentTable[[#This Row],[BP Row]]<>\"\",\"'BP Lookup Table'!J\"&StudentTable[[#This Row],[BP Row]]&\":\"&\"Q\"&StudentTable[[#This Row],[BP Row]]+4,\"\")","v":"'BP Lookup Table'!J101:Q105"},{"$f":"ROUND(_xlfn.DAYS(StudentTable[[#This Row],[Exam Date]],StudentTable[[#This Row],[Date of Birth]])/365,0)","v":5},{"$f":"IF(StudentTable[[#This Row],[Gender]]=\"M\",INDEX('Simplified BP table'!$B$4:$B$21,MATCH(StudentTable[[#This Row],[Student Age]],'Simplified BP table'!$A$4:$A$21,0)),INDEX('Simplified BP table'!$D$4:$D$21,MATCH(StudentTable[[#This Row],[Student Age]],'Simplified BP table'!$A$4:$A$21,0)))","v":104},{"$f":"IF(StudentTable[[#This Row],[Gender]]=\"M\",INDEX('Simplified BP table'!$C$4:$C$21,MATCH(StudentTable[[#This Row],[Student Age]],'Simplified BP table'!$A$4:$A$21,0)),INDEX('Simplified BP table'!$E$4:$E$21,MATCH(StudentTable[[#This Row],[Student Age]],'Simplified BP table'!$A$4:$A$21,0)))","v":64},{"$f":"IF(StudentTable[[#This Row],[Student Age]]>=18,StudentTable[[#This Row],[Adult BP Measurement]],IF(StudentTable[[#This Row],[Height (inches)]]=\"\",\"Height Needed\",IFERROR(IF(StudentTable[[#This Row],[BP Final]]=0,\"Normal\",IF(StudentTable[[#This Row],[BP Final]]=1,\"Elevated BP\",IF(StudentTable[[#This Row],[BP Final]]=2,\"Stage 1 HT\",IF(StudentTable[[#This Row],[BP Final]]=3,\"Stage 2 HT\",\"Out of Range\")))),\"\")))","v":"Normal"},{"$f":"IF(OR(StudentTable[[#This Row],[Vision Exam]] = \"F\", StudentTable[[#This Row],[Hearing Exam]] = \"F\", StudentTable[[#This Row],[Scoliosis Exam]] = \"F\",StudentTable[[#This Row],[Dental Exam]]=\"F\", StudentTable[[#This Row],[Color Vision Exam]]=\"F\",StudentTable[[#This Row],[Weight Category]] <> \"Normal\", StudentTable[[#This Row],[BP Category]] <>\"Normal\"),\"Yes\", \"No\")","v":"Yes"},{"$f":"AND(OR(StudentTable[[#This Row],[Systolic BP (Final)]]>=StudentTable[[#This Row],[Quick SBP Check]],StudentTable[[#This Row],[Diastolic BP (Final)]]>=StudentTable[[#This Row],[Quick DBP Check]]),StudentTable[[#This Row],[BP Result]]=\"Normal\")","v":true},{"$f":"IF(AND(StudentTable[[#This Row],[Systolic BP (Final)]]< 120,StudentTable[[#This Row],[Diastolic BP (Final)]]<80),\"Normal\",IF(AND(StudentTable[[#This Row],[Systolic BP (Final)]]>=120,StudentTable[[#This Row],[Systolic BP (Final)]]<=129,StudentTable[[#This Row],[Diastolic BP (Final)]]<80),\"Elevated BP\",IF(OR(AND(StudentTable[[#This Row],[Systolic BP (Final)]]>=130,StudentTable[[#This Row],[Systolic BP (Final)]]<=139),AND(StudentTable[[#This Row],[Diastolic BP (Final)]]>=80,StudentTable[[#This Row],[Diastolic BP (Final)]]<=89)),\"Stage 1 HT\",IF(OR(StudentTable[[#This Row],[Systolic BP (Final)]]>=140,StudentTable[[#This Row],[Diastolic BP (Final)]]>=90),\"Stage 2 HT\",\"Out of Range\"))))","v":"Normal"},"Mr. Ramirez"]

{"sheet":"Referrals","index":2,"n_rows":1,"n_cols":50,"rows_kept":1}
["LEA Code","School Code","System Name","School Name","Exam Date","Grade Level","Student ID Number","Student Last Name","Student First Name","Student Middle Name","Date of Birth","Gender","Height (inches)","Weight (pounds)","Systolic BP (Final)","Diastolic BP (Final)","Vision Exam","Hearing Exam","Scoliosis Exam","Dental Exam","Color Vision Exam","Referral Req","Comments","15M PACER Laps","20M PACER Laps","Street Address","City","State","ZIP Code","BMI","Weight Category","BP Category","BMI 5th Perc","BMI 85th Perc","BMI 95th Perc","SBP 50th Perc","SBP 90th Perc","SBP 95th Perc","SBP 99th Perc","DBP 50th Perc","DBP 90th Perc","DBP 95th Perc","DBP 99th Perc","DBP 90th Perc2","DBP 95th Perc3","DBP 99th Perc4","BP Row","SBP Addy","DBP Addy","Referral Needed"]

{"sheet":"HealthFitnessLevel","index":3,"n_rows":16,"n_cols":11,"rows_kept":16,"hidden":true,"merged":[[0,0,0,3],[0,7,0,10],[2,1,6,3],[2,8,6,10]]}
["Girls",{"$nulls":6},"Boys"]
[null,"NI-Health Risk (<=)","NI (Between Values)","HFZ (>=)",{"$nulls":4},"NI-Health Risk (<=)","NI (Between Values)","HFZ (>=)"]
[5,"Completion of test. Lap count or time standards not recommended.",{"$nulls":5},5,"Completion of test. Lap count or time standards not recommended."]
[6,{"$nulls":6},6]
[7,{"$nulls":6},7]
[8,{"$nulls":6},8]
[9,{"$nulls":6},9]
[10,37.3,null,40.2,{"$nulls":3},10,37.3,null,40.2]
[11,37.3,null,40.2,{"$nulls":3},11,37.3,null,40.2]
[12,37,null,40.1,{"$nulls":3},12,37.6,null,40.3]
[13,36.6,null,39.7,{"$nulls":3},13,38.6,null,41.1]
[14,36.3,null,39.4,{"$nulls":3},14,39.6,null,42.5]
[15,36,null,39.1,{"$nulls":3},15,40.6,null,43.6]
[16,35.8,null,38.9,{"$nulls":3},16,41,null,44.1]
[17,35.7,null,38.8,{"$nulls":3},17,41.2,null,44.2]
[18,35.3,null,38.6,{"$nulls":3},18,41.2,null,44.3]

{"sheet":"Export_Data","index":4,"n_rows":0,"n_cols":0,"rows_kept":0}

{"sheet":"Reports","index":5,"n_rows":19,"n_cols":6,"rows_kept":19}
[]
["School Name","(All)",null,null,"School Name","(All)"]
[]
["Blood Pressure Category","Frequency",null,null,"Weight Category","Frequency"]
["Normal",1,null,null,"Underweight",1]
["Stage 2 HT",1,null,null,"Normal",1]
["Grand Total",2,null,null,"Grand Total",2]
{"$rows_empty":8}
["Count of Fitness Level","Column Labels"]
["Row Labels","Healthy Fitness Zone","Grand Total"]
["Westwood Elementary School",1,1]
["Grand Total",1,1]

{"sheet":"Report","index":6,"n_rows":52,"n_cols":10,"rows_kept":52,"merged":[[4,0,6,11],[7,0,10,11],[11,0,11,4],[11,6,11,11],[12,1,12,4],[13,1,13,4],[15,1,15,2],[16,1,18,4],[16,7,16,8],[19,0,19,4],[19,6,19,11],[20,0,26,4],[20,6,26,11],[27,0,27,4],[27,6,27,11],[29,6,32,11],[31,0,31,4],[32,0,32,4],[33,0,34,4],[33,6,33,10],[34,6,34,10],[35,6,35,10],[36,0,36,1],[36,2,36,4],[36,6,36,10],[37,2,38,4],[37,6,37,10],[38,6,38,10],[39,0,39,1],[39,2,39,4],[39,6,39,10],[40,6,40,10],[41,0,41,1],[41,2,41,4],[41,6,41,10],[42,6,42,10],[43,0,43,1],[43,2,43,4],[44,6,44,10],[45,0,45,1],[45,2,45,4],[45,6,46,10],[47,0,47,11],[48,0,49,10],[48,11,49,11],[51,0,51,4],[51,6,51,10]]}
[]
[]
[]
[]
["Student Health Report \n2022-2023 "]
[]
[]
["One of the primary functions of Coordinated School Health (CSH) is to address health related barriers to learning for (School District Name) students. CSH encourages vision, hearing, blood pressure (BP), and body mass index (BMI) screenings for grades K, 2, 4, 6, 8 and one year of high school. Screenings are not a medical diagnosis and should not be considered a physical examination. Students are encouraged to receive regular physical exams by a health care provider."]
[]
[]
[]
["Student Information",{"$nulls":5},"Basic Health Profile"]
["Name","B49 A49",{"$nulls":4},"Birth Date"," 10/3/2010","BP",{"$f":" B30 & \"/\" & B31","v":"106/59"}]
["School","Kennedy High School",{"$nulls":4},"Gender"," F","BMI",{"v":56.93656164377439,"d":"56.94"}]
["Grade",10,{"$nulls":4},"Weight"," 181.2 lbs."]
["School ID",4041417,{"$nulls":4},"Height"," 47.3 in."]
["Address","\r\n,  ",{"$nulls":4},"Exam Date"," 10/3/2015"]
[]
[]
["BP Screening",{"$nulls":5},"BMI Screening"]
["BP shows how hard the heart works to get blood to the body. High BP may indicate a health problem and high BP can lead to health problems later in life. Healthy BP for children and teens is dependent on age, sex, and height. *BP results are preliminary. If a student's BP is greater than or equal to the 90th percentile for the student's age/sex/height, they will be rescreened at school. If the average of the BP rescreens is greater than or equal to the 90th percentile, CSH will contact the parent/guardian and recommend the student be seen by a health care provider. ",{"$nulls":5},"BMI is calculated using weight and height measurements. BMI percentile is calculated using your child's weight and height and comparing it to children of the same age and sex.  Being underweight or overweight percentile may increase a child's risk of health problems. \nIt is important to understand that BMI does not diagnose your child with a weight problem. Only a health care provider can determine if your child's BMI-for-age is a problem. \n\n*Rarely, a child’s BMI may be high  because the child is very muscular. Being muscular does not increase health problems for children. "]
[]
[]
[]
[]
[]
[]
["BP Category",{"$nulls":5},"BMI Category"]
[{"$f":"\"Your Blood Pressure Reading is \" & B30 & \"/\" & B31 & \" mmHG\"","v":"Your Blood Pressure Reading is 106/59 mmHG"},{"$nulls":5},{"$f":"\"BMI for age is \" & ROUND(J14,2) & \" kg/m2\"","v":"BMI for age is 56.94 kg/m2"}]
["Systolic:",106,"mmHg",{"$nulls":3},{"$f":"IF(J14=\"\",\"No information available.\",\"If the student's BMI does not fall between \" & TRIM(MID(SUBSTITUTE(G38,\" \",REPT(\" \",LEN(G38))), (5-1)*LEN(G38)+1, LEN(G38))) & \" and \" & TRIM(MID(SUBSTITUTE(G38,\" \",REPT(\" \",LEN(G38))), (8-1)*LEN(G38)+1, LEN(G38))) & \", it is recommended you schedule a visit with your child's health care provider and share these results. \n\nResults do not mean that your child is underweight or overweight.\")","v":"If the student's BMI does not fall between 13.53 and 16.79, it is recommended you schedule a visit with your child's health care provider and share these results. \n\nResults do not mean that your child is underweight or overweight."}]
["Diastolic:",59,"mmHg"]
["Your BP Category is Normal"]
["The table below highlights where your child's BP falls according to the American Academy of Pediatrics. "]
[{"$f":" IF( OR(B30=\"\",B31=\"\"),\"No information available.\",\"If  the student's systolic BP is above \" & A45 & \" OR diastolic BP is above \" & B45 & \", then it is recommended that the student be seen by a health care provider and these results are shared with the provider. \")","v":"If  the student's systolic BP is above 110 OR diastolic BP is above 69, then it is recommended that the student be seen by a health care provider and these results are shared with the provider. "},{"$nulls":5},"The BMI suggests the student may be Obese"]
[]
[{"$nulls":6},"Is below 13.53"]
["BP",null,"BP Category"]
["Systolic","Diastolic",{"$nulls":4},"Is at OR above 13.53 but below 16.79"]
[]
[null,null,"Stage 2 Hypertension",{"$nulls":3},"Is at OR above 16.79 but below 18.22"]
[125,85]
[null,null,"Stage 1 Hypertension",{"$nulls":3},"Is at or above 18.22"]
[113,73]
[null,null,"Elevated"]
[110,69]
[null,null,"Normal"]
[]
["Additional Health Screenings"]
["P = Pass \nR = Recommend follow-up with health care provider and share these results."]
[]
["Hearing","P","Vision","P","Scoliosis","P","Oral Health","P","Color Vision","P"]
["*NOTE: NA indicates that no information is available."]

{"sheet":"BMITable","index":7,"n_rows":442,"n_cols":11,"rows_kept":442,"hidden":true,"merged":[[0,0,0,10],[221,0,221,10]]}
["Males, 2-20 years"]
["Age (in months)","3rd Percentile BMI Value","5th Percentile BMI Value","10th Percentile BMI Value","25th Percentile BMI Value","50th Percentile BMI Value","75th Percentile BMI Value","85th Percentile BMI Value","90th Percentile BMI Value","95th Percentile BMI Value","97th Percentile BMI Value"]
[24,14.52095,14.73732,15.09033,15.74164,16.57503,17.55719,18.16219,18.60948,19.33801,19.85986]
[24.5,14.50348,14.71929,15.07117,15.71963,16.54777,17.52129,18.11955,18.56111,19.2789,19.79194]
[25.5,14.46882,14.68361,15.03336,15.67634,16.49443,17.45135,18.03668,18.4673,19.16466,19.66102]
[26.5,14.4346,14.64843,14.9962,15.63403,16.4426,17.38384,17.957,18.37736,19.05567,19.53658]
[27.5,14.40083,14.61379,14.95969,15.59268,16.39224,17.31871,17.88047,18.29125,18.95187,19.41849]
[28.5,14.36755,14.57969,14.92385,15.55226,16.34334,17.25593,17.80704,18.20892,18.85317,19.30665]
[29.5,14.33478,14.54615,14.88866,15.51275,16.29584,17.19546,17.73667,18.13031,18.75949,19.20097]
[30.5,14.30257,14.51319,14.85414,15.47414,16.24972,17.13726,17.66932,18.05538,18.67078,19.10132]
[31.5,14.27093,14.48084,14.82027,15.43639,16.20495,17.0813,17.60495,17.98408,18.58695,19.00761]
[32.5,14.23989,14.44909,14.78707,15.39951,16.1615,17.02753,17.54351,17.91635,18.50792,18.91973]
[33.5,14.20948,14.41798,14.75453,15.36345,16.11933,16.97592,17.48496,17.85215,18.43363,18.83758]
[34.5,14.17972,14.3875,14.72264,15.32822,16.07843,16.92645,17.42927,17.79143,18.364,18.76106]
[35.5,14.15063,14.35767,14.69142,15.29379,16.03876,16.87907,17.37639,17.73414,18.29895,18.69006]
[36.5,14.12223,14.32851,14.66086,15.26016,16.0003,16.83376,17.32627,17.68022,18.23842,18.62449]
[37.5,14.09453,14.30002,14.63096,15.22731,15.96304,16.79048,17.27889,17.62963,18.18231,18.56425]
[38.5,14.06756,14.27222,14.60173,15.19523,15.92695,16.7492,17.23419,17.58231,18.13057,18.50924]
[39.5,14.04132,14.2451,14.57316,15.16392,15.89203,16.70988,17.19213,17.5382,18.08311,18.45938]
[40.5,14.01582,14.21868,14.54527,15.13337,15.85824,16.67251,17.15266,17.49725,18.03986,18.41456]
[41.5,13.99107,14.19297,14.51805,15.10359,15.82559,16.63704,17.11575,17.45941,18.00074,18.37469]
[42.5,13.96707,14.16796,14.49151,15.07458,15.79406,16.60345,17.08135,17.42462,17.96568,18.33969]
[43.5,13.94383,14.14367,14.46566,15.04633,15.76364,16.5717,17.04941,17.39282,17.93459,18.30947]
[44.5,13.92133,14.12009,14.4405,15.01886,15.73434,16.54177,17.01988,17.36395,17.90741,18.28393]
[45.5,13.89959,14.09723,14.41604,14.99218,15.70614,16.51364,16.99272,17.33795,17.88405,18.263]
[46.5,13.87858,14.07509,14.39229,14.96629,15.67904,16.48726,16.96789,17.31477,17.86444,18.24658]
[47.5,13.85832,14.05366,14.36926,14.9412,15.65305,16.46262,16.94533,17.29434,17.8485,18.23459]
[48.5,13.83877,14.03296,14.34695,14.91694,15.62817,16.4397,16.92501,17.27661,17.83614,18.22694]
[49.5,13.81995,14.01296,14.32537,14.89351,15.60441,16.41846,16.90688,17.26151,17.8273,18.22354]
[50.5,13.80182,13.99367,14.30453,14.87093,15.58176,16.39889,16.89089,17.24899,17.82189,18.22431]
[51.5,13.78439,13.97509,14.28444,14.84921,15.56025,16.38097,16.87701,17.23899,17.81983,18.22915]
[52.5,13.76763,13.95722,14.2651,14.82838,15.53987,16.36468,16.86519,17.23145,17.82104,18.23799]
[53.5,13.75152,13.94003,14.24651,14.80844,15.52065,16.35001,16.8554,17.22632,17.82544,18.25071]
[54.5,13.73606,13.92353,14.22868,14.78941,15.50258,16.33693,16.8476,17.22354,17.83295,18.26725]
[55.5,13.72123,13.90771,14.21162,14.7713,15.48569,16.32545,16.84176,17.22306,17.84349,18.2875]
[56.5,13.70702,13.89257,14.19532,14.75414,15.46998,16.31554,16.83784,17.22483,17.85699,18.31136]
[57.5,13.6934,13.87809,14.17979,14.73792,15.45546,16.3072,16.8358,17.2288,17.87335,18.33875]
[58.5,13.68036,13.86426,14.16503,14.72266,15.44214,16.30042,16.83563,17.23493,17.89252,18.36957]
[59.5,13.6679,13.85108,14.15103,14.70836,15.43003,16.29518,16.83729,17.24315,17.9144,18.40373]
[60.5,13.656,13.83855,14.1378,14.69504,15.41914,16.29148,16.84076,17.25344,17.93893,18.44112]
[61.5,13.64464,13.82665,14.12534,14.68269,15.40947,16.28932,16.846,17.26575,17.96602,18.48166]
[62.5,13.63383,13.81537,14.11363,14.67133,15.40103,16.28868,16.853,17.28003,17.99562,18.52525]
[63.5,13.62355,13.80472,14.10268,14.66094,15.39382,16.28955,16.86173,17.29625,18.02764,18.57179]
[64.5,13.61379,13.79469,14.09249,14.65154,15.38783,16.29192,16.87217,17.31437,18.06201,18.6212]
[65.5,13.60456,13.78527,14.08305,14.64312,15.38307,16.29578,16.88428,17.33435,18.09868,18.67337]
[66.5,13.59584,13.77646,14.07436,14.63567,15.37953,16.30113,16.89805,17.35616,18.13758,18.72823]
[67.5,13.58764,13.76825,14.06642,14.6292,15.37721,16.30794,16.91346,17.37975,18.17863,18.78569]
[68.5,13.57996,13.76065,14.05921,14.62369,15.37609,16.3162,16.93048,17.4051,18.22179,18.84564]
[69.5,13.57278,13.75364,14.05274,14.61914,15.37618,16.3259,16.94909,17.43217,18.26698,18.90802]
[70.5,13.56612,13.74724,14.04701,14.61555,15.37745,16.33702,16.96925,17.46092,18.31416,18.97273]
[71.5,13.55998,13.74144,14.042,14.6129,15.37991,16.34955,16.99096,17.49133,18.36325,19.03969]
[72.5,13.55435,13.73624,14.03772,14.6112,15.38353,16.36346,17.01418,17.52335,18.41421,19.10882]
[73.5,13.54925,13.73164,14.03417,14.61042,15.38831,16.37875,17.03888,17.55696,18.46699,19.18005]
[74.5,13.54467,13.72764,14.03134,14.61057,15.39423,16.39537,17.06505,17.59212,18.52152,19.25329]
[75.5,13.54062,13.72424,14.02922,14.61163,15.40127,16.41333,17.09265,17.6288,18.57775,19.32847]
[76.5,13.5371,13.72145,14.02783,14.61359,15.40943,16.4326,17.12166,17.66696,18.63564,19.40551]
[77.5,13.53412,13.71927,14.02714,14.61645,15.41869,16.45315,17.15206,17.70658,18.69513,19.48434]
[78.5,13.53168,13.71769,14.02717,14.6202,15.42902,16.47496,17.1838,17.74762,18.75617,19.5649]
[79.5,13.5298,13.71672,14.02791,14.62483,15.44042,16.49801,17.21688,17.79004,18.81872,19.6471]
[80.5,13.52846,13.71637,14.02935,14.63032,15.45288,16.52229,17.25126,17.83382,18.88272,19.73089]
[81.5,13.52768,13.71663,14.0315,14.63668,15.46636,16.54776,17.28691,17.87892,18.94814,19.81619]
[82.5,13.52747,13.71751,14.03435,14.64389,15.48087,16.5744,17.3238,17.92532,19.01491,19.90294]
[83.5,13.52782,13.71901,14.03791,14.65194,15.49637,16.60219,17.36192,17.97296,19.083,19.99107]
[84.5,13.52874,13.72113,14.04216,14.66082,15.51287,16.63112,17.40122,18.02183,19.15236,20.08052]
[85.5,13.53025,13.72387,14.04711,14.67054,15.53034,16.66114,17.44168,18.0719,19.22295,20.17123]
[86.5,13.53233,13.72724,14.05276,14.68107,15.54876,16.69225,17.48329,18.12312,19.29471,20.26314]
[87.5,13.535,13.73124,14.0591,14.69241,15.56812,16.72442,17.52599,18.17548,19.36761,20.35618]
[88.5,13.53826,13.73587,14.06613,14.70455,15.58841,16.75763,17.56978,18.22893,19.44161,20.45031]
[89.5,13.54212,13.74113,14.07386,14.71749,15.60961,16.79185,17.61462,18.28344,19.51666,20.54545]
[90.5,13.54657,13.74702,14.08228,14.73121,15.63171,16.82707,17.66049,18.33899,19.59272,20.64155]
[91.5,13.55163,13.75355,14.09138,14.74571,15.65469,16.86325,17.70736,18.39554,19.66974,20.73856]
[92.5,13.55729,13.76071,14.10116,14.76099,15.67853,16.90039,17.7552,18.45306,19.74769,20.83643]
[93.5,13.56356,13.76852,14.11163,14.77703,15.70323,16.93845,17.80398,18.51152,19.82652,20.93509]
[94.5,13.57044,13.77695,14.12279,14.79382,15.72877,16.97742,17.85369,18.57089,19.9062,21.03449]
[95.5,13.57793,13.78603,14.13462,14.81136,15.75513,17.01727,17.90429,18.63115,19.98668,21.13459]
[96.5,13.58604,13.79575,14.14712,14.82965,15.78231,17.05799,17.95575,18.69225,20.06793,21.23532]
[97.5,13.59477,13.8061,14.1603,14.84867,15.81029,17.09955,18.00807,18.75418,20.1499,21.33665]
[98.5,13.60411,13.8171,14.17416,14.86841,15.83905,17.14193,18.0612,18.8169,20.23256,21.43852]
[99.5,13.61408,13.82873,14.18868,14.88888,15.86858,17.18512,18.11512,18.88038,20.31587,21.54088]
[100.5,13.62467,13.84101,14.20387,14.91006,15.89888,17.22909,18.16981,18.94459,20.39979,21.64368]
[101.5,13.63588,13.85392,14.21972,14.93194,15.92992,17.27383,18.22525,19.00952,20.48429,21.74689]
[102.5,13.64771,13.86747,14.23624,14.95453,15.96169,17.31932,18.28141,19.07512,20.56933,21.85044]
[103.5,13.66017,13.88166,14.25341,14.9778,15.99419,17.36552,18.33827,19.14137,20.65487,21.9543]
[104.5,13.67325,13.89648,14.27124,15.00176,16.02741,17.41244,18.3958,19.20825,20.74089,22.05842]
[105.5,13.68696,13.91194,14.28972,15.0264,16.06132,17.46005,18.45398,19.27573,20.82733,22.16276]
[106.5,13.70129,13.92804,14.30884,15.05172,16.09591,17.50833,18.5128,19.34378,20.91417,22.26727]
[107.5,13.71624,13.94476,14.32862,15.07769,16.13119,17.55726,18.57222,19.41238,21.00138,22.37192]
[108.5,13.73182,13.96212,14.34903,15.10433,16.16712,17.60683,18.63222,19.48149,21.08893,22.47666]
[109.5,13.74801,13.9801,14.37008,15.13161,16.20371,17.65702,18.69279,19.5511,21.17677,22.58145]
[110.5,13.76483,13.99871,14.39177,15.15954,16.24094,17.7078,18.7539,19.62118,21.26488,22.68625]
[111.5,13.78227,14.01795,14.41409,15.1881,16.2788,17.75918,18.81554,19.69171,21.35323,22.79103]
[112.5,13.80033,14.0378,14.43703,15.2173,16.31728,17.81112,18.87767,19.76266,21.44178,22.89575]
[113.5,13.819,14.05828,14.46059,15.24712,16.35637,17.86361,18.94028,19.83401,21.53051,23.00036]
[114.5,13.83828,14.07937,14.48478,15.27755,16.39606,17.91664,19.00336,19.90573,21.61938,23.10484]
[115.5,13.85818,14.10107,14.50957,15.30859,16.43633,17.9702,19.06688,19.97781,21.70837,23.20915]
[116.5,13.87868,14.12338,14.53498,15.34024,16.47718,18.02425,19.13081,20.05021,21.79745,23.31326]
[117.5,13.89979,14.1463,14.56099,15.37248,16.5186,18.07879,19.19516,20.12292,21.88659,23.41712]
[118.5,13.92151,14.16982,14.5876,15.40531,16.56057,18.13381,19.25988,20.19592,21.97576,23.52071]
[119.5,13.94382,14.19394,14.61481,15.43872,16.60309,18.18929,19.32497,20.26919,22.06494,23.624]
[120.5,13.96673,14.21866,14.6426,15.4727,16.64614,18.24521,19.39041,20.3427,22.15409,23.72696]
[121.5,13.99024,14.24396,14.67098,15.50725,16.68972,18.30156,19.45618,20.41643,22.2432,23.82955]
[122.5,14.01433,14.26985,14.69994,15.54236,16.73381,18.35833,19.52226,20.49036,22.33224,23.93175]
[123.5,14.03901,14.29633,14.72948,15.57803,16.7784,18.4155,19.58864,20.56448,22.42118,24.03353]
[124.5,14.06427,14.32338,14.75958,15.61424,16.8235,18.47306,19.6553,20.63877,22.51,24.13486]
[125.5,14.09011,14.35101,14.79025,15.65099,16.86907,18.53099,19.72222,20.7132,22.59868,24.23571]
[126.5,14.11653,14.3792,14.82148,15.68826,16.91512,18.58928,19.78938,20.78775,22.68719,24.33606]
[127.5,14.14351,14.40796,14.85326,15.72607,16.96164,18.64792,19.85678,20.86242,22.77551,24.43589]
[128.5,14.17106,14.43727,14.88558,15.76439,17.00862,18.70689,19.92439,20.93718,22.86363,24.53516]
[129.5,14.19916,14.46714,14.91845,15.80322,17.05604,18.76619,19.9922,21.01201,22.95151,24.63386]
[130.5,14.22782,14.49756,14.95184,15.84255,17.1039,18.82579,20.06019,21.0869,23.03915,24.73197]
[131.5,14.25703,14.52852,14.98577,15.88237,17.15218,18.8857,20.12835,21.16183,23.12651,24.82945]
[132.5,14.28678,14.56001,15.02022,15.92268,17.20089,18.94588,20.19667,21.23679,23.21358,24.9263]
[133.5,14.31707,14.59203,15.05519,15.96347,17.25,19.00634,20.26514,21.31175,23.30035,25.02249]
[134.5,14.34789,14.62458,15.09066,16.00473,17.29951,19.06706,20.33373,21.38671,23.38679,25.11801]
[135.5,14.37924,14.65765,15.12664,16.04646,17.34942,19.12803,20.40243,21.46165,23.47289,25.21283]
[136.5,14.41111,14.69122,15.16311,16.08864,17.3997,19.18924,20.47124,21.53655,23.55863,25.30693]
[137.5,14.44349,14.72531,15.20007,16.13127,17.45036,19.25067,20.54013,21.61141,23.644,25.40031]
[138.5,14.47638,14.75989,15.23751,16.17434,17.50138,19.31232,20.6091,21.6862,23.72897,25.49294]
[139.5,14.50977,14.79496,15.27543,16.21784,17.55276,19.37417,20.67814,21.76091,23.81354,25.58481]
[140.5,14.54365,14.83052,15.31381,16.26177,17.60448,19.43622,20.74722,21.83554,23.89769,25.67591]
[141.5,14.57802,14.86655,15.35265,16.30612,17.65653,19.49845,20.81635,21.91006,23.98141,25.76623]
[142.5,14.61287,14.90306,15.39195,16.35087,17.70892,19.56086,20.88551,21.98447,24.06469,25.85575]
[143.5,14.64819,14.94002,15.43169,16.39603,17.76162,19.62342,20.95468,22.05876,24.1475,25.94446]
[144.5,14.68398,14.97745,15.47187,16.44158,17.81463,19.68614,21.02386,22.1329,24.22985,26.03234]
[145.5,14.72022,15.01532,15.51248,16.48751,17.86795,19.74901,21.09304,22.2069,24.31172,26.11941]
[146.5,14.75692,15.05363,15.5535,16.53382,17.92155,19.812,21.1622,22.28075,24.3931,26.20563]
[147.5,14.79406,15.09238,15.59495,16.5805,17.97544,19.87512,21.23134,22.35442,24.47397,26.29101]
[148.5,14.83163,15.13155,15.6368,16.62754,18.02961,19.93836,21.30045,22.42791,24.55434,26.37553]
[149.5,14.86963,15.17113,15.67904,16.67494,18.08404,20.0017,21.36951,22.50122,24.6342,26.4592]
[150.5,14.90804,15.21113,15.72168,16.72267,18.13873,20.06514,21.43852,22.57433,24.71352,26.54201]
[151.5,14.94687,15.25152,15.7647,16.77074,18.19367,20.12866,21.50748,22.64724,24.79232,26.62395]
[152.5,14.98609,15.2923,15.80809,16.81914,18.24884,20.19227,21.57636,22.71993,24.87058,26.70501]
[153.5,15.02571,15.33347,15.85184,16.86786,18.30426,20.25594,21.64517,22.7924,24.94829,26.78521]
[154.5,15.06571,15.37501,15.89595,16.91689,18.35989,20.31968,21.71389,22.86465,25.02545,26.86453]
[155.5,15.10609,15.41692,15.94041,16.96621,18.41574,20.38347,21.78252,22.93666,25.10206,26.94297]
[156.5,15.14683,15.45918,15.9852,17.01583,18.4718,20.44731,21.85104,23.00842,25.17811,27.02054]
[157.5,15.18793,15.50179,16.03032,17.06574,18.52805,20.51119,21.91946,23.07994,25.2536,27.09724]
[158.5,15.22938,15.54474,16.07576,17.11592,18.5845,20.5751,21.98777,23.15121,25.32853,27.17307]
[159.5,15.27116,15.58801,16.12151,17.16636,18.64113,20.63903,22.05596,23.22221,25.40289,27.24802]
[160.5,15.31327,15.63161,16.16756,17.21706,18.69793,20.70298,22.12402,23.29295,25.47668,27.32211]
[161.5,15.3557,15.67551,16.21391,17.26801,18.75489,20.76694,22.19194,23.36342,25.5499,27.39534]
[162.5,15.39843,15.71971,16.26054,17.3192,18.81202,20.8309,22.25973,23.43362,25.62256,27.46771]
[163.5,15.44147,15.7642,16.30743,17.37062,18.86929,20.89486,22.32737,23.50354,25.69464,27.53924]
[164.5,15.48479,15.80897,16.3546,17.42227,18.9267,20.9588,22.39487,23.57318,25.76616,27.60992]
[165.5,15.52839,15.85401,16.40201,17.47412,18.98424,21.02272,22.46221,23.64253,25.83712,27.67977]
[166.5,15.57226,15.89931,16.44967,17.52618,19.04191,21.08663,22.52939,23.7116,25.90751,27.74879]
[167.5,15.61638,15.94486,16.49756,17.57843,19.0997,21.15049,22.5964,23.78038,25.97734,27.817]
[168.5,15.66076,15.99065,16.54568,17.63086,19.15759,21.21433,22.66325,23.84887,26.04662,27.88441]
[169.5,15.70536,16.03667,16.594,17.68347,19.21558,21.27811,22.72993,23.91706,26.11535,27.95102]
[170.5,15.75019,16.0829,16.64254,17.73624,19.27366,21.34185,22.79643,23.98496,26.18353,28.01686]
[171.5,15.79524,16.12934,16.69126,17.78917,19.33182,21.40554,22.86275,24.05257,26.25117,28.08193]
[172.5,15.84049,16.17598,16.74017,17.84225,19.39006,21.46916,22.92889,24.11987,26.31828,28.14624]
[173.5,15.88593,16.2228,16.78924,17.89546,19.44837,21.53272,22.99485,24.18689,26.38485,28.20983]
[174.5,15.93155,16.2698,16.83848,17.9488,19.50673,21.5962,23.06062,24.25361,26.45091,28.27269]
[175.5,15.97734,16.31696,16.88787,18.00225,19.56514,21.65961,23.12619,24.32003,26.51646,28.33484]
[176.5,16.02329,16.36427,16.9374,18.05581,19.6236,21.72294,23.19158,24.38616,26.58151,28.39632]
[177.5,16.06939,16.41172,16.98706,18.10947,19.68208,21.78618,23.25677,24.452,26.64606,28.45712]
[178.5,16.11562,16.4593,17.03683,18.16322,19.7406,21.84932,23.32177,24.51755,26.71014,28.51728]
[179.5,16.16198,16.507,17.08672,18.21704,19.79912,21.91237,23.38657,24.58281,26.77374,28.57682]
[180.5,16.20844,16.55481,17.1367,18.27093,19.85766,21.97532,23.45117,24.64778,26.83688,28.63575]
[181.5,16.25501,16.60271,17.18676,18.32488,19.9162,22.03816,23.51557,24.71247,26.89958,28.6941]
[182.5,16.30166,16.6507,17.23689,18.37887,19.97473,22.10089,23.57978,24.77688,26.96184,28.75189]
[183.5,16.34839,16.69875,17.28709,18.4329,20.03324,22.1635,23.64378,24.84102,27.02368,28.80915]
[184.5,16.39519,16.74687,17.33734,18.48696,20.09172,22.226,23.70758,24.90489,27.08511,28.8659]
[185.5,16.44203,16.79503,17.38763,18.54102,20.15017,22.28837,23.77119,24.96848,27.14616,28.92217]
[186.5,16.48892,16.84323,17.43794,18.5951,20.20858,22.35061,23.83459,25.03182,27.20683,28.97798]
[187.5,16.53583,16.89146,17.48827,18.64916,20.26694,22.41272,23.89779,25.0949,27.26714,29.03337]
[188.5,16.58276,16.93969,17.53861,18.70321,20.32524,22.47469,23.9608,25.15773,27.3271,29.08835]
[189.5,16.62969,16.98792,17.58893,18.75723,20.38346,22.53652,24.02361,25.22032,27.38675,29.14297]
[190.5,16.67661,17.03615,17.63924,18.81121,20.44162,22.59821,24.08622,25.28267,27.44609,29.19725]
[191.5,16.72351,17.08434,17.68951,18.86514,20.49968,22.65976,24.14864,25.34478,27.50514,29.25123]
[192.5,16.77038,17.1325,17.73974,18.919,20.55765,22.72115,24.21087,25.40668,27.56393,29.30493]
[193.5,16.8172,17.18061,17.78991,18.97279,20.61551,22.78239,24.27291,25.46835,27.62247,29.35838]
[194.5,16.86396,17.22865,17.84001,19.0265,20.67326,22.84346,24.33476,25.52982,27.68078,29.41164]
[195.5,16.91065,17.27662,17.89003,19.08011,20.73089,22.90438,24.39642,25.59109,27.7389,29.46472]
[196.5,16.95725,17.3245,17.93995,19.13361,20.78839,22.96514,24.4579,25.65217,27.79683,29.51767]
[197.5,17.00375,17.37229,17.98977,19.187,20.84574,23.02572,24.5192,25.71306,27.85461,29.57051]
[198.5,17.05015,17.41995,18.03947,19.24025,20.90294,23.08614,24.58033,25.77379,27.91225,29.6233]
[199.5,17.09642,17.46749,18.08904,19.29335,20.95999,23.14638,24.64128,25.83436,27.96979,29.67606]
[200.5,17.14256,17.51489,18.13846,19.3463,21.01686,23.20645,24.70207,25.89477,28.02724,29.72885]
[201.5,17.18854,17.56214,18.18773,19.39908,21.07356,23.26633,24.76269,25.95504,28.08464,29.78169]
[202.5,17.23437,17.60923,18.23682,19.45168,21.13007,23.32604,24.82315,26.01519,28.142,29.83463]
[203.5,17.28002,17.65613,18.28573,19.50409,21.18638,23.38556,24.88346,26.07522,28.19937,29.88771]
[204.5,17.32548,17.70284,18.33444,19.55629,21.24248,23.4449,24.94362,26.13515,28.25676,29.94097]
[205.5,17.37074,17.74935,18.38294,19.60827,21.29836,23.50404,25.00363,26.19498,28.3142,29.99447]
[206.5,17.41579,17.79564,18.43121,19.66002,21.35402,23.563,25.0635,26.25474,28.37173,30.04824]
[207.5,17.46061,17.8417,18.47925,19.71153,21.40944,23.62176,25.12324,26.31443,28.42937,30.10232]
[208.5,17.50518,17.88751,18.52703,19.76278,21.46461,23.68033,25.18286,26.37407,28.48716,30.15677]
[209.5,17.54951,17.93306,18.57455,19.81376,21.51952,23.7387,25.24235,26.43368,28.54513,30.21164]
[210.5,17.59356,17.97834,18.62179,19.86445,21.57417,23.79687,25.30173,26.49326,28.6033,30.26696]
[211.5,17.63734,18.02333,18.66873,19.91485,21.62854,23.85484,25.361,26.55284,28.66171,30.3228]
[212.5,17.68082,18.06802,18.71537,19.96493,21.68262,23.91261,25.42017,26.61243,28.72041,30.3792]
[213.5,17.72399,18.11239,18.76168,20.01469,21.7364,23.97018,25.47925,26.67204,28.77941,30.4362]
[214.5,17.76683,18.15644,18.80766,20.06412,21.78988,24.02754,25.53824,26.73169,28.83875,30.49387]
[215.5,17.80934,18.20014,18.85328,20.11319,21.84304,24.0847,25.59716,26.79141,28.89848,30.55225]
[216.5,17.8515,18.24349,18.89854,20.1619,21.89587,24.14166,25.65601,26.8512,28.95862,30.6114]
[217.5,17.89329,18.28646,18.94342,20.21022,21.94836,24.19841,25.71481,26.91109,29.01921,30.67137]
[218.5,17.93471,18.32904,18.98791,20.25816,22.00051,24.25495,25.77355,26.97108,29.0803,30.73222]
[219.5,17.97573,18.37122,19.03198,20.30569,22.05229,24.31129,25.83225,27.03121,29.14191,30.794]
[220.5,18.01634,18.41299,19.07563,20.35279,22.10371,24.36742,25.89093,27.09149,29.20409,30.85677]
[221.5,18.05652,18.45432,19.11884,20.39947,22.15476,24.42335,25.94958,27.15194,29.26687,30.92058]
[222.5,18.09626,18.4952,19.16159,20.44569,22.20541,24.47907,26.00823,27.21259,29.3303,30.9855]
[223.5,18.13555,18.53562,19.20387,20.49145,22.25567,24.53459,26.06687,27.27344,29.39442,31.05158]
[224.5,18.17437,18.57556,19.24567,20.53674,22.30553,24.58991,26.12553,27.33452,29.45926,31.11888]
[225.5,18.2127,18.615,19.28696,20.58153,22.35497,24.64502,26.18422,27.39585,29.52487,31.18746]
[226.5,18.25052,18.65393,19.32773,20.62582,22.40399,24.69994,26.24294,27.45746,29.5913,31.25739]
[227.5,18.28782,18.69233,19.36797,20.66959,22.45257,24.75466,26.30171,27.51936,29.65857,31.32872]
[228.5,18.32459,18.73019,19.40766,20.71283,22.50072,24.80919,26.36054,27.58159,29.72674,31.40152]
[229.5,18.3608,18.76748,19.44678,20.75552,22.54841,24.86352,26.41945,27.64415,29.79585,31.47585]
[230.5,18.39643,18.8042,19.48531,20.79766,22.59565,24.91767,26.47844,27.70707,29.86595,31.55178]
[231.5,18.43148,18.84031,19.52325,20.83922,22.64243,24.97163,26.53753,27.77039,29.93707,31.62937]
[232.5,18.46591,18.87581,19.56057,20.88019,22.68873,25.02542,26.59675,27.83411,30.00927,31.70868]
[233.5,18.49972,18.91068,19.59726,20.92056,22.73456,25.07902,26.65609,27.89828,30.08258,31.78979]
[234.5,18.53287,18.94489,19.6333,20.96032,22.7799,25.13246,26.71558,27.9629,30.15706,31.87275]
[235.5,18.56536,18.97844,19.66867,20.99946,22.82474,25.18572,26.77522,28.02801,30.23276,31.95764]
[236.5,18.59716,19.01129,19.70335,21.03795,22.86909,25.23883,26.83505,28.09363,30.30971,32.04453]
[237.5,18.62825,19.04343,19.73733,21.07579,22.91293,25.29179,26.89507,28.15978,30.38797,32.13348]
[238.5,18.65861,19.07484,19.7706,21.11296,22.95626,25.34459,26.9553,28.2265,30.46758,32.22457]
[239.5,18.68822,19.10551,19.80312,21.14946,22.99908,25.39725,27.01575,28.29381,30.54859,32.31787]
[240,18.70274,19.12055,19.8191,21.16745,23.02029,25.42353,27.04607,28.3277,30.58964,32.36537]
[240.5,18.71706,19.1354,19.83489,21.18526,23.04138,25.44978,27.07645,28.36174,30.63106,32.41344]
["Females, 2-20 years"]
["Age (in months)","3rd Percentile BMI Value","5th Percentile BMI Value","10th Percentile BMI Value","25th Percentile BMI Value","50th Percentile BMI Value","75th Percentile BMI Value","85th Percentile BMI Value","90th Percentile BMI Value","95th Percentile BMI Value","97th Percentile BMI Value"]
[24,14.14735,14.39787,14.80134,15.52808,16.4234,17.42746,18.01821,18.44139,19.10624,19.56411]
[24.5,14.13226,14.38019,14.77965,15.49976,16.38804,17.38582,17.97371,18.39526,19.05824,19.51534]
[25.5,14.10241,14.34527,14.73695,15.44422,16.31897,17.30485,17.88749,18.30611,18.96595,19.42198]
[26.5,14.07297,14.31097,14.69516,15.39015,16.25208,17.22693,17.80489,18.22103,18.87853,19.3341]
[27.5,14.04396,14.27728,14.65429,15.33754,16.18735,17.15202,17.72586,18.13997,18.79591,19.25163]
[28.5,14.01538,14.2442,14.61434,15.2864,16.12475,17.08009,17.65035,18.06285,18.718,19.17448]
[29.5,13.98723,14.21175,14.57531,15.23671,16.06429,17.01107,17.5783,17.98962,18.64472,19.10255]
[30.5,13.9595,14.17992,14.5372,15.18848,16.00593,16.94495,17.50965,17.92019,18.57599,19.03578]
[31.5,13.93221,14.14871,14.50003,15.14171,15.94967,16.88168,17.44435,17.85452,18.51173,18.97407]
[32.5,13.90536,14.11813,14.46378,15.09638,15.89548,16.82123,17.38235,17.79253,18.45187,18.91733]
[33.5,13.87893,14.08818,14.42846,15.0525,15.84336,16.76355,17.3236,17.73416,18.39632,18.86548]
[34.5,13.85295,14.05885,14.39406,15.01007,15.79329,16.70862,17.26804,17.67936,18.345,18.81843]
[35.5,13.82741,14.03016,14.3606,14.96907,15.74526,16.65641,17.21564,17.62805,18.29784,18.77609]
[36.5,13.8023,14.00209,14.32806,14.9295,15.69924,16.60687,17.16634,17.58019,18.25475,18.73838]
[37.5,13.77763,13.97466,14.29645,14.89136,15.65523,16.55998,17.12009,17.53571,18.21567,18.7052]
[38.5,13.75341,13.94786,14.26576,14.85465,15.61321,16.5157,17.07685,17.49455,18.18051,18.67647]
[39.5,13.72964,13.92169,14.23599,14.81934,15.57317,16.474,17.03658,17.45667,18.14919,18.6521]
[40.5,13.70631,13.89615,14.20714,14.78544,15.53508,16.43486,16.99923,17.422,18.12165,18.632]
[41.5,13.68343,13.87124,14.1792,14.75293,15.49893,16.39824,16.96476,17.39049,18.09781,18.61608]
[42.5,13.66101,13.84697,14.15218,14.7218,15.4647,16.36411,16.93312,17.3621,18.07759,18.60425]
[43.5,13.63905,13.82333,14.12606,14.69205,15.43238,16.33244,16.90428,17.33676,18.06093,18.59643]
[44.5,13.61756,13.80033,14.10084,14.66365,15.40193,16.3032,16.8782,17.31442,18.04775,18.59253]
[45.5,13.59654,13.77796,14.07653,14.63661,15.37335,16.27636,16.85483,17.29505,18.03799,18.59246]
[46.5,13.57599,13.75624,14.05311,14.61091,15.34661,16.25188,16.83413,17.27858,18.03158,18.59614]
[47.5,13.55592,13.73516,14.03059,14.58652,15.32168,16.22973,16.81606,17.26497,18.02844,18.60348]
[48.5,13.53635,13.71472,14.00895,14.56345,15.29855,16.20988,16.80058,17.25417,18.02851,18.61441]
[49.5,13.51728,13.69493,13.9882,14.54167,15.27719,16.19229,16.78765,17.24613,18.03174,18.62883]
[50.5,13.4987,13.67579,13.96833,14.52117,15.25757,16.17693,16.77723,17.24081,18.03805,18.64667]
[51.5,13.48065,13.65731,13.94933,14.50194,15.23967,16.16378,16.76927,17.23815,18.04738,18.66785]
[52.5,13.46311,13.63948,13.93121,14.48396,15.22347,16.15278,16.76375,17.23811,18.05967,18.69229]
[53.5,13.4461,13.62231,13.91396,14.46721,15.20894,16.14391,16.7606,17.24065,18.07486,18.71992]
[54.5,13.42963,13.6058,13.89757,14.45169,15.19606,16.13714,16.75981,17.24571,18.09289,18.75065]
[55.5,13.4137,13.58997,13.88205,14.43738,15.1848,16.13242,16.76132,17.25326,18.1137,18.78441]
[56.5,13.39833,13.5748,13.86739,14.42427,15.17513,16.12972,16.76509,17.26324,18.13722,18.82113]
[57.5,13.38352,13.56031,13.85358,14.41233,15.16703,16.12901,16.77108,17.2756,18.16341,18.86074]
[58.5,13.36927,13.54649,13.84062,14.40156,15.16047,16.13025,16.77925,17.29031,18.19221,18.90315]
[59.5,13.35561,13.53336,13.82852,14.39194,15.15543,16.1334,16.78956,17.30732,18.22355,18.94832]
[60.5,13.34252,13.52091,13.81726,14.38345,15.15188,16.13843,16.80197,17.32657,18.25738,18.99615]
[61.5,13.33003,13.50915,13.80684,14.37609,15.1498,16.14531,16.81644,17.34803,18.29365,19.04659]
[62.5,13.31814,13.49808,13.79726,14.36984,15.14917,16.154,16.83292,17.37165,18.3323,19.09957]
[63.5,13.30685,13.4877,13.78852,14.36469,15.14995,16.16446,16.85138,17.39739,18.37327,19.15501]
[64.5,13.29618,13.47802,13.78061,14.36062,15.15213,16.17665,16.87177,17.42519,18.41651,19.21286]
[65.5,13.28612,13.46903,13.77353,14.35762,15.15567,16.19056,16.89405,17.45502,18.46197,19.27305]
[66.5,13.27668,13.46075,13.76728,14.35567,15.16056,16.20613,16.91819,17.48683,18.50959,19.33552]
[67.5,13.26788,13.45317,13.76185,14.35478,15.16678,16.22334,16.94415,17.52057,18.55932,19.4002]
[68.5,13.2597,13.4463,13.75724,14.35491,15.17429,16.24214,16.97187,17.5562,18.61111,19.46703]
[69.5,13.25217,13.44013,13.75345,14.35606,15.18309,16.26252,17.00134,17.59369,18.6649,19.53594]
[70.5,13.24528,13.43467,13.75047,14.35823,15.19313,16.28443,17.03249,17.63297,18.72064,19.60689]
[71.5,13.23904,13.42991,13.7483,14.36138,15.20441,16.30785,17.06531,17.67402,18.77829,19.6798]
[72.5,13.23345,13.42587,13.74694,14.36552,15.2169,16.33273,17.09974,17.71678,18.83778,19.75462]
[73.5,13.22851,13.42254,13.74637,14.37063,15.23058,16.35906,17.13575,17.76122,18.89907,19.83129]
[74.5,13.22423,13.41992,13.74661,14.3767,15.24543,16.38679,17.17331,17.8073,18.96211,19.90976]
[75.5,13.22062,13.41801,13.74764,14.38372,15.26142,16.41589,17.21237,17.85496,19.02685,19.98995]
[76.5,13.21766,13.41681,13.74946,14.39168,15.27854,16.44633,17.2529,17.90417,19.09324,20.07183]
[77.5,13.21538,13.41632,13.75206,14.40056,15.29676,16.47809,17.29485,17.95489,19.16123,20.15533]
[78.5,13.21376,13.41654,13.75544,14.41035,15.31607,16.51113,17.3382,18.00708,19.23077,20.2404]
[79.5,13.21281,13.41748,13.75961,14.42104,15.33644,16.54542,17.38291,18.06069,19.30182,20.32698]
[80.5,13.21253,13.41912,13.76454,14.43263,15.35785,16.58094,17.42894,18.11569,19.37432,20.41502]
[81.5,13.21293,13.42147,13.77024,14.44509,15.38029,16.61764,17.47626,18.17203,19.44822,20.50447]
[82.5,13.214,13.42453,13.7767,14.45842,15.40374,16.65551,17.52482,18.22968,19.52349,20.59528]
[83.5,13.21574,13.42829,13.78393,14.47261,15.42817,16.69451,17.5746,18.28859,19.60008,20.68739]
[84.5,13.21816,13.43276,13.7919,14.48765,15.45357,16.73462,17.62557,18.34873,19.67794,20.78075]
[85.5,13.22125,13.43793,13.80063,14.50352,15.47991,16.7758,17.67768,18.41007,19.75702,20.87531]
[86.5,13.22502,13.4438,13.8101,14.52021,15.50718,16.81803,17.7309,18.47255,19.83728,20.97103]
[87.5,13.22946,13.45037,13.8203,14.53772,15.53537,16.86129,17.7852,18.53615,19.91867,21.06786]
[88.5,13.23458,13.45764,13.83124,14.55603,15.56444,16.90553,17.84055,18.60082,20.00116,21.16573]
[89.5,13.24037,13.4656,13.8429,14.57513,15.59439,16.95075,17.89692,18.66653,20.08469,21.26462]
[90.5,13.24683,13.47425,13.85529,14.59501,15.6252,16.9969,17.95426,18.73325,20.16923,21.36447]
[91.5,13.25397,13.48359,13.86839,14.61566,15.65684,17.04396,18.01256,18.80093,20.25473,21.46524]
[92.5,13.26177,13.49362,13.88221,14.63706,15.6893,17.09191,18.07177,18.86955,20.34116,21.56688]
[93.5,13.27025,13.50432,13.89673,14.65922,15.72257,17.14072,18.13187,18.93906,20.42846,21.66935]
[94.5,13.27939,13.51571,13.91194,14.68211,15.75662,17.19037,18.19283,19.00943,20.51661,21.77259]
[95.5,13.28919,13.52777,13.92785,14.70572,15.79143,17.24082,18.2546,19.08063,20.60555,21.87658]
[96.5,13.29966,13.5405,13.94445,14.73005,15.827,17.29206,18.31718,19.15262,20.69525,21.98126]
[97.5,13.31079,13.5539,13.96173,14.75508,15.86329,17.34405,18.38051,19.22537,20.78568,22.0866]
[98.5,13.32257,13.56797,13.97968,14.78081,15.9003,17.39678,18.44458,19.29884,20.87678,22.19255]
[99.5,13.33502,13.58269,13.99829,14.80722,15.93802,17.45022,18.50936,19.37301,20.96853,22.29907]
[100.5,13.34811,13.59807,14.01757,14.8343,15.97641,17.50434,18.57481,19.44784,21.06089,22.40613]
[101.5,13.36185,13.6141,14.03751,14.86204,16.01546,17.55912,18.64091,19.52329,21.15381,22.51367]
[102.5,13.37624,13.63077,14.05809,14.89043,16.05517,17.61454,18.70762,19.59935,21.24727,22.62168]
[103.5,13.39126,13.64809,14.07931,14.91946,16.09551,17.67057,18.77493,19.67596,21.34123,22.73009]
[104.5,13.40693,13.66605,14.10116,14.94911,16.13646,17.7272,18.8428,19.75312,21.43565,22.83889]
[105.5,13.42323,13.68463,14.12364,14.97938,16.17801,17.78438,18.91121,19.83077,21.53049,22.94803]
[106.5,13.44016,13.70384,14.14675,15.01026,16.22014,17.84212,18.98012,19.9089,21.62573,23.05747]
[107.5,13.45772,13.72368,14.17046,15.04173,16.26284,17.90037,19.04952,19.98748,21.72133,23.16719]
[108.5,13.4759,13.74413,14.19478,15.07378,16.30609,17.95912,19.11937,20.06647,21.81725,23.27714]
[109.5,13.4947,13.76519,14.2197,15.10641,16.34988,18.01835,19.18965,20.14584,21.91347,23.3873]
[110.5,13.51411,13.78685,14.2452,15.1396,16.39418,18.07803,19.26034,20.22558,22.00996,23.49762]
[111.5,13.53412,13.80911,14.27129,15.17334,16.43899,18.13815,19.3314,20.30564,22.10667,23.60808]
[112.5,13.55474,13.83197,14.29796,15.20762,16.48428,18.19867,19.40282,20.38601,22.20358,23.71865]
[113.5,13.57596,13.85541,14.32519,15.24242,16.53005,18.25959,19.47457,20.46665,22.30066,23.82929]
[114.5,13.59777,13.87943,14.35298,15.27775,16.57627,18.32088,19.54662,20.54754,22.39789,23.93997]
[115.5,13.62017,13.90402,14.38132,15.31358,16.62293,18.38251,19.61895,20.62866,22.49522,24.05066]
[116.5,13.64315,13.92918,14.4102,15.3499,16.67002,18.44447,19.69154,20.70997,22.59264,24.16134]
[117.5,13.6667,13.9549,14.43962,15.38671,16.71751,18.50675,19.76436,20.79145,22.69011,24.27198]
[118.5,13.69082,13.98118,14.46957,15.42399,16.7654,18.5693,19.83739,20.87308,22.78761,24.38254]
[119.5,13.7155,14.008,14.50003,15.46173,16.81368,18.63213,19.91061,20.95484,22.88511,24.49299]
[120.5,13.74074,14.03535,14.531,15.49992,16.86231,18.6952,19.984,21.03669,22.98258,24.60333]
[121.5,13.76653,14.06324,14.56247,15.53855,16.9113,18.7585,20.05753,21.11861,23.08,24.71351]
[122.5,13.79287,14.09166,14.59444,15.57761,16.96062,18.82202,20.13118,21.20059,23.17734,24.82351]
[123.5,13.81974,14.12059,14.62688,15.61709,17.01026,18.88572,20.20493,21.28259,23.27458,24.93331]
[124.5,13.84714,14.15003,14.6598,15.65696,17.06021,18.94959,20.27876,21.3646,23.3717,25.04288]
[125.5,13.87506,14.17997,14.69319,15.69724,17.11045,19.01362,20.35264,21.44659,23.46867,25.15221]
[126.5,13.9035,14.21041,14.72703,15.73789,17.16097,19.07779,20.42657,21.52854,23.56546,25.26126]
[127.5,13.93244,14.24133,14.76132,15.77891,17.21174,19.14207,20.50052,21.61043,23.66206,25.37002]
[128.5,13.96188,14.27272,14.79605,15.8203,17.26277,19.20645,20.57446,21.69224,23.75845,25.47846]
[129.5,13.99182,14.30459,14.8312,15.86203,17.31403,19.27091,20.64838,21.77396,23.8546,25.58657]
[130.5,14.02224,14.33691,14.86677,15.9041,17.36551,19.33544,20.72227,21.85555,23.95049,25.69432]
[131.5,14.05314,14.36969,14.90275,15.94649,17.41719,19.40001,20.79609,21.937,24.0461,25.80169]
[132.5,14.0845,14.4029,14.93913,15.98919,17.46907,19.46462,20.86984,22.01829,24.14141,25.90868]
[133.5,14.11633,14.43656,14.9759,16.0322,17.52112,19.52924,20.94349,22.0994,24.23641,26.01525]
[134.5,14.1486,14.47063,15.01305,16.07549,17.57333,19.59386,21.01703,22.18031,24.33108,26.12139]
[135.5,14.18132,14.50512,15.05056,16.11907,17.6257,19.65846,21.09045,22.26101,24.42539,26.22709]
[136.5,14.21447,14.54002,15.08844,16.1629,17.6782,19.72302,21.16371,22.34148,24.51933,26.33233]
[137.5,14.24805,14.57531,15.12666,16.207,17.73082,19.78754,21.23681,22.4217,24.61288,26.43709]
[138.5,14.28204,14.61099,15.16522,16.25134,17.78356,19.85199,21.30974,22.50166,24.70603,26.54136]
[139.5,14.31643,14.64705,15.20411,16.2959,17.83638,19.91636,21.38246,22.58133,24.79876,26.64513]
[140.5,14.35122,14.68347,15.24332,16.34069,17.88929,19.98063,21.45498,22.66071,24.89106,26.74838]
[141.5,14.3864,14.72025,15.28283,16.38568,17.94227,20.0448,21.52727,22.73977,24.98291,26.8511]
[142.5,14.42195,14.75737,15.32264,16.43087,17.99531,20.10884,21.59931,22.8185,25.0743,26.95328]
[143.5,14.45788,14.79484,15.36274,16.47625,18.04838,20.17274,21.67111,22.89689,25.16522,27.0549]
[144.5,14.49415,14.83262,15.40311,16.52179,18.10149,20.23648,21.74263,22.97493,25.25564,27.15596]
[145.5,14.53078,14.87073,15.44374,16.5675,18.15461,20.30006,21.81386,23.05259,25.34557,27.25645]
[146.5,14.56773,14.90914,15.48462,16.61335,18.20774,20.36346,21.8848,23.12987,25.43498,27.35636]
[147.5,14.60502,14.94784,15.52574,16.65934,18.26085,20.42667,21.95543,23.20675,25.52387,27.45567]
[148.5,14.64262,14.98682,15.5671,16.70546,18.31395,20.48967,22.02573,23.28323,25.61223,27.55439]
[149.5,14.68052,15.02607,15.60867,16.75168,18.36701,20.55245,22.0957,23.35928,25.70005,27.6525]
[150.5,14.71871,15.06559,15.65044,16.79801,18.42002,20.61499,22.16532,23.43491,25.78731,27.75]
[151.5,14.75718,15.10535,15.69241,16.84442,18.47298,20.67729,22.23458,23.51008,25.87401,27.84688]
[152.5,14.79592,15.14535,15.73456,16.89091,18.52586,20.73934,22.30346,23.58481,25.96013,27.94314]
[153.5,14.83492,15.18558,15.77689,16.93746,18.57866,20.80112,22.37196,23.65907,26.04568,28.03877]
[154.5,14.87417,15.22602,15.81937,16.98407,18.63136,20.86261,22.44007,23.73285,26.13065,28.13377]
[155.5,14.91365,15.26666,15.86199,17.03071,18.68396,20.92382,22.50777,23.80615,26.21502,28.22813]
[156.5,14.95335,15.30749,15.90476,17.07738,18.73643,20.98472,22.57506,23.87895,26.2988,28.32185]
[157.5,14.99326,15.34849,15.94764,17.12407,18.78878,21.04531,22.64192,23.95126,26.38197,28.41494]
[158.5,15.03336,15.38966,15.99063,17.17076,18.84098,21.10557,22.70835,24.02305,26.46453,28.50739]
[159.5,15.07365,15.43098,16.03372,17.21744,18.89302,21.1655,22.77434,24.09433,26.54648,28.59919]
[160.5,15.11411,15.47244,16.0769,17.26409,18.9449,21.22508,22.83987,24.16508,26.62782,28.69036]
[161.5,15.15473,15.51403,16.12014,17.31072,18.9966,21.28431,22.90494,24.23529,26.70853,28.78088]
[162.5,15.19549,15.55572,16.16345,17.35729,19.04811,21.34317,22.96954,24.30497,26.78862,28.87077]
[163.5,15.23639,15.59752,16.2068,17.40381,19.09942,21.40166,23.03366,24.37411,26.86808,28.96002]
[164.5,15.2774,15.63941,16.25018,17.45026,19.15052,21.45977,23.09731,24.44269,26.94692,29.04864]
[165.5,15.31852,15.68136,16.29358,17.49662,19.20139,21.51749,23.16045,24.51071,27.02513,29.13663]
[166.5,15.35972,15.72338,16.33699,17.54289,19.25204,21.5748,23.22311,24.57818,27.1027,29.22399]
[167.5,15.40101,15.76544,16.38039,17.58905,19.30243,21.63171,23.28525,24.64508,27.17965,29.31073]
[168.5,15.44235,15.80753,16.42378,17.63509,19.35257,21.68819,23.34689,24.71141,27.25597,29.39686]
[169.5,15.48374,15.84964,16.46712,17.68099,19.40245,21.74426,23.40801,24.77716,27.33167,29.48237]
[170.5,15.52517,15.89175,16.51042,17.72675,19.45204,21.79989,23.46861,24.84234,27.40673,29.56729]
[171.5,15.56661,15.93385,16.55366,17.77236,19.50136,21.85508,23.52868,24.90694,27.48118,29.6516]
[172.5,15.60805,15.97592,16.59682,17.81779,19.55037,21.90982,23.58823,24.97096,27.555,29.73533]
[173.5,15.64949,16.01795,16.63989,17.86304,19.59907,21.96411,23.64723,25.0344,27.6282,29.81848]
[174.5,15.69089,16.05992,16.68286,17.90809,19.64746,22.01794,23.7057,25.09725,27.70079,29.90107]
[175.5,15.73225,16.10183,16.72571,17.95294,19.69552,22.0713,23.76363,25.15951,27.77277,29.98309]
[176.5,15.77356,16.14364,16.76842,17.99756,19.74325,22.12419,23.82101,25.22119,27.84414,30.06456]
[177.5,15.81478,16.18536,16.81099,18.04195,19.79062,22.1766,23.87784,25.28228,27.91491,30.1455]
[178.5,15.85592,16.22696,16.8534,18.0861,19.83764,22.22852,23.93412,25.34279,27.98509,30.22591]
[179.5,15.89695,16.26842,16.89563,18.12998,19.88429,22.27996,23.98985,25.40271,28.05468,30.3058]
[180.5,15.93785,16.30974,16.93767,18.1736,19.93057,22.3309,24.04503,25.46204,28.12369,30.3852]
[181.5,15.97862,16.35089,16.97951,18.21693,19.97646,22.38135,24.09964,25.5208,28.19213,30.46411]
[182.5,16.01923,16.39185,17.02112,18.25996,20.02195,22.43128,24.1537,25.57897,28.26,30.54255]
[183.5,16.05966,16.43262,17.0625,18.30269,20.06704,22.48072,24.20721,25.63656,28.32732,30.62053]
[184.5,16.0999,16.47318,17.10363,18.3451,20.11172,22.52963,24.26015,25.69357,28.39408,30.69807]
[185.5,16.13993,16.51351,17.14448,18.38717,20.15598,22.57804,24.31254,25.75002,28.46031,30.77519]
[186.5,16.17973,16.55358,17.18506,18.42889,20.19981,22.62592,24.36437,25.80589,28.52602,30.8519]
[187.5,16.21929,16.5934,17.22534,18.47025,20.2432,22.67329,24.41564,25.8612,28.5912,30.92822]
[188.5,16.25859,16.63293,17.2653,18.51124,20.28614,22.72013,24.46636,25.91595,28.65588,31.00417]
[189.5,16.2976,16.67216,17.30494,18.55184,20.32862,22.76644,24.51653,25.97014,28.72007,31.07976]
[190.5,16.33631,16.71107,17.34423,18.59205,20.37064,22.81222,24.56614,26.02379,28.78378,31.15502]
[191.5,16.37471,16.74965,17.38316,18.63184,20.41219,22.85747,24.61521,26.07689,28.84702,31.22997]
[192.5,16.41277,16.78787,17.42171,18.67121,20.45326,22.90219,24.66372,26.12945,28.90981,31.30462]
[193.5,16.45047,16.82573,17.45986,18.71015,20.49383,22.94637,24.7117,26.18148,28.97215,31.379]
[194.5,16.4878,16.8632,17.49761,18.74863,20.53392,22.99002,24.75913,26.23299,29.03407,31.45314]
[195.5,16.52473,16.90025,17.53492,18.78665,20.57349,23.03313,24.80603,26.28399,29.09558,31.52704]
[196.5,16.56124,16.93689,17.5718,18.82419,20.61256,23.07571,24.8524,26.33448,29.1567,31.60075]
[197.5,16.59733,16.97308,17.60821,18.86125,20.65111,23.11774,24.89824,26.38446,29.21743,31.67427]
[198.5,16.63295,17.0088,17.64415,18.8978,20.68912,23.15924,24.94356,26.43396,29.27781,31.74764]
[199.5,16.66811,17.04404,17.67959,18.93384,20.72661,23.2002,24.98836,26.48298,29.33784,31.82088]
[200.5,16.70276,17.07879,17.71452,18.96935,20.76355,23.24062,25.03265,26.53153,29.39755,31.89401]
[201.5,16.7369,17.11301,17.74892,19.00432,20.79994,23.28051,25.07643,26.57962,29.45695,31.96706]
[202.5,16.77051,17.14669,17.78278,19.03874,20.83578,23.31986,25.11972,26.62726,29.51606,32.04007]
[203.5,16.80356,17.17981,17.81607,19.07258,20.87105,23.35867,25.16251,26.67447,29.57491,32.11305]
[204.5,16.83603,17.21234,17.84878,19.10585,20.90576,23.39696,25.20482,26.72125,29.6335,32.18603]
[205.5,16.8679,17.24429,17.88089,19.13852,20.93988,23.43471,25.24665,26.76761,29.69187,32.25905]
[206.5,16.89915,17.2756,17.91238,19.17059,20.97343,23.47193,25.28802,26.81358,29.75004,32.33212]
[207.5,16.92975,17.30628,17.94324,19.20204,21.00638,23.50863,25.32892,26.85915,29.80802,32.40529]
[208.5,16.95969,17.3363,17.97344,19.23285,21.03874,23.5448,25.36937,26.90436,29.86584,32.47859]
[209.5,16.98894,17.36564,18.00298,19.26301,21.07049,23.58045,25.40938,26.9492,29.92352,32.55204]
[210.5,17.01749,17.39427,18.03182,19.29252,21.10163,23.61558,25.44895,26.9937,29.98109,32.62567]
[211.5,17.0453,17.42218,18.05996,19.32135,21.13216,23.65019,25.4881,27.03787,30.03857,32.69952]
[212.5,17.07236,17.44935,18.08737,19.34949,21.16206,23.68429,25.52684,27.08173,30.09599,32.77362]
[213.5,17.09864,17.47576,18.11403,19.37693,21.19134,23.71788,25.56517,27.12528,30.15337,32.84802]
[214.5,17.12413,17.50137,18.13993,19.40366,21.21997,23.75097,25.60311,27.16856,30.21074,32.92272]
[215.5,17.14879,17.52618,18.16505,19.42965,21.24797,23.78356,25.64067,27.21157,30.26812,32.99779]
[216.5,17.1726,17.55015,18.18937,19.45491,21.27532,23.81564,25.67786,27.25433,30.32554,33.07324]
[217.5,17.19555,17.57328,18.21286,19.47941,21.30202,23.84724,25.7147,27.29686,30.38304,33.14912]
[218.5,17.2176,17.59553,18.23552,19.50314,21.32805,23.87835,25.75118,27.33918,30.44063,33.22546]
[219.5,17.23874,17.61689,18.25732,19.52608,21.35343,23.90898,25.78733,27.3813,30.49835,33.30231]
[220.5,17.25894,17.63733,18.27824,19.54823,21.37812,23.93912,25.82317,27.42325,30.55623,33.37969]
[221.5,17.27818,17.65683,18.29826,19.56957,21.40215,23.9688,25.85869,27.46505,30.6143,33.45766]
[222.5,17.29643,17.67537,18.31736,19.59008,21.42548,23.99801,25.89392,27.50671,30.6726,33.53624]
[223.5,17.31367,17.69293,18.33552,19.60975,21.44813,24.02676,25.92887,27.54826,30.73114,33.61548]
[224.5,17.32987,17.70948,18.35273,19.62857,21.47008,24.05505,25.96356,27.58971,30.78997,33.69542]
[225.5,17.34501,17.725,18.36896,19.64651,21.49134,24.08289,25.99799,27.63109,30.84911,33.77609]
[226.5,17.35907,17.73946,18.38419,19.66358,21.51188,24.11029,26.03219,27.67242,30.90861,33.85756]
[227.5,17.37203,17.75286,18.39841,19.67975,21.53171,24.13725,26.06617,27.71372,30.96849,33.93984]
[228.5,17.38385,17.76515,18.41159,19.695,21.55082,24.16378,26.09993,27.75502,31.0288,34.023]
[229.5,17.39451,17.77632,18.42371,19.70933,21.56921,24.18988,26.13351,27.79633,31.08956,34.10707]
[230.5,17.40399,17.78635,18.43475,19.72272,21.58686,24.21557,26.16692,27.83769,31.15082,34.1921]
[231.5,17.41226,17.79521,18.4447,19.73516,21.60378,24.24084,26.20016,27.8791,31.21261,34.27814]
[232.5,17.4193,17.80288,18.45352,19.74662,21.61996,24.26571,26.23326,27.92061,31.27496,34.36522]
[233.5,17.42508,17.80934,18.46121,19.7571,21.63539,24.29019,26.26624,27.96223,31.33793,34.45341]
[234.5,17.42958,17.81456,18.46773,19.76658,21.65006,24.31427,26.29911,28.00399,31.40154,34.54273]
[235.5,17.43278,17.81852,18.47308,19.77505,21.66397,24.33798,26.33189,28.04591,31.46583,34.63326]
[236.5,17.43465,17.82119,18.47722,19.78248,21.67712,24.3613,26.36459,28.08801,31.53085,34.72503]
[237.5,17.43515,17.82256,18.48014,19.78887,21.68949,24.38426,26.39723,28.13034,31.59664,34.8181]
[238.5,17.43427,17.82259,18.48182,19.7942,21.70108,24.40686,26.42984,28.17291,31.66324,34.9125]
[239.5,17.43199,17.82127,18.48223,19.79846,21.71189,24.4291,26.46243,28.21574,31.73069,35.00831]
[240,17.43031,17.82009,18.48196,19.80018,21.717,24.4401,26.47872,28.23727,31.76474,35.05675]
[240.5,17.42827,17.81856,18.48136,19.80162,21.72191,24.45101,26.49502,28.25888,31.79903,35.10556]

{"sheet":"BP List","index":8,"n_rows":3,"n_cols":53,"rows_kept":3}
["LEA Code","School Code","System Name","School Name","Exam Date","Grade Level","Student Last Name","Student First Name","Student Middle Name","Date of Birth","Gender","Height (inches)","Systolic BP (Final)","Diastolic BP (Final)","Vision Exam","Hearing Exam","Scoliosis Exam","Dental Exam","Color Vision Exam","Referral Req","Comments","15M PACER Laps","20M PACER Laps","Street Address","City","State","ZIP Code","BMI","Weight Category","Systolic  Level","Diastolic Level","BP Final","BP Category","BMI 5th Perc","BMI 85th Perc","BMI 95th Perc","SBP 50th Perc","SBP 90th Perc","SBP 95th Perc","SBP 99th Perc","DBP 50th Perc","DBP 90th Perc","DBP 95th Perc","DBP 99th Perc","BP Row","SBP Addy","DBP Addy","Student Age","Quick SBP Check","Quick DBP Check","BP Result","Referral Needed","Homeroom Teacher"]
[530,48,{"$f":"VLOOKUP(StudentTable6[[#This Row],[LEA Code]],School_Listing[[System Code]:[System Name]],2,FALSE)","v":"LOUDON COUNTY"},{"$f":"VLOOKUP(StudentTable6[[#This Row],[LEA Code]]&StudentTable6[[#This Row],[School Code]],School_Listing[[Column1]:[School Name]],2,FALSE)","v":"North Middle School"},"2015-10-03","HS","Doe","Jane","G","2000-10-03","F",60.5,102,70,null,"NA","NA","NA","NA",{"$f":"IFERROR(IF(OR(StudentTable6[[#This Row],[Vision Exam]] = \"F\", StudentTable6[[#This Row],[Hearing Exam]] = \"F\", StudentTable6[[#This Row],[Scoliosis Exam]] = \"F\",StudentTable6[[#This Row],[Dental Exam]]=\"F\", StudentTable6[[#This Row],[Color Vision Exam]]=\"F\",NOT(OR(StudentTable6[[#This Row],[Weight Category]] = \"Normal\",StudentTable6[[#This Row],[Weight Category]] = \"\")), NOT(OR(StudentTable6[[#This Row],[BP Category]] =\"Normal\",StudentTable6[[#This Row],[BP Category]] =\"\"))),\"Yes\", \"No\"),\"\")","v":"No"},{"$nulls":3},"123 West End","Nashville","TN",37115,{"$f":"IFERROR(#REF!/(StudentTable6[[#This Row],[Height (inches)]]^2)*703,\"\")","v":""},{"$f":"IF(StudentTable6[[#This Row],[BMI]]=\"\",\"\",IFERROR(IF(StudentTable6[[#This Row],[BMI]]<StudentTable6[[#This Row],[BMI 5th Perc]],\"Underweight\",IF(AND(StudentTable6[[#This Row],[BMI]]>=StudentTable6[[#This Row],[BMI 5th Perc]],StudentTable6[[#This Row],[BMI]]<StudentTable6[[#This Row],[BMI 85th Perc]]),\"Normal\",IF(AND(StudentTable6[[#This Row],[BMI]]>=StudentTable6[[#This Row],[BMI 85th Perc]],StudentTable6[[#This Row],[BMI]]<StudentTable6[[#This Row],[BMI 95th Perc]]),\"Overweight\",IF(StudentTable6[[#This Row],[BMI]]>=StudentTable6[[#This Row],[BMI 95th Perc]],\"Obese\",\"Out-of-Bounds\")))),\"\"))","v":""},{"$f":"IF(StudentTable6[[#This Row],[Systolic BP (Final)]]<>\"\",IF(StudentTable6[[#This Row],[Systolic BP (Final)]]<StudentTable6[[#This Row],[SBP 90th Perc]],0,IF(AND(StudentTable6[[#This Row],[Systolic BP (Final)]]<StudentTable6[[#This Row],[SBP 95th Perc]], StudentTable6[[#This Row],[Systolic BP (Final)]]>=StudentTable6[[#This Row],[SBP 90th Perc]]),1,IF(AND(StudentTable6[[#This Row],[Systolic BP (Final)]]<StudentTable6[[#This Row],[SBP 99th Perc]],StudentTable6[[#This Row],[Systolic BP (Final)]]>=StudentTable6[[#This Row],[SBP 95th Perc]]),2,IF(StudentTable6[[#This Row],[Systolic BP (Final)]]>=StudentTable6[[#This Row],[SBP 99th Perc]],3,\"\")))),\"\")","v":0},{"$f":"IF(StudentTable6[[#This Row],[Diastolic BP (Final)]]<>\"\",IF(StudentTable6[[#This Row],[Diastolic BP (Final)]]<StudentTable6[[#This Row],[DBP 90th Perc]],0,IF(AND(StudentTable6[[#This Row],[Diastolic BP (Final)]]<StudentTable6[[#This Row],[DBP 95th Perc]], StudentTable6[[#This Row],[Diastolic BP (Final)]]>=StudentTable6[[#This Row],[DBP 90th Perc]]),1,IF(AND(StudentTable6[[#This Row],[Diastolic BP (Final)]]<StudentTable6[[#This Row],[DBP 99th Perc]],StudentTable6[[#This Row],[Diastolic BP (Final)]]>=StudentTable6[[#This Row],[DBP 95th Perc]]),2,IF(StudentTable6[[#This Row],[Diastolic BP (Final)]]>=StudentTable6[[#This Row],[DBP 99th Perc]],3,\"\")))),\"\")","v":0},{"$f":"IF(StudentTable6[[#This Row],[Height (inches)]]=\"\",\"\",IF(StudentTable6[[#This Row],[Systolic  Level]]<=StudentTable6[[#This Row],[Diastolic Level]],StudentTable6[Diastolic Level],StudentTable6[Systolic  Level]))","v":0},{"$f":"IF(OR(StudentTable6[[#This Row],[Systolic BP (Final)]]>=StudentTable6[[#This Row],[Quick SBP Check]],StudentTable6[[#This Row],[Diastolic BP (Final)]]>=StudentTable6[[#This Row],[Quick DBP Check]]),StudentTable6[[#This Row],[BP Result]],\"Normal\")","v":"Normal"},{"$f":"IFERROR(IF(StudentTable6[[#This Row],[Gender]]=\"M\",VLOOKUP(ROUNDDOWN(YEARFRAC(StudentTable6[[#This Row],[Exam Date]],StudentTable6[[#This Row],[Date of Birth]],1)*12,1),BMITable!$A$3:$K$221,3,TRUE),IF(StudentTable6[[#This Row],[Gender]]=\"F\",VLOOKUP(ROUNDDOWN(YEARFRAC(StudentTable6[[#This Row],[Exam Date]],StudentTable6[[#This Row],[Date of Birth]],1)*12,1),BMITable!$A$224:$K$442,3,TRUE),\"\")),\"\")","v":{"v":16.26842,"d":"16.27"}},{"$f":"IFERROR(IF(StudentTable6[[#This Row],[Gender]]=\"M\",VLOOKUP(ROUNDDOWN(YEARFRAC(StudentTable6[[#This Row],[Exam Date]],StudentTable6[[#This Row],[Date of Birth]],1)*12,1),BMITable!$A$3:$K$221,8,TRUE),IF(StudentTable6[[#This Row],[Gender]]=\"F\",VLOOKUP(ROUNDDOWN(YEARFRAC(StudentTable6[[#This Row],[Exam Date]],StudentTable6[[#This Row],[Date of Birth]],1)*12,1),BMITable!$A$224:$K$442,8,TRUE),\"\")),\"\")","v":{"v":23.98985,"d":"23.99"}},{"$f":"IFERROR(IF(StudentTable6[[#This Row],[Gender]]=\"M\",VLOOKUP(ROUNDDOWN(YEARFRAC(StudentTable6[[#This Row],[Exam Date]],StudentTable6[[#This Row],[Date of Birth]],1)*12,1),BMITable!$A$3:$K$221,10,TRUE),IF(StudentTable6[[#This Row],[Gender]]=\"F\",VLOOKUP(ROUNDDOWN(YEARFRAC(StudentTable6[[#This Row],[Exam Date]],StudentTable6[[#This Row],[Date of Birth]],1)*12,1),BMITable!$A$224:$K$442,10,TRUE),\"\")),\"\")","v":{"v":28.05468,"d":"28.05"}},{"$f":"IFERROR(IF(StudentTable6[[#This Row],[Height (inches)]]<>\"\",HLOOKUP(StudentTable6[[#This Row],[Height (inches)]],INDIRECT(StudentTable6[[#This Row],[SBP Addy]]),2,TRUE),\"\"),\"\")","v":""},{"$f":"IFERROR(IF(StudentTable6[[#This Row],[Height (inches)]]<>\"\",HLOOKUP(StudentTable6[[#This Row],[Height (inches)]],INDIRECT(StudentTable6[[#This Row],[SBP Addy]]),3,TRUE),\"\"),\"\")","v":""},{"$f":"IFERROR(IF(StudentTable6[[#This Row],[Height (inches)]]<>\"\",HLOOKUP(StudentTable6[[#This Row],[Height (inches)]],INDIRECT(StudentTable6[[#This Row],[SBP Addy]]),4,TRUE),\"\"),\"\")","v":""},{"$f":"IFERROR(IF(StudentTable6[[#This Row],[Height (inches)]]<>\"\",HLOOKUP(StudentTable6[[#This Row],[Height (inches)]],INDIRECT(StudentTable6[[#This Row],[SBP Addy]]),5,TRUE),\"\"),\"\")","v":""},{"$f":"IFERROR(IF(StudentTable6[[#This Row],[Height (inches)]]<>\"\",HLOOKUP(StudentTable6[[#This Row],[Height (inches)]],INDIRECT(StudentTable6[[#This Row],[DBP Addy]]),2,TRUE),\"\"),\"\")","v":""},{"$f":"IFERROR(IF(StudentTable6[[#This Row],[Height (inches)]]<>\"\",HLOOKUP(StudentTable6[[#This Row],[Height (inches)]],INDIRECT(StudentTable6[[#This Row],[DBP Addy]]),3,TRUE),\"\"),\"\")","v":""},{"$f":"IFERROR(IF(StudentTable6[[#This Row],[Height (inches)]]<>\"\",HLOOKUP(StudentTable6[[#This Row],[Height (inches)]],INDIRECT(StudentTable6[[#This Row],[DBP Addy]]),4,TRUE),\"\"),\"\")","v":""},{"$f":"IFERROR(IF(StudentTable6[[#This Row],[Height (inches)]]<>\"\",HLOOKUP(StudentTable6[[#This Row],[Height (inches)]],INDIRECT(StudentTable6[[#This Row],[DBP Addy]]),5,TRUE),\"\"),\"\")","v":""},{"$f":"IF(StudentTable6[[#This Row],[Gender]]=\"M\",MATCH(ROUNDDOWN(YEARFRAC(StudentTable6[[#This Row],[Exam Date]],StudentTable6[[#This Row],[Date of Birth]]),0),'BP Lookup Table'!$A$3:$A$82,1)+ROW('BP Lookup Table'!$A$3:$A$82)-1,IF(StudentTable6[[#This Row],[Gender]]=\"F\",MATCH(ROUNDDOWN(YEARFRAC(StudentTable6[[#This Row],[Exam Date]],StudentTable6[[#This Row],[Date of Birth]]),0),'BP Lookup Table'!$A$86:$A$161,1)+ROW('BP Lookup Table'!$A$86:$A$161)-1,\"\"))","v":151},{"$f":"IF(StudentTable6[[#This Row],[BP Row]]<>\"\",\"BPTable!B\"&StudentTable6[[#This Row],[BP Row]]&\":\"&\"I\"&StudentTable6[[#This Row],[BP Row]]+4,\"\")","v":"BPTable!B151:I155"},{"$f":"IF(StudentTable6[[#This Row],[BP Row]]<>\"\",\"BPTable!J\"&StudentTable6[[#This Row],[BP Row]]&\":\"&\"Q\"&StudentTable6[[#This Row],[BP Row]]+4,\"\")","v":"BPTable!J151:Q155"},{"$f":"ROUND(_xlfn.DAYS(StudentTable6[[#This Row],[Exam Date]],StudentTable6[[#This Row],[Date of Birth]])/365,0)","v":15},{"$f":"IF(StudentTable6[[#This Row],[Gender]]=\"M\",INDEX('Simplified BP table'!$B$4:$B$20,MATCH(StudentTable6[[#This Row],[Student Age]],'Simplified BP table'!$A$4:$A$20,0)),INDEX('Simplified BP table'!$D$4:$D$20,MATCH(StudentTable6[[#This Row],[Student Age]],'Simplified BP table'!$A$4:$A$20,0)))","v":120},{"$f":"IF(StudentTable6[[#This Row],[Gender]]=\"M\",INDEX('Simplified BP table'!$C$4:$C$20,MATCH(StudentTable6[[#This Row],[Student Age]],'Simplified BP table'!$A$4:$A$20,0)),INDEX('Simplified BP table'!$E$4:$E$20,MATCH(StudentTable6[[#This Row],[Student Age]],'Simplified BP table'!$A$4:$A$20,0)))","v":80},{"$f":"IF(StudentTable6[[#This Row],[Height (inches)]]=\"\",\"Height Needed\",IFERROR(IF(StudentTable6[[#This Row],[BP Final]]=0,\"Normal\",IF(StudentTable6[[#This Row],[BP Final]]=1,\"Pre-HT\",IF(StudentTable6[[#This Row],[BP Final]]=2,\"Stage 1 HT\",IF(StudentTable6[[#This Row],[BP Final]]=3,\"Stage 2 HT\",\"Out of Range\")))),\"\"))","v":"Normal"},{"$f":"IF(OR(StudentTable6[[#This Row],[Vision Exam]] = \"F\", StudentTable6[[#This Row],[Hearing Exam]] = \"F\", StudentTable6[[#This Row],[Scoliosis Exam]] = \"F\",StudentTable6[[#This Row],[Dental Exam]]=\"F\", StudentTable6[[#This Row],[Color Vision Exam]]=\"F\",StudentTable6[[#This Row],[Weight Category]] <> \"Normal\", StudentTable6[[#This Row],[BP Category]] <>\"Normal\"),\"Yes\", \"No\")","v":"Yes"}]
[530,48,{"$f":"VLOOKUP(StudentTable6[[#This Row],[LEA Code]],School_Listing[[System Code]:[System Name]],2,FALSE)","v":"LOUDON COUNTY"},{"$f":"VLOOKUP(StudentTable6[[#This Row],[LEA Code]]&StudentTable6[[#This Row],[School Code]],School_Listing[[Column1]:[School Name]],2,FALSE)","v":"North Middle School"},"2020-05-13","K/k",{"$nulls":3},"2012-10-17","M",53.4,130,71,"NA","NA","NA","NA","NA",{"$f":"IFERROR(IF(OR(StudentTable6[[#This Row],[Vision Exam]] = \"F\", StudentTable6[[#This Row],[Hearing Exam]] = \"F\", StudentTable6[[#This Row],[Scoliosis Exam]] = \"F\",StudentTable6[[#This Row],[Dental Exam]]=\"F\", StudentTable6[[#This Row],[Color Vision Exam]]=\"F\",NOT(OR(StudentTable6[[#This Row],[Weight Category]] = \"Normal\",StudentTable6[[#This Row],[Weight Category]] = \"\")), NOT(OR(StudentTable6[[#This Row],[BP Category]] =\"Normal\",StudentTable6[[#This Row],[BP Category]] =\"\"))),\"Yes\", \"No\"),\"\")","v":"No"},{"$nulls":5},"TN",null,{"$f":"IFERROR(#REF!/(StudentTable6[[#This Row],[Height (inches)]]^2)*703,\"\")","v":""},{"$f":"IF(StudentTable6[[#This Row],[BMI]]=\"\",\"\",IFERROR(IF(StudentTable6[[#This Row],[BMI]]<StudentTable6[[#This Row],[BMI 5th Perc]],\"Underweight\",IF(AND(StudentTable6[[#This Row],[BMI]]>=StudentTable6[[#This Row],[BMI 5th Perc]],StudentTable6[[#This Row],[BMI]]<StudentTable6[[#This Row],[BMI 85th Perc]]),\"Normal\",IF(AND(StudentTable6[[#This Row],[BMI]]>=StudentTable6[[#This Row],[BMI 85th Perc]],StudentTable6[[#This Row],[BMI]]<StudentTable6[[#This Row],[BMI 95th Perc]]),\"Overweight\",IF(StudentTable6[[#This Row],[BMI]]>=StudentTable6[[#This Row],[BMI 95th Perc]],\"Obese\",\"Out-of-Bounds\")))),\"\"))","v":""},{"$f":"IF(StudentTable6[[#This Row],[Systolic BP (Final)]]<>\"\",IF(StudentTable6[[#This Row],[Systolic BP (Final)]]<StudentTable6[[#This Row],[SBP 90th Perc]],0,IF(AND(StudentTable6[[#This Row],[Systolic BP (Final)]]<StudentTable6[[#This Row],[SBP 95th Perc]], StudentTable6[[#This Row],[Systolic BP (Final)]]>=StudentTable6[[#This Row],[SBP 90th Perc]]),1,IF(AND(StudentTable6[[#This Row],[Systolic BP (Final)]]<StudentTable6[[#This Row],[SBP 99th Perc]],StudentTable6[[#This Row],[Systolic BP (Final)]]>=StudentTable6[[#This Row],[SBP 95th Perc]]),2,IF(StudentTable6[[#This Row],[Systolic BP (Final)]]>=StudentTable6[[#This Row],[SBP 99th Perc]],3,\"\")))),\"\")","v":0},{"$f":"IF(StudentTable6[[#This Row],[Diastolic BP (Final)]]<>\"\",IF(StudentTable6[[#This Row],[Diastolic BP (Final)]]<StudentTable6[[#This Row],[DBP 90th Perc]],0,IF(AND(StudentTable6[[#This Row],[Diastolic BP (Final)]]<StudentTable6[[#This Row],[DBP 95th Perc]], StudentTable6[[#This Row],[Diastolic BP (Final)]]>=StudentTable6[[#This Row],[DBP 90th Perc]]),1,IF(AND(StudentTable6[[#This Row],[Diastolic BP (Final)]]<StudentTable6[[#This Row],[DBP 99th Perc]],StudentTable6[[#This Row],[Diastolic BP (Final)]]>=StudentTable6[[#This Row],[DBP 95th Perc]]),2,IF(StudentTable6[[#This Row],[Diastolic BP (Final)]]>=StudentTable6[[#This Row],[DBP 99th Perc]],3,\"\")))),\"\")","v":0},{"$f":"IF(StudentTable6[[#This Row],[Height (inches)]]=\"\",\"\",IF(StudentTable6[[#This Row],[Systolic  Level]]<=StudentTable6[[#This Row],[Diastolic Level]],StudentTable6[Diastolic Level],StudentTable6[Systolic  Level]))","v":0},{"$f":"IF(OR(StudentTable6[[#This Row],[Systolic BP (Final)]]>=StudentTable6[[#This Row],[Quick SBP Check]],StudentTable6[[#This Row],[Diastolic BP (Final)]]>=StudentTable6[[#This Row],[Quick DBP Check]]),StudentTable6[[#This Row],[BP Result]],\"Normal\")","v":"Normal"},{"$f":"IFERROR(IF(StudentTable6[[#This Row],[Gender]]=\"M\",VLOOKUP(ROUNDDOWN(YEARFRAC(StudentTable6[[#This Row],[Exam Date]],StudentTable6[[#This Row],[Date of Birth]],1)*12,1),BMITable!$A$3:$K$221,3,TRUE),IF(StudentTable6[[#This Row],[Gender]]=\"F\",VLOOKUP(ROUNDDOWN(YEARFRAC(StudentTable6[[#This Row],[Exam Date]],StudentTable6[[#This Row],[Date of Birth]],1)*12,1),BMITable!$A$224:$K$442,3,TRUE),\"\")),\"\")","v":{"v":13.74702,"d":"13.75"}},{"$f":"IFERROR(IF(StudentTable6[[#This Row],[Gender]]=\"M\",VLOOKUP(ROUNDDOWN(YEARFRAC(StudentTable6[[#This Row],[Exam Date]],StudentTable6[[#This Row],[Date of Birth]],1)*12,1),BMITable!$A$3:$K$221,8,TRUE),IF(StudentTable6[[#This Row],[Gender]]=\"F\",VLOOKUP(ROUNDDOWN(YEARFRAC(StudentTable6[[#This Row],[Exam Date]],StudentTable6[[#This Row],[Date of Birth]],1)*12,1),BMITable!$A$224:$K$442,8,TRUE),\"\")),\"\")","v":{"v":17.66049,"d":"17.66"}},{"$f":"IFERROR(IF(StudentTable6[[#This Row],[Gender]]=\"M\",VLOOKUP(ROUNDDOWN(YEARFRAC(StudentTable6[[#This Row],[Exam Date]],StudentTable6[[#This Row],[Date of Birth]],1)*12,1),BMITable!$A$3:$K$221,10,TRUE),IF(StudentTable6[[#This Row],[Gender]]=\"F\",VLOOKUP(ROUNDDOWN(YEARFRAC(StudentTable6[[#This Row],[Exam Date]],StudentTable6[[#This Row],[Date of Birth]],1)*12,1),BMITable!$A$224:$K$442,10,TRUE),\"\")),\"\")","v":{"v":19.59272,"d":"19.59"}},{"$f":"IFERROR(IF(StudentTable6[[#This Row],[Height (inches)]]<>\"\",HLOOKUP(StudentTable6[[#This Row],[Height (inches)]],INDIRECT(StudentTable6[[#This Row],[SBP Addy]]),2,TRUE),\"\"),\"\")","v":""},{"$f":"IFERROR(IF(StudentTable6[[#This Row],[Height (inches)]]<>\"\",HLOOKUP(StudentTable6[[#This Row],[Height (inches)]],INDIRECT(StudentTable6[[#This Row],[SBP Addy]]),3,TRUE),\"\"),\"\")","v":""},{"$f":"IFERROR(IF(StudentTable6[[#This Row],[Height (inches)]]<>\"\",HLOOKUP(StudentTable6[[#This Row],[Height (inches)]],INDIRECT(StudentTable6[[#This Row],[SBP Addy]]),4,TRUE),\"\"),\"\")","v":""},{"$f":"IFERROR(IF(StudentTable6[[#This Row],[Height (inches)]]<>\"\",HLOOKUP(StudentTable6[[#This Row],[Height (inches)]],INDIRECT(StudentTable6[[#This Row],[SBP Addy]]),5,TRUE),\"\"),\"\")","v":""},{"$f":"IFERROR(IF(StudentTable6[[#This Row],[Height (inches)]]<>\"\",HLOOKUP(StudentTable6[[#This Row],[Height (inches)]],INDIRECT(StudentTable6[[#This Row],[DBP Addy]]),2,TRUE),\"\"),\"\")","v":""},{"$f":"IFERROR(IF(StudentTable6[[#This Row],[Height (inches)]]<>\"\",HLOOKUP(StudentTable6[[#This Row],[Height (inches)]],INDIRECT(StudentTable6[[#This Row],[DBP Addy]]),3,TRUE),\"\"),\"\")","v":""},{"$f":"IFERROR(IF(StudentTable6[[#This Row],[Height (inches)]]<>\"\",HLOOKUP(StudentTable6[[#This Row],[Height (inches)]],INDIRECT(StudentTable6[[#This Row],[DBP Addy]]),4,TRUE),\"\"),\"\")","v":""},{"$f":"IFERROR(IF(StudentTable6[[#This Row],[Height (inches)]]<>\"\",HLOOKUP(StudentTable6[[#This Row],[Height (inches)]],INDIRECT(StudentTable6[[#This Row],[DBP Addy]]),5,TRUE),\"\"),\"\")","v":""},{"$f":"IF(StudentTable6[[#This Row],[Gender]]=\"M\",MATCH(ROUNDDOWN(YEARFRAC(StudentTable6[[#This Row],[Exam Date]],StudentTable6[[#This Row],[Date of Birth]]),0),'BP Lookup Table'!$A$3:$A$82,1)+ROW('BP Lookup Table'!$A$3:$A$82)-1,IF(StudentTable6[[#This Row],[Gender]]=\"F\",MATCH(ROUNDDOWN(YEARFRAC(StudentTable6[[#This Row],[Exam Date]],StudentTable6[[#This Row],[Date of Birth]]),0),'BP Lookup Table'!$A$86:$A$161,1)+ROW('BP Lookup Table'!$A$86:$A$161)-1,\"\"))","v":28},{"$f":"IF(StudentTable6[[#This Row],[BP Row]]<>\"\",\"BPTable!B\"&StudentTable6[[#This Row],[BP Row]]&\":\"&\"I\"&StudentTable6[[#This Row],[BP Row]]+4,\"\")","v":"BPTable!B28:I32"},{"$f":"IF(StudentTable6[[#This Row],[BP Row]]<>\"\",\"BPTable!J\"&StudentTable6[[#This Row],[BP Row]]&\":\"&\"Q\"&StudentTable6[[#This Row],[BP Row]]+4,\"\")","v":"BPTable!J28:Q32"},{"$f":"ROUND(_xlfn.DAYS(StudentTable6[[#This Row],[Exam Date]],StudentTable6[[#This Row],[Date of Birth]])/365,0)","v":8},{"$f":"IF(StudentTable6[[#This Row],[Gender]]=\"M\",INDEX('Simplified BP table'!$B$4:$B$20,MATCH(StudentTable6[[#This Row],[Student Age]],'Simplified BP table'!$A$4:$A$20,0)),INDEX('Simplified BP table'!$D$4:$D$20,MATCH(StudentTable6[[#This Row],[Student Age]],'Simplified BP table'!$A$4:$A$20,0)))","v":107},{"$f":"IF(StudentTable6[[#This Row],[Gender]]=\"M\",INDEX('Simplified BP table'!$C$4:$C$20,MATCH(StudentTable6[[#This Row],[Student Age]],'Simplified BP table'!$A$4:$A$20,0)),INDEX('Simplified BP table'!$E$4:$E$20,MATCH(StudentTable6[[#This Row],[Student Age]],'Simplified BP table'!$A$4:$A$20,0)))","v":69},{"$f":"IF(StudentTable6[[#This Row],[Height (inches)]]=\"\",\"Height Needed\",IFERROR(IF(StudentTable6[[#This Row],[BP Final]]=0,\"Normal\",IF(StudentTable6[[#This Row],[BP Final]]=1,\"Pre-HT\",IF(StudentTable6[[#This Row],[BP Final]]=2,\"Stage 1 HT\",IF(StudentTable6[[#This Row],[BP Final]]=3,\"Stage 2 HT\",\"Out of Range\")))),\"\"))","v":"Normal"},{"$f":"IF(OR(StudentTable6[[#This Row],[Vision Exam]] = \"F\", StudentTable6[[#This Row],[Hearing Exam]] = \"F\", StudentTable6[[#This Row],[Scoliosis Exam]] = \"F\",StudentTable6[[#This Row],[Dental Exam]]=\"F\", StudentTable6[[#This Row],[Color Vision Exam]]=\"F\",StudentTable6[[#This Row],[Weight Category]] <> \"Normal\", StudentTable6[[#This Row],[BP Category]] <>\"Normal\"),\"Yes\", \"No\")","v":"Yes"}]

{"sheet":"Simplified BP table","index":9,"n_rows":21,"n_cols":5,"rows_kept":21,"merged":[[0,0,0,4],[1,1,1,2],[1,3,1,4]]}
["BP, mmHg"]
[null,"Boys",null,"Girls"]
["Age","Systolic","Diastolic","Systolic","Diastolic"]
[1,98,52,98,54]
[2,100,55,101,58]
[3,101,58,102,60]
[4,102,60,103,62]
[5,103,63,104,64]
[6,105,66,105,67]
[7,106,68,106,68]
[8,107,69,107,69]
[9,107,70,108,71]
[10,108,72,109,72]
[11,110,74,111,74]
[12,113,75,114,75]
[13,120,80,120,80]
[14,120,80,120,80]
[15,120,80,120,80]
[16,120,80,120,80]
[17,120,80,120,80]
[18,120,80,120,80]

{"sheet":"BP Lookup Table","index":10,"n_rows":166,"n_cols":19,"rows_kept":166,"merged":[[0,0,1,0],[0,1,0,8],[0,9,0,17],[0,18,1,18],[1,4,1,5],[1,10,1,11],[1,16,1,17],[2,0,6,0],[2,4,2,5],[2,10,2,11],[2,16,2,17],[3,4,3,5],[3,10,3,11],[3,16,3,17],[4,4,4,5],[4,10,4,11],[4,16,4,17],[5,4,5,5],[5,10,5,11],[5,16,5,17],[6,4,6,5],[6,10,6,11],[6,16,6,17],[7,0,11,0],[7,4,7,5],[7,10,7,11],[7,16,7,17],[8,4,8,5],[8,10,8,11],[8,16,8,17],[9,4,9,5],[9,10,9,11],[9,16,9,17],[10,4,10,5],[10,10,10,11],[10,16,10,17],[11,4,11,5],[11,10,11,11],[11,16,11,17],[12,0,16,0],[12,4,12,5],[12,10,12,11],[12,16,12,17],[13,4,13,5],[13,10,13,11],[13,16,13,17],[14,4,14,5],[14,10,14,11],[14,16,14,17],[15,4,15,5],[15,10,15,11],[15,16,15,17],[16,4,16,5],[16,10,16,11],[16,16,16,17],[17,0,21,0],[17,4,17,5],[17,10,17,11],[17,16,17,17],[18,4,18,5],[18,10,18,11],[18,16,18,17],[19,4,19,5],[19,10,19,11],[19,16,19,17],[20,4,20,5],[20,10,20,11],[20,16,20,17],[21,4,21,5],[21,10,21,11],[21,16,21,17],[22,0,26,0],[22,4,22,5],[22,10,22,11],[22,16,22,17],[23,4,23,5],[23,10,23,11],[23,16,23,17],[24,4,24,5],[24,10,24,11],[24,16,24,17],[25,4,25,5],[25,10,25,11],[25,16,25,17],[26,4,26,5],[26,10,26,11],[26,16,26,17],[27,0,31,0],[27,4,27,5],[27,10,27,11],[27,16,27,17],[28,4,28,5],[28,10,28,11],[28,16,28,17],[29,4,29,5],[29,10,29,11],[29,16,29,17],[30,4,30,5],[30,10,30,11],[30,16,30,17],[31,4,31,5],[31,10,31,11],[31,16,31,17],[32,0,36,0],[32,4,32,5],[32,10,32,11],[32,16,32,17],[33,4,33,5],[33,10,33,11],[33,16,33,17],[34,4,34,5],[34,10,34,11],[34,16,34,17],[35,4,35,5],[35,10,35,11],[35,16,35,17],[36,4,36,5],[36,10,36,11],[36,16,36,17],[37,0,41,0],[37,4,37,5],[37,10,37,11],[37,16,37,17],[38,4,38,5],[38,10,38,11],[38,16,38,17],[39,4,39,5],[39,10,39,11],[39,16,39,17],[40,4,40,5],[40,10,40,11],[40,16,40,17],[41,4,41,5],[41,10,41,11],[41,16,41,17],[42,0,46,0],[42,4,42,5],[42,10,42,11],[42,16,42,17],[43,4,43,5],[43,10,43,11],[43,16,43,17],[44,4,44,5],[44,10,44,11],[44,16,44,17],[45,4,45,5],[45,10,45,11],[45,16,45,17],[46,4,46,5],[46,10,46,11],[46,16,46,17],[47,0,51,0],[47,4,47,5],[47,10,47,11],[47,16,47,17],[48,4,48,5],[48,10,48,11],[48,16,48,17],[49,4,49,5],[49,10,49,11],[49,16,49,17],[50,4,50,5],[50,10,50,11],[50,16,50,17],[51,4,51,5],[51,10,51,11],[51,16,51,17],[52,0,56,0],[52,4,52,5],[52,10,52,11],[52,16,52,17],[53,4,53,5],[53,10,53,11],[53,16,53,17],[54,4,54,5],[54,10,54,11],[54,16,54,17],[55,4,55,5],[55,10,55,11],[55,16,55,17],[56,4,56,5],[56,10,56,11],[56,16,56,17],[57,0,61,0],[57,4,57,5],[57,10,57,11],[57,16,57,17],[58,4,58,5],[58,10,58,11],[58,16,58,17],[59,4,59,5],[59,10,59,11],[59,16,59,17],[60,4,60,5],[60,10,60,11],[60,16,60,17],[61,4,61,5],[61,10,61,11],[61,16,61,17],[62,0,66,0],[62,4,62,5],[62,10,62,11],[62,16,62,17],[63,4,63,5],[63,10,63,11],[63,16,63,17],[64,4,64,5],[64,10,64,11],[64,16,64,17],[65,4,65,5],[65,10,65,11],[65,16,65,17],[66,4,66,5],[66,10,66,11],[66,16,66,17],[67,0,71,0],[67,4,67,5],[67,10,67,11],[67,16,67,17],[68,4,68,5],[68,10,68,11],[68,16,68,17],[69,4,69,5],[69,10,69,11],[69,16,69,17],[70,4,70,5],[70,10,70,11],[70,16,70,17],[71,4,71,5],[71,10,71,11],[71,16,71,17],[72,0,76,0],[72,4,72,5],[72,10,72,11],[72,16,72,17],[73,4,73,5],[73,10,73,11],[73,16,73,17],[74,4,74,5],[74,10,74,11],[74,16,74,17],[75,4,75,5],[75,10,75,11],[75,16,75,17],[76,4,76,5],[76,10,76,11],[76,16,76,17],[77,0,81,0],[77,4,77,5],[77,10,77,11],[77,16,77,17],[78,4,78,5],[78,10,78,11],[78,16,78,17],[79,4,79,5],[79,10,79,11],[79,16,79,17],[80,4,80,5],[80,10,80,11],[80,16,80,17],[81,4,81,5],[81,10,81,11],[81,16,81,17],[82,0,82,17],[83,0,84,0],[83,1,83,8],[83,9,83,17],[83,18,84,18],[84,3,84,4],[84,9,84,10],[84,15,84,16],[85,0,89,0],[85,3,85,4],[85,9,85,10],[85,15,85,16],[86,3,86,4],[86,9,86,10],[86,15,86,16],[87,3,87,4],[87,9,87,10],[87,15,87,16],[88,3,88,4],[88,9,88,10],[88,15,88,16],[89,3,89,4],[89,9,89,10],[89,15,89,16],[90,0,94,0],[90,3,90,4],[90,9,90,10],[90,15,90,16],[91,3,91,4],[91,9,91,10],[91,15,91,16],[92,3,92,4],[92,9,92,10],[92,15,92,16],[93,3,93,4],[93,9,93,10],[93,15,93,16],[94,3,94,4],[94,9,94,10],[94,15,94,16],[95,0,99,0],[95,3,95,4],[95,9,95,10],[95,15,95,16],[96,3,96,4],[96,9,96,10],[96,15,96,16],[97,3,97,4],[97,9,97,10],[97,15,97,16],[98,3,98,4],[98,9,98,10],[98,15,98,16],[99,3,99,4],[99,9,99,10],[99,15,99,16],[100,0,104,0],[100,3,100,4],[100,9,100,10],[100,15,100,16],[101,3,101,4],[101,9,101,10],[101,15,101,16],[102,3,102,4],[102,9,102,10],[102,15,102,16],[103,3,103,4],[103,9,103,10],[103,15,103,16],[104,3,104,4],[104,9,104,10],[104,15,104,16],[105,0,109,0],[105,3,105,4],[105,9,105,10],[105,15,105,16],[106,3,106,4],[106,9,106,10],[106,15,106,16],[107,3,107,4],[107,9,107,10],[107,15,107,16],[108,3,108,4],[108,9,108,10],[108,15,108,16],[109,3,109,4],[109,9,109,10],[109,15,109,16],[110,0,114,0],[110,3,110,4],[110,9,110,10],[110,15,110,16],[111,3,111,4],[111,9,111,10],[111,15,111,16],[112,3,112,4],[112,9,112,10],[112,15,112,16],[113,3,113,4],[113,9,113,10],[113,15,113,16],[114,3,114,4],[114,9,114,10],[114,15,114,16],[115,0,119,0],[115,3,115,4],[115,9,115,10],[115,15,115,16],[116,3,116,4],[116,9,116,10],[116,15,116,16],[117,3,117,4],[117,9,117,10],[117,15,117,16],[118,3,118,4],[118,9,118,10],[118,15,118,16],[119,3,119,4],[119,9,119,10],[119,15,119,16],[120,0,124,0],[120,3,120,4],[120,9,120,10],[120,15,120,16],[121,3,121,4],[121,9,121,10],[121,15,121,16],[122,3,122,4],[122,9,122,10],[122,15,122,16],[123,3,123,4],[123,9,123,10],[123,15,123,16],[124,3,124,4],[124,9,124,10],[124,15,124,16],[125,0,129,0],[125,3,125,4],[125,9,125,10],[125,15,125,16],[126,3,126,4],[126,9,126,10],[126,15,126,16],[127,3,127,4],[127,9,127,10],[127,15,127,16],[128,3,128,4],[128,9,128,10],[128,15,128,16],[129,3,129,4],[129,9,129,10],[129,15,129,16],[130,0,134,0],[130,3,130,4],[130,9,130,10],[130,15,130,16],[131,3,131,4],[131,9,131,10],[131,15,131,16],[132,3,132,4],[132,9,132,10],[132,15,132,16],[133,3,133,4],[133,9,133,10],[133,15,133,16],[134,3,134,4],[134,9,134,10],[134,15,134,16],[135,0,139,0],[135,3,135,4],[135,9,135,10],[135,15,135,16],[136,3,136,4],[136,9,136,10],[136,15,136,16],[137,3,137,4],[137,9,137,10],[137,15,137,16],[138,3,138,4],[138,9,138,10],[138,15,138,16],[139,3,139,4],[139,9,139,10],[139,15,139,16],[140,0,144,0],[140,3,140,4],[140,9,140,10],[140,15,140,16],[141,3,141,4],[141,9,141,10],[141,15,141,16],[142,3,142,4],[142,9,142,10],[142,15,142,16],[143,3,143,4],[143,9,143,10],[143,15,143,16],[144,3,144,4],[144,9,144,10],[144,15,144,16],[145,0,149,0],[145,3,145,4],[145,9,145,10],[145,15,145,16],[146,3,146,4],[146,9,146,10],[146,15,146,16],[147,3,147,4],[147,9,147,10],[147,15,147,16],[148,3,148,4],[148,9,148,10],[148,15,148,16],[149,3,149,4],[149,9,149,10],[149,15,149,16],[150,0,154,0],[150,3,150,4],[150,9,150,10],[150,15,150,16],[151,3,151,4],[151,9,151,10],[151,15,151,16],[152,3,152,4],[152,9,152,10],[152,15,152,16],[153,3,153,4],[153,9,153,10],[153,15,153,16],[154,3,154,4],[154,9,154,10],[154,15,154,16],[155,0,159,0],[155,3,155,4],[155,9,155,10],[155,15,155,16],[156,3,156,4],[156,9,156,10],[156,15,156,16],[157,3,157,4],[157,9,157,10],[157,15,157,16],[158,3,158,4],[158,9,158,10],[158,15,158,16],[159,3,159,4],[159,9,159,10],[159,15,159,16],[160,0,164,0],[160,3,160,4],[160,9,160,10],[160,15,160,16],[161,3,161,4],[161,9,161,10],[161,15,161,16],[162,3,162,4],[162,9,162,10],[162,15,162,16],[163,3,163,4],[163,9,163,10],[163,15,163,16],[164,3,164,4],[164,9,164,10],[164,15,164,16],[165,0,165,17]]}
["Age\nyrs","Systolic BP (mmHg)",{"$nulls":7},"Diastolic BP (mmHg)",{"$nulls":8},"BP\nPercentile"]
[null,"5th","10th","25th","50th",null,"75th","90th","95th","5th","10th",null,"25th","50th","75th","90th","95th"]
[2,33.9,34.4,35.3,36.3,null,37.3,38.2,38.8,33.9,34.4,null,35.3,36.3,37.3,38.2,38.8,null,"Height - inches"]
[null,87,87,88,89,null,89,90,91,43,43,null,44,44,45,46,46,null,"NT"]
[null,100,100,101,102,null,103,103,104,55,55,null,56,56,57,58,58,null,"Elevated"]
[null,104,105,105,106,null,107,107,108,57,58,null,58,59,60,61,61,null,"Stage 1 HT"]
[null,116,117,117,118,null,119,119,120,69,70,null,70,71,72,73,73,null,"Stage 2 HT"]
[3,36.4,{"v":37,"d":"37.0"},37.9,{"v":39,"d":"39.0"},null,40.1,41.1,41.7,36.4,{"v":37,"d":"37.0"},null,37.9,{"v":39,"d":"39.0"},40.1,41.1,41.7,null,"Height - inches"]
[null,88,89,89,90,null,91,92,92,45,46,null,46,47,48,49,49,null,"NT"]
[null,101,102,102,103,null,104,105,105,58,58,null,59,59,60,61,61,null,"Elevated"]
[null,106,106,107,107,null,108,109,109,60,61,null,61,62,63,64,64,null,"Stage 1 HT"]
[null,118,118,119,119,null,120,121,121,72,73,null,73,74,75,76,76,null,"Stage 2 HT"]
[4,38.8,39.4,40.5,41.7,null,42.9,43.9,44.5,38.8,39.4,null,40.5,41.7,42.9,43.9,44.5,null,"Height - inches"]
[null,90,90,91,92,null,93,94,94,48,49,null,49,50,51,52,52,null,"NT"]
[null,102,103,104,105,null,105,106,107,60,61,null,62,62,63,64,64,null,"Elevated"]
[null,107,107,108,108,null,109,110,110,63,64,null,65,66,67,67,68,null,"Stage 1 HT"]
[null,119,119,120,120,null,121,122,122,75,76,null,77,78,79,79,80,null,"Stage 2 HT"]
[5,41.1,41.8,{"v":43,"d":"43.0"},44.3,null,45.5,46.7,47.4,41.1,41.8,null,{"v":43,"d":"43.0"},44.3,45.5,46.7,47.4,null,"Height - inches"]
[null,91,92,93,94,null,95,96,96,51,51,null,52,53,54,55,55,null,"NT"]
[null,103,104,105,106,null,107,108,108,63,64,null,65,65,66,67,67,null,"Elevated"]
[null,107,108,109,109,null,110,111,112,66,67,null,68,69,70,70,71,null,"Stage 1 HT"]
[null,119,120,121,121,null,122,123,124,78,79,null,80,81,82,82,83,null,"Stage 2 HT"]
[6,43.4,44.2,45.4,46.8,null,48.2,49.4,50.2,43.4,44.2,null,45.4,46.8,48.2,49.4,50.2,null,"Height - inches"]
[null,93,93,94,95,null,96,97,98,54,54,null,55,56,57,57,58,null,"NT"]
[null,105,105,106,107,null,109,110,110,66,66,null,67,68,68,69,69,null,"Elevated"]
[null,108,109,110,111,null,112,113,114,69,70,null,70,71,72,72,73,null,"Stage 1 HT"]
[null,120,121,122,123,null,124,125,126,81,82,null,82,83,84,84,85,null,"Stage 2 HT"]
[7,"4.5.7",46.5,47.8,49.3,null,50.8,52.1,52.9,45.7,46.5,null,47.8,49.3,50.8,52.1,52.9,null,"Height - inches"]
[null,94,94,95,97,null,98,98,99,56,56,null,57,58,58,59,59,null,"NT"]
[null,106,107,108,109,null,110,111,111,68,68,null,69,70,70,71,71,null,"Elevated"]
[null,110,110,111,112,null,114,115,116,71,71,null,72,73,73,74,74,null,"Stage 1 HT"]
[null,122,122,123,124,null,126,127,128,83,83,null,84,85,85,86,86,null,"Stage 2 HT"]
[8,47.8,48.6,{"v":50,"d":"50.0"},51.6,null,53.2,54.6,55.5,47.8,48.6,null,{"v":50,"d":"50.0"},51.6,53.2,54.6,55.5,null,"Height - inches"]
[null,95,96,97,98,null,99,99,100,57,57,null,58,59,59,60,60,null,"NT"]
[null,107,108,109,110,null,111,112,112,69,70,null,70,71,72,72,73,null,"Elevated"]
[null,111,112,112,114,null,115,116,117,72,73,null,73,74,75,75,75,null,"Stage 1 HT"]
[null,123,124,124,126,null,127,128,129,84,85,null,85,86,87,87,87,null,"Stage 2 HT"]
[9,49.6,50.5,{"v":52,"d":"52.0"},53.7,null,55.4,56.9,57.9,49.6,50.5,null,{"v":52,"d":"52.0"},53.7,55.4,56.9,57.9,null,"Height - inches"]
[null,96,97,98,99,null,100,101,101,57,58,null,59,60,61,62,62,null,"NT"]
[null,107,108,109,110,null,112,113,114,70,71,null,72,73,74,74,74,null,"Elevated"]
[null,112,112,"m",115,null,116,118,119,74,74,null,75,76,76,77,77,null,"Stage 1 HT"]
[null,124,124,125,127,null,128,130,131,86,86,null,87,8,88,89,89,null,"Stage 2 HT"]
[10,51.3,52.2,53.8,55.6,null,57.4,59.1,60.1,51.3,52.2,null,53.8,55.6,57.4,59.1,60.1,null,"Height - inches"]
[null,97,98,99,100,null,101,102,103,59,60,null,61,62,63,63,64,null,"NT"]
[null,108,109,111,112,null,113,115,116,72,73,null,74,74,75,75,76,null,"Elevated"]
[null,112,113,114,116,null,118,120,121,76,76,null,77,77,78,78,78,null,"Stage 1 HT"]
[null,124,125,126,128,null,130,132,133,88,88,null,89,89,90,90,90,null,"Stage 2 HT"]
[11,{"v":53,"d":"53.0"},{"v":54,"d":"54.0"},55.7,57.6,null,59.6,61.3,62.4,{"v":53,"d":"53.0"},{"v":54,"d":"54.0"},null,55.7,57.6,59.6,61.3,62.4,null,"Height - inches"]
[null,99,99,101,102,null,103,104,106,61,61,null,62,63,63,63,63,null,"NT"]
[null,110,111,112,114,null,116,117,118,74,74,null,75,75,75,76,76,null,"Elevated"]
[null,114,114,116,118,null,120,123,124,77,78,null,78,78,78,78,78,null,"Stage 1 HT"]
[null,126,126,128,130,null,132,135,136,89,90,null,90,90,90,90,90,null,"Stage 2 HT"]
[12,55.2,56.3,58.1,60.1,null,62.2,{"v":64,"d":"64.0"},65.2,55.2,56.3,null,58.1,60.1,62.2,{"v":64,"d":"64.0"},65.2,null,"Height - inches"]
[null,101,101,102,104,null,106,108,109,61,62,null,62,62,62,63,63,null,"NT"]
[null,113,114,115,117,null,119,121,122,75,75,null,75,75,75,76,76,null,"Elevated"]
[null,116,117,118,121,null,124,126,128,78,78,null,78,78,78,79,79,null,"Stage 1 HT"]
[null,128,129,130,133,null,136,138,140,90,90,null,90,90,90,91,91,null,"Stage 2 HT"]
[13,57.9,59.1,{"v":61,"d":"61.0"},63.1,null,65.2,67.1,68.3,57.9,59.1,null,{"v":61,"d":"61.0"},63.1,65.2,67.1,68.3,null,"Height - inches"]
[null,103,104,105,108,null,110,111,112,61,60,null,61,62,63,64,65,null,"NT"]
[null,115,116,118,121,null,124,126,126,74,74,null,74,75,76,77,77,null,"Elevated"]
[null,119,120,122,125,null,128,130,131,78,78,null,78,78,80,81,81,null,"Stage 1 HT"]
[null,131,132,134,137,null,140,142,143,90,90,null,90,90,92,93,93,null,"Stage 2 HT"]
[14,60.6,61.8,63.8,65.9,null,{"v":68,"d":"68.0"},69.8,70.9,60.6,61.8,null,63.8,65.9,{"v":68,"d":"68.0"},69.8,70.9,null,"Height - inches"]
[null,105,106,109,111,null,112,113,113,60,60,null,62,64,65,66,67,null,"NT"]
[null,119,120,123,126,null,127,128,129,74,74,null,75,77,78,79,80,null,"Elevated"]
[null,123,125,127,130,null,132,133,134,77,78,null,79,81,82,83,84,null,"Stage 1 HT"]
[null,135,137,139,142,null,144,145,146,89,90,null,91,93,94,95,96,null,"Stage 2 HT"]
[15,62.6,63.8,65.7,67.8,null,69.8,71.5,72.5,62.6,63.8,null,65.7,67.8,69.8,71.5,72.5,null,"Height - inches"]
[null,108,110,112,113,null,114,114,114,61,62,null,64,65,66,67,68,null,"NT"]
[null,123,124,126,128,null,129,130,130,75,76,null,78,79,80,81,81,null,"Elevated"]
[null,127,129,131,132,null,134,135,135,78,79,null,81,83,84,85,85,null,"Stage 1 HT"]
[null,139,141,143,144,null,146,147,147,90,91,null,93,95,96,97,97,null,"Stage 2 HT"]
[16,63.8,64.9,66.8,68.8,null,70.7,72.4,73.4,63.8,64.9,null,66.8,68.8,70.7,72.4,73.4,null,"Height - inches"]
[null,111,112,114,115,null,115,116,116,63,64,null,66,67,68,69,69,null,"NT"]
[null,126,127,128,129,null,131,131,132,77,78,null,79,80,81,82,82,null,"Elevated"]
[null,130,131,133,134,null,135,136,137,80,81,null,83,84,85,86,86,null,"Stage 1 HT"]
[null,142,143,{"v":14.5,"d":"15"},146,null,147,148,149,92,93,null,95,96,97,98,98,null,"Stage 2 HT"]
[17,64.5,65.5,67.3,69.2,null,71.1,72.8,73.8,64.5,65.5,null,67.3,69.2,71.1,72.8,73.8,null,"Height - inches"]
[null,114,115,116,117,null,117,118,118,65,66,null,67,68,69,70,70,null,"NT"]
[null,128,129,130,131,null,132,133,134,78,79,null,80,81,82,82,83,null,"Elevated"]
[null,132,133,134,135,null,137,138,138,"8l",82,null,84,85,86,86,87,null,"Stage 1 HT"]
[null,144,145,146,147,null,149,150,150,93,94,null,96,97,98,98,99,null,"Stage 2 HT"]
["The 90th percentile is 1.28 SD, the 95th percentile is 1.645 SD, and the 99th percentile is 2.326 SD over the mean.\nNT = normotensive (50th percentile   PreHT = pre-hypertensive (90th percentile)   HT = hypertensive (95th percentile for stage 1 and 99th% + 5 mmHg for stage 2)"]
["Age yrs","Systolic BP (mmHg)",{"$nulls":7},"Diastolic BP (mmHg)",{"$nulls":8},"BP Percentile"]
[null,"5th","10th","25th",null,"50th","75th","90th","95th","5th",null,"10th","25th","50th","75th","90th",null,"95th"]
[2,33.4,{"v":34,"d":"34.0"},34.9,null,35.9,36.9,37.8,38.4,33.4,null,{"v":34,"d":"34.0"},34.9,35.9,36.9,37.8,null,38.4,"Height - inches"]
[null,87,87,88,null,89,90,91,91,45,null,46,47,48,49,50,null,51,"NT"]
[null,101,101,102,null,103,104,105,106,58,null,58,59,60,61,62,null,62,"Elevated"]
[null,104,105,106,null,106,107,108,109,62,null,63,63,64,65,66,null,66,"Stage 1 HT"]
[null,116,117,118,null,118,119,120,121,74,null,75,75,76,77,78,null,78,"Stage 2 HT"]
[3,35.8,36.4,37.3,null,38.4,39.6,40.6,41.2,35.8,null,36.4,37.3,38.4,39.6,40.6,null,41.2,"Height - inches"]
[null,88,89,89,null,90,91,92,93,48,null,48,49,50,51,53,null,53,"NT"]
[null,102,103,104,null,104,105,106,107,60,null,61,61,62,63,64,null,65,"Elevated"]
[null,106,106,107,null,108,109,110,110,64,null,65,65,66,67,68,null,69,"Stage 1 HT"]
[null,118,118,119,null,120,121,122,122,76,null,77,77,78,79,80,null,81,"Stage 2 HT"]
[4,38.3,38.9,39.9,null,41.1,42.4,43.5,44.2,38.3,null,38.9,39.9,41.1,42.4,43.5,null,44.2,"Height - inches"]
[null,89,90,91,null,92,93,94,94,50,null,51,51,53,54,55,null,55,"NT"]
[null,103,104,105,null,106,107,108,108,62,null,63,64,65,66,67,null,67,"Elevated"]
[null,107,108,109,null,109,110,111,112,66,null,67,68,69,70,70,null,71,"Stage 1 HT"]
[null,119,120,121,null,121,122,123,124,78,null,79,80,81,82,82,null,83,"Stage 2 HT"]
[5,40.8,41.5,42.6,null,43.9,45.2,46.5,47.3,40.8,null,41.5,42.6,43.9,45.2,46.5,null,47.3,"Height - inches"]
[null,90,91,92,null,93,94,95,96,52,null,52,53,55,56,57,null,57,"NT"]
[null,104,105,106,null,107,108,109,110,64,null,65,66,67,68,69,null,70,"Elevated"]
[null,108,109,109,null,110,111,112,113,68,null,69,70,71,72,73,null,73,"Stage 1 HT"]
[null,120,121,121,null,122,123,124,125,80,null,81,82,83,84,85,null,85,"Stage 2 HT"]
[6,43.3,{"v":44,"d":"44.0"},45.2,null,46.6,48.1,49.4,50.3,43.3,null,{"v":44,"d":"44.0"},45.2,46.6,48.1,49.4,null,50.3,"Height - inches"]
[null,92,92,93,null,94,96,97,97,54,null,54,55,56,57,58,null,59,"NT"]
[null,105,106,107,null,108,109,110,111,67,null,67,68,69,70,71,null,71,"Elevated"]
[null,109,109,110,null,111,112,113,114,70,null,71,72,72,73,74,null,74,"Stage 1 HT"]
[null,121,121,122,null,123,124,125,126,82,null,83,84,84,85,86,null,86,"Stage 2 HT"]
[7,45.6,46.4,47.7,null,49.2,50.7,52.1,{"v":53,"d":"53.0"},45.6,null,46.4,47.7,49.2,50.7,52.1,null,{"v":53,"d":"53.0"},"Height - inches"]
[null,92,93,94,null,95,97,98,99,55,null,55,56,57,58,59,null,60,"NT"]
[null,106,106,107,null,109,110,111,112,68,null,68,69,70,71,72,null,72,"Elevated"]
[null,109,110,111,null,112,113,114,115,72,null,72,73,73,74,74,null,75,"Stage 1 HT"]
[null,121,122,123,null,124,125,126,127,84,null,84,85,85,86,86,null,87,"Stage 2 HT"]
[8,47.6,48.4,49.8,null,51.4,{"v":53,"d":"53.0"},54.5,55.5,47.6,null,48.4,49.8,51.4,{"v":53,"d":"53.0"},54.5,null,55.5,"Height - inches"]
[null,93,94,95,null,97,98,99,100,56,null,56,57,59,60,61,null,61,"NT"]
[null,107,107,108,null,110,111,112,113,69,null,70,71,72,72,73,null,73,"Elevated"]
[null,110,111,112,null,113,115,116,117,72,null,73,74,74,75,75,null,75,"Stage 1 HT"]
[null,122,123,124,null,125,127,128,129,84,null,85,86,86,87,87,null,87,"Stage 2 HT"]
[9,49.3,50.2,51.7,null,53.4,55.1,56.7,57.7,49.3,null,50.2,51.7,53.4,55.1,56.7,null,57.7,"Height - inches"]
[null,95,95,97,null,98,99,100,101,57,null,58,59,60,60,61,null,61,"NT"]
[null,108,108,109,null,111,112,113,114,71,null,71,72,73,73,73,null,73,"Elevated"]
[null,112,112,113,null,114,116,117,118,74,null,74,75,75,75,75,null,75,"Stage 1 HT"]
[null,124,124,125,null,126,128,129,130,86,null,86,87,87,87,87,null,87,"Stage 2 HT"]
[10,51.1,{"v":52,"d":"52.0"},53.7,null,55.5,57.4,59.1,60.2,51.1,null,{"v":52,"d":"52.0"},53.7,55.5,57.4,59.1,null,60.2,"Height - inches"]
[null,96,97,98,null,99,101,102,103,58,null,59,59,60,61,61,null,62,"NT"]
[null,109,110,111,null,112,113,115,116,72,null,73,73,73,73,73,null,73,"Elevated"]
[null,113,114,114,null,116,117,119,120,75,null,75,76,76,76,76,null,76,"Stage 1 HT"]
[null,125,126,126,null,128,129,131,132,87,null,87,88,88,88,88,null,88,"Stage 2 HT"]
[11,53.4,54.5,56.2,null,58.2,60.2,61.9,{"v":63,"d":"63.0"},53.4,null,54.5,56.2,58.2,60.2,61.9,null,{"v":63,"d":"63.0"},"Height - inches"]
[null,98,9,101,null,102,104,105,106,60,null,60,60,61,62,63,null,64,"NT"]
[null,111,112,113,null,114,116,118,120,74,null,74,74,74,74,75,null,75,"Elevated"]
[null,115,116,117,null,118,120,123,124,76,null,77,77,77,77,77,null,77,"Stage 1 HT"]
[null,127,128,129,null,130,132,135,136,88,null,89,89,89,89,89,null,89,"Stage 2 HT"]
[12,56.2,57.3,{"v":59,"d":"59.0"},null,60.9,62.8,64.5,65.5,56.2,null,57.3,{"v":59,"d":"59.0"},60.9,62.8,64.5,null,65.5,"Height - inches"]
[null,102,102,104,null,105,107,108,108,61,null,61,61,62,64,65,null,65,"NT"]
[null,114,115,116,null,118,120,122,122,75,null,75,75,75,76,76,null,76,"Elevated"]
[null,118,119,120,null,122,124,125,126,78,null,78,78,78,79,79,null,79,"Stage 1 HT"]
[null,130,131,132,null,134,136,137,138,90,null,90,90,90,91,91,null,91,"Stage 2 HT"]
[13,58.3,59.3,60.9,null,62.7,64.5,66.1,{"v":67,"d":"67.0"},58.3,null,59.3,60.9,62.7,64.5,66.1,null,{"v":67,"d":"67.0"},"Height - inches"]
[null,104,105,106,null,107,108,108,109,62,null,62,63,64,65,65,null,66,"NT"]
[null,116,117,119,null,121,122,123,123,75,null,75,75,76,76,76,null,76,"Elevated"]
[null,121,122,123,null,124,126,126,127,79,null,79,79,79,80,80,null,81,"Stage 1 HT"]
[null,133,134,135,null,136,138,138,139,91,null,91,91,91,92,92,null,93,"Stage 2 HT"]
[14,59.3,60.2,61.8,null,63.5,65.2,66.8,67.7,59.3,null,60.2,61.8,63.5,65.2,66.8,null,67.7,"Height - inches"]
[null,105,106,107,null,108,109,109,109,63,null,63,64,65,66,66,null,66,"NT"]
[null,118,118,120,null,122,123,123,123,76,null,76,76,76,77,77,null,77,"Elevated"]
[null,123,123,124,null,125,126,127,127,80,null,80,80,80,81,81,null,82,"Stage 1 HT"]
[null,135,135,136,null,137,138,139,139,92,null,92,92,92,93,93,null,94,"Stage 2 HT"]
[15,59.7,60.6,62.2,null,63.9,65.6,67.2,68.1,59.7,null,60.6,62.2,63.9,65.6,67.2,null,68.1,"Height - inches"]
[null,105,106,107,null,108,109,109,109,64,null,64,64,65,66,67,null,67,"NT"]
[null,118,119,121,null,122,123,123,124,76,null,76,76,77,77,78,null,78,"Elevated"]
[null,124,124,125,null,126,127,127,128,80,null,80,80,81,82,82,null,82,"Stage 1 HT"]
[null,136,136,137,null,138,139,139,140,92,null,92,92,93,94,94,null,94,"Stage 2 HT"]
[16,59.9,60.8,62.4,null,64.1,65.8,67.3,68.3,59.9,null,60.8,62.4,64.1,65.8,67.3,null,68.3,"Height - inches"]
[null,106,107,108,null,109,109,110,110,64,null,64,65,66,66,67,null,67,"NT"]
[null,119,120,122,null,123,124,124,124,76,null,76,76,77,78,78,null,78,"Elevated"]
[null,124,125,125,null,127,127,128,128,80,null,80,80,81,82,82,null,82,"Stage 1 HT"]
[null,136,137,137,null,139,139,140,140,92,null,92,92,93,94,94,null,94,"Stage 2 HT"]
[17,{"v":60,"d":"60.0"},60.9,62.5,null,64.2,65.9,67.4,68.4,{"v":60,"d":"60.0"},null,60.9,62.5,64.2,65.9,67.4,null,68.4,"Height - inches"]
[null,107,108,109,null,110,110,110,111,64,null,64,65,66,66,66,null,67,"NT"]
[null,120,121,123,null,124,124,125,125,76,null,76,77,77,78,78,null,78,"Elevated"]
[null,125,125,126,null,127,128,128,128,80,null,80,80,81,82,82,null,82,"Stage 1 HT"]
[null,137,137,138,null,139,140,140,140,92,null,92,92,93,94,94,null,94,"Stage 2 HT"]
["The 90th percentile is 1.28 SD, the 95th percentile is 1.645 SD, and the 99th percentile is 2.326 SD over the mean.\nNT = normotensive (50th percentile    PreHT = pre-hypertensive (90th percentile)    HT = hypertensive (95th percentile for stage 1 and 99th% + 5 mmHg for stage 2)"]

{"sheet":"Lookup_Tables","index":11,"n_rows":1909,"n_cols":16,"rows_kept":1909}
["System Code","System Name","SysCode","School Code","Column1","School Name","SchCode",null,"Gender",null,"Exam Status",null,"Grade Level",null,"System Code","System Name"]
[10,"ANDERSON COUNTY",{"$f":"School_Listing[[#This Row],[System Code]]","v":10},3,{"$f":"School_Listing[[#This Row],[System Code]]&School_Listing[[#This Row],[School Code]]","v":"103"},"Anderson County Career Technical Center",{"$f":"School_Listing[[#This Row],[School Code]]","v":3},null,"M",null,"P",null,"K/k",null,985,"ACHIEVEMENT SCHOOL DISTRICT"]
[10,"ANDERSON COUNTY",{"$f":"School_Listing[[#This Row],[System Code]]","v":10},7001,{"$f":"School_Listing[[#This Row],[System Code]]&School_Listing[[#This Row],[School Code]]","v":"107001"},"Anderson County Head Start / Preschool",{"$f":"School_Listing[[#This Row],[School Code]]","v":7001},null,"F",null,"F",null,2,null,171,"ALAMO"]
[10,"ANDERSON COUNTY",{"$f":"School_Listing[[#This Row],[System Code]]","v":10},2,{"$f":"School_Listing[[#This Row],[System Code]]&School_Listing[[#This Row],[School Code]]","v":"102"},"Anderson County High School",{"$f":"School_Listing[[#This Row],[School Code]]","v":2},{"$nulls":3},"NA",null,4,null,51,"ALCOA"]
[10,"ANDERSON COUNTY",{"$f":"School_Listing[[#This Row],[System Code]]","v":10},4,{"$f":"School_Listing[[#This Row],[System Code]]&School_Listing[[#This Row],[School Code]]","v":"104"},"Anderson County Innovation Academy",{"$f":"School_Listing[[#This Row],[School Code]]","v":4},{"$nulls":5},6,null,961,"ALVIN C YORK INSTITUTE"]
[10,"ANDERSON COUNTY",{"$f":"School_Listing[[#This Row],[System Code]]","v":10},5,{"$f":"School_Listing[[#This Row],[System Code]]&School_Listing[[#This Row],[School Code]]","v":"105"},"Andersonville Elementary",{"$f":"School_Listing[[#This Row],[School Code]]","v":5},{"$nulls":5},8,null,10,"ANDERSON COUNTY"]
[10,"ANDERSON COUNTY",{"$f":"School_Listing[[#This Row],[System Code]]","v":10},10,{"$f":"School_Listing[[#This Row],[System Code]]&School_Listing[[#This Row],[School Code]]","v":"1010"},"Briceville Elementary",{"$f":"School_Listing[[#This Row],[School Code]]","v":10},{"$nulls":5},"H",null,793,"ARLINGTON"]
[10,"ANDERSON COUNTY",{"$f":"School_Listing[[#This Row],[System Code]]","v":10},15,{"$f":"School_Listing[[#This Row],[System Code]]&School_Listing[[#This Row],[School Code]]","v":"1015"},"Claxton Elementary",{"$f":"School_Listing[[#This Row],[School Code]]","v":15},{"$nulls":7},541,"ATHENS"]
[10,"ANDERSON COUNTY",{"$f":"School_Listing[[#This Row],[System Code]]","v":10},105,{"$f":"School_Listing[[#This Row],[System Code]]&School_Listing[[#This Row],[School Code]]","v":"10105"},"Clinch River Community School",{"$f":"School_Listing[[#This Row],[School Code]]","v":105},{"$nulls":7},794,"BARTLETT"]
[10,"ANDERSON COUNTY",{"$f":"School_Listing[[#This Row],[System Code]]","v":10},25,{"$f":"School_Listing[[#This Row],[System Code]]&School_Listing[[#This Row],[School Code]]","v":"1025"},"Clinton High School",{"$f":"School_Listing[[#This Row],[School Code]]","v":25},{"$nulls":7},20,"BEDFORD COUNTY"]
[10,"ANDERSON COUNTY",{"$f":"School_Listing[[#This Row],[System Code]]","v":10},20,{"$f":"School_Listing[[#This Row],[System Code]]&School_Listing[[#This Row],[School Code]]","v":"1020"},"Clinton Middle School",{"$f":"School_Listing[[#This Row],[School Code]]","v":20},{"$nulls":7},172,"BELLS"]
[10,"ANDERSON COUNTY",{"$f":"School_Listing[[#This Row],[System Code]]","v":10},35,{"$f":"School_Listing[[#This Row],[System Code]]&School_Listing[[#This Row],[School Code]]","v":"1035"},"Dutch Valley Elementary",{"$f":"School_Listing[[#This Row],[School Code]]","v":35},{"$nulls":7},30,"BENTON COUNTY"]
[10,"ANDERSON COUNTY",{"$f":"School_Listing[[#This Row],[System Code]]","v":10},40,{"$f":"School_Listing[[#This Row],[System Code]]&School_Listing[[#This Row],[School Code]]","v":"1040"},"Fairview Elementary",{"$f":"School_Listing[[#This Row],[School Code]]","v":40},{"$nulls":7},40,"BLEDSOE COUNTY"]
[10,"ANDERSON COUNTY",{"$f":"School_Listing[[#This Row],[System Code]]","v":10},46,{"$f":"School_Listing[[#This Row],[System Code]]&School_Listing[[#This Row],[School Code]]","v":"1046"},"Grand Oaks Elementary",{"$f":"School_Listing[[#This Row],[School Code]]","v":46},{"$nulls":7},50,"BLOUNT COUNTY"]
[10,"ANDERSON COUNTY",{"$f":"School_Listing[[#This Row],[System Code]]","v":10},50,{"$f":"School_Listing[[#This Row],[System Code]]&School_Listing[[#This Row],[School Code]]","v":"1050"},"Lake City Elementary",{"$f":"School_Listing[[#This Row],[School Code]]","v":50},{"$nulls":7},274,"BRADFORD"]
[10,"ANDERSON COUNTY",{"$f":"School_Listing[[#This Row],[System Code]]","v":10},55,{"$f":"School_Listing[[#This Row],[System Code]]&School_Listing[[#This Row],[School Code]]","v":"1055"},"Lake City Middle School",{"$f":"School_Listing[[#This Row],[School Code]]","v":55},{"$nulls":7},60,"BRADLEY COUNTY"]
[10,"ANDERSON COUNTY",{"$f":"School_Listing[[#This Row],[System Code]]","v":10},70,{"$f":"School_Listing[[#This Row],[System Code]]&School_Listing[[#This Row],[School Code]]","v":"1070"},"Norris Elementary",{"$f":"School_Listing[[#This Row],[School Code]]","v":70},{"$nulls":7},821,"BRISTOL"]
[10,"ANDERSON COUNTY",{"$f":"School_Listing[[#This Row],[System Code]]","v":10},75,{"$f":"School_Listing[[#This Row],[System Code]]&School_Listing[[#This Row],[School Code]]","v":"1075"},"Norris Middle School",{"$f":"School_Listing[[#This Row],[School Code]]","v":75},{"$nulls":7},70,"CAMPBELL COUNTY"]
[10,"ANDERSON COUNTY",{"$f":"School_Listing[[#This Row],[System Code]]","v":10},80,{"$f":"School_Listing[[#This Row],[System Code]]&School_Listing[[#This Row],[School Code]]","v":"1080"},"Norwood Elementary",{"$f":"School_Listing[[#This Row],[School Code]]","v":80},{"$nulls":7},80,"CANNON COUNTY"]
[10,"ANDERSON COUNTY",{"$f":"School_Listing[[#This Row],[System Code]]","v":10},85,{"$f":"School_Listing[[#This Row],[System Code]]&School_Listing[[#This Row],[School Code]]","v":"1085"},"Norwood Middle School",{"$f":"School_Listing[[#This Row],[School Code]]","v":85},{"$nulls":7},90,"CARROLL COUNTY"]
[11,"CLINTON",{"$f":"School_Listing[[#This Row],[System Code]]","v":11},5,{"$f":"School_Listing[[#This Row],[System Code]]&School_Listing[[#This Row],[School Code]]","v":"115"},"Clinton Elementary",{"$f":"School_Listing[[#This Row],[School Code]]","v":5},{"$nulls":7},100,"CARTER COUNTY"]
[11,"CLINTON",{"$f":"School_Listing[[#This Row],[System Code]]","v":11},10,{"$f":"School_Listing[[#This Row],[System Code]]&School_Listing[[#This Row],[School Code]]","v":"1110"},"North Clinton Elementary",{"$f":"School_Listing[[#This Row],[School Code]]","v":10},{"$nulls":7},110,"CHEATHAM COUNTY"]
[11,"CLINTON",{"$f":"School_Listing[[#This Row],[System Code]]","v":11},15,{"$f":"School_Listing[[#This Row],[System Code]]&School_Listing[[#This Row],[School Code]]","v":"1115"},"South Clinton Elementary",{"$f":"School_Listing[[#This Row],[School Code]]","v":15},{"$nulls":7},120,"CHESTER COUNTY"]
[12,"OAK RIDGE",{"$f":"School_Listing[[#This Row],[System Code]]","v":12},15,{"$f":"School_Listing[[#This Row],[System Code]]&School_Listing[[#This Row],[School Code]]","v":"1215"},"Glenwood Elementary",{"$f":"School_Listing[[#This Row],[School Code]]","v":15},{"$nulls":7},130,"CLAIBORNE COUNTY"]
[12,"OAK RIDGE",{"$f":"School_Listing[[#This Row],[System Code]]","v":12},25,{"$f":"School_Listing[[#This Row],[System Code]]&School_Listing[[#This Row],[School Code]]","v":"1225"},"Jefferson Middle School",{"$f":"School_Listing[[#This Row],[School Code]]","v":25},{"$nulls":7},140,"CLAY COUNTY"]
[12,"OAK RIDGE",{"$f":"School_Listing[[#This Row],[System Code]]","v":12},30,{"$f":"School_Listing[[#This Row],[System Code]]&School_Listing[[#This Row],[School Code]]","v":"1230"},"Linden Elementary",{"$f":"School_Listing[[#This Row],[School Code]]","v":30},{"$nulls":7},61,"CLEVELAND"]
[12,"OAK RIDGE",{"$f":"School_Listing[[#This Row],[System Code]]","v":12},35,{"$f":"School_Listing[[#This Row],[System Code]]&School_Listing[[#This Row],[School Code]]","v":"1235"},"Oak Ridge High School",{"$f":"School_Listing[[#This Row],[School Code]]","v":35},{"$nulls":7},11,"CLINTON"]
[12,"OAK RIDGE",{"$f":"School_Listing[[#This Row],[System Code]]","v":12},43,{"$f":"School_Listing[[#This Row],[System Code]]&School_Listing[[#This Row],[School Code]]","v":"1243"},"Preschool",{"$f":"School_Listing[[#This Row],[School Code]]","v":43},{"$nulls":7},150,"COCKE COUNTY"]
[12,"OAK RIDGE",{"$f":"School_Listing[[#This Row],[System Code]]","v":12},40,{"$f":"School_Listing[[#This Row],[System Code]]&School_Listing[[#This Row],[School Code]]","v":"1240"},"Robertsville Middle School",{"$f":"School_Listing[[#This Row],[School Code]]","v":40},{"$nulls":7},160,"COFFEE COUNTY"]
[12,"OAK RIDGE",{"$f":"School_Listing[[#This Row],[System Code]]","v":12},45,{"$f":"School_Listing[[#This Row],[System Code]]&School_Listing[[#This Row],[School Code]]","v":"1245"},"Willow Brook Elementary",{"$f":"School_Listing[[#This Row],[School Code]]","v":45},{"$nulls":7},795,"COLLIERVILLE"]
[12,"OAK RIDGE",{"$f":"School_Listing[[#This Row],[System Code]]","v":12},50,{"$f":"School_Listing[[#This Row],[System Code]]&School_Listing[[#This Row],[School Code]]","v":"1250"},"Woodland Elementary",{"$f":"School_Listing[[#This Row],[School Code]]","v":50},{"$nulls":7},170,"CROCKETT COUNTY"]
[20,"BEDFORD COUNTY",{"$f":"School_Listing[[#This Row],[System Code]]","v":20},11,{"$f":"School_Listing[[#This Row],[System Code]]&School_Listing[[#This Row],[School Code]]","v":"2011"},"Bedford County Virtual School",{"$f":"School_Listing[[#This Row],[School Code]]","v":11},{"$nulls":7},180,"CUMBERLAND COUNTY"]
[20,"BEDFORD COUNTY",{"$f":"School_Listing[[#This Row],[System Code]]","v":20},12,{"$f":"School_Listing[[#This Row],[System Code]]&School_Listing[[#This Row],[School Code]]","v":"2012"},"Cascade Elementary",{"$f":"School_Listing[[#This Row],[School Code]]","v":12},{"$nulls":7},190,"DAVIDSON COUNTY"]
[20,"BEDFORD COUNTY",{"$f":"School_Listing[[#This Row],[System Code]]","v":20},13,{"$f":"School_Listing[[#This Row],[System Code]]&School_Listing[[#This Row],[School Code]]","v":"2013"},"Cascade High School",{"$f":"School_Listing[[#This Row],[School Code]]","v":13},{"$nulls":7},721,"DAYTON"]
[20,"BEDFORD COUNTY",{"$f":"School_Listing[[#This Row],[System Code]]","v":20},17,{"$f":"School_Listing[[#This Row],[System Code]]&School_Listing[[#This Row],[School Code]]","v":"2017"},"Cascade Middle School",{"$f":"School_Listing[[#This Row],[School Code]]","v":17},{"$nulls":7},200,"DECATUR COUNTY"]
[20,"BEDFORD COUNTY",{"$f":"School_Listing[[#This Row],[System Code]]","v":20},33,{"$f":"School_Listing[[#This Row],[System Code]]&School_Listing[[#This Row],[School Code]]","v":"2033"},"Community Elementary School",{"$f":"School_Listing[[#This Row],[School Code]]","v":33},{"$nulls":7},210,"DEKALB COUNTY"]
[20,"BEDFORD COUNTY",{"$f":"School_Listing[[#This Row],[System Code]]","v":20},35,{"$f":"School_Listing[[#This Row],[System Code]]&School_Listing[[#This Row],[School Code]]","v":"2035"},"Community High School",{"$f":"School_Listing[[#This Row],[School Code]]","v":35},{"$nulls":7},970,"DEPARTMENT OF CHILDREN'S SERVICES EDUCATION DIVISION"]
[20,"BEDFORD COUNTY",{"$f":"School_Listing[[#This Row],[System Code]]","v":20},37,{"$f":"School_Listing[[#This Row],[System Code]]&School_Listing[[#This Row],[School Code]]","v":"2037"},"Community Middle School",{"$f":"School_Listing[[#This Row],[School Code]]","v":37},{"$nulls":7},971,"DEPARTMENT OF CORRECTION"]
[20,"BEDFORD COUNTY",{"$f":"School_Listing[[#This Row],[System Code]]","v":20},15,{"$f":"School_Listing[[#This Row],[System Code]]&School_Listing[[#This Row],[School Code]]","v":"2015"},"Eakin Elementary",{"$f":"School_Listing[[#This Row],[School Code]]","v":15},{"$nulls":7},972,"DEPT OF MENTAL HEALTH"]
[20,"BEDFORD COUNTY",{"$f":"School_Listing[[#This Row],[System Code]]","v":20},40,{"$f":"School_Listing[[#This Row],[System Code]]&School_Listing[[#This Row],[School Code]]","v":"2040"},"East Side Elementary",{"$f":"School_Listing[[#This Row],[School Code]]","v":40},{"$nulls":7},220,"DICKSON COUNTY"]
[20,"BEDFORD COUNTY",{"$f":"School_Listing[[#This Row],[System Code]]","v":20},25,{"$f":"School_Listing[[#This Row],[System Code]]&School_Listing[[#This Row],[School Code]]","v":"2025"},"Harris Middle School",{"$f":"School_Listing[[#This Row],[School Code]]","v":25},{"$nulls":7},230,"DYER COUNTY"]
[20,"BEDFORD COUNTY",{"$f":"School_Listing[[#This Row],[System Code]]","v":20},39,{"$f":"School_Listing[[#This Row],[System Code]]&School_Listing[[#This Row],[School Code]]","v":"2039"},"Learning Way Elementary",{"$f":"School_Listing[[#This Row],[School Code]]","v":39},{"$nulls":7},231,"DYERSBURG"]
[20,"BEDFORD COUNTY",{"$f":"School_Listing[[#This Row],[System Code]]","v":20},53,{"$f":"School_Listing[[#This Row],[System Code]]&School_Listing[[#This Row],[School Code]]","v":"2053"},"Liberty Elementary",{"$f":"School_Listing[[#This Row],[School Code]]","v":53},{"$nulls":7},101,"ELIZABETHTON"]
[20,"BEDFORD COUNTY",{"$f":"School_Listing[[#This Row],[System Code]]","v":20},20,{"$f":"School_Listing[[#This Row],[System Code]]&School_Listing[[#This Row],[School Code]]","v":"2020"},"Shelbyville Central High School",{"$f":"School_Listing[[#This Row],[School Code]]","v":20},{"$nulls":7},542,"ETOWAH"]
[20,"BEDFORD COUNTY",{"$f":"School_Listing[[#This Row],[System Code]]","v":20},75,{"$f":"School_Listing[[#This Row],[System Code]]&School_Listing[[#This Row],[School Code]]","v":"2075"},"South Side Elementary",{"$f":"School_Listing[[#This Row],[School Code]]","v":75},{"$nulls":7},240,"FAYETTE COUNTY PUBLIC SCHOOLS"]
[20,"BEDFORD COUNTY",{"$f":"School_Listing[[#This Row],[System Code]]","v":20},78,{"$f":"School_Listing[[#This Row],[System Code]]&School_Listing[[#This Row],[School Code]]","v":"2078"},"Thomas Magnet School",{"$f":"School_Listing[[#This Row],[School Code]]","v":78},{"$nulls":7},521,"FAYETTEVILLE"]
[30,"BENTON COUNTY",{"$f":"School_Listing[[#This Row],[System Code]]","v":30},4,{"$f":"School_Listing[[#This Row],[System Code]]&School_Listing[[#This Row],[School Code]]","v":"304"},"Benton County Academy",{"$f":"School_Listing[[#This Row],[School Code]]","v":4},{"$nulls":7},250,"FENTRESS COUNTY"]
[30,"BENTON COUNTY",{"$f":"School_Listing[[#This Row],[System Code]]","v":30},10,{"$f":"School_Listing[[#This Row],[System Code]]&School_Listing[[#This Row],[School Code]]","v":"3010"},"Big Sandy School",{"$f":"School_Listing[[#This Row],[School Code]]","v":10},{"$nulls":7},260,"FRANKLIN COUNTY"]
[30,"BENTON COUNTY",{"$f":"School_Listing[[#This Row],[System Code]]","v":30},15,{"$f":"School_Listing[[#This Row],[System Code]]&School_Listing[[#This Row],[School Code]]","v":"3015"},"Briarwood School",{"$f":"School_Listing[[#This Row],[School Code]]","v":15},{"$nulls":7},941,"FRANKLIN SSD"]
[30,"BENTON COUNTY",{"$f":"School_Listing[[#This Row],[System Code]]","v":30},25,{"$f":"School_Listing[[#This Row],[System Code]]&School_Listing[[#This Row],[School Code]]","v":"3025"},"Camden Central High School",{"$f":"School_Listing[[#This Row],[School Code]]","v":25},{"$nulls":7},796,"GERMANTOWN"]
[30,"BENTON COUNTY",{"$f":"School_Listing[[#This Row],[System Code]]","v":30},20,{"$f":"School_Listing[[#This Row],[System Code]]&School_Listing[[#This Row],[School Code]]","v":"3020"},"Camden Elementary",{"$f":"School_Listing[[#This Row],[School Code]]","v":20},{"$nulls":7},275,"GIBSON CO SP DIST"]
[30,"BENTON COUNTY",{"$f":"School_Listing[[#This Row],[System Code]]","v":30},27,{"$f":"School_Listing[[#This Row],[System Code]]&School_Listing[[#This Row],[School Code]]","v":"3027"},"Camden Jr High School",{"$f":"School_Listing[[#This Row],[School Code]]","v":27},{"$nulls":7},280,"GILES COUNTY"]
[30,"BENTON COUNTY",{"$f":"School_Listing[[#This Row],[System Code]]","v":30},30,{"$f":"School_Listing[[#This Row],[System Code]]&School_Listing[[#This Row],[School Code]]","v":"3030"},"Holladay Elementary",{"$f":"School_Listing[[#This Row],[School Code]]","v":30},{"$nulls":7},290,"GRAINGER COUNTY"]
[30,"BENTON COUNTY",{"$f":"School_Listing[[#This Row],[System Code]]","v":30},9,{"$f":"School_Listing[[#This Row],[System Code]]&School_Listing[[#This Row],[School Code]]","v":"309"},"Senator Frank P. Lashlee Career and Technical Center",{"$f":"School_Listing[[#This Row],[School Code]]","v":9},{"$nulls":7},300,"GREENE COUNTY"]
[40,"BLEDSOE COUNTY",{"$f":"School_Listing[[#This Row],[System Code]]","v":40},5,{"$f":"School_Listing[[#This Row],[System Code]]&School_Listing[[#This Row],[School Code]]","v":"405"},"Bledsoe County High School",{"$f":"School_Listing[[#This Row],[School Code]]","v":5},{"$nulls":7},301,"GREENEVILLE"]
[40,"BLEDSOE COUNTY",{"$f":"School_Listing[[#This Row],[System Code]]","v":40},6,{"$f":"School_Listing[[#This Row],[System Code]]&School_Listing[[#This Row],[School Code]]","v":"406"},"Bledsoe County Middle School",{"$f":"School_Listing[[#This Row],[School Code]]","v":6},{"$nulls":7},310,"GRUNDY COUNTY"]
[40,"BLEDSOE COUNTY",{"$f":"School_Listing[[#This Row],[System Code]]","v":40},10,{"$f":"School_Listing[[#This Row],[System Code]]&School_Listing[[#This Row],[School Code]]","v":"4010"},"Cecil B Rigsby Elementary",{"$f":"School_Listing[[#This Row],[School Code]]","v":10},{"$nulls":7},320,"HAMBLEN COUNTY"]
[40,"BLEDSOE COUNTY",{"$f":"School_Listing[[#This Row],[System Code]]","v":40},25,{"$f":"School_Listing[[#This Row],[System Code]]&School_Listing[[#This Row],[School Code]]","v":"4025"},"Mary V Wheeler Elementary",{"$f":"School_Listing[[#This Row],[School Code]]","v":25},{"$nulls":7},330,"HAMILTON COUNTY"]
[40,"BLEDSOE COUNTY",{"$f":"School_Listing[[#This Row],[System Code]]","v":40},30,{"$f":"School_Listing[[#This Row],[System Code]]&School_Listing[[#This Row],[School Code]]","v":"4030"},"Pikeville Elementary",{"$f":"School_Listing[[#This Row],[School Code]]","v":30},{"$nulls":7},340,"HANCOCK COUNTY"]
[50,"BLOUNT COUNTY",{"$f":"School_Listing[[#This Row],[System Code]]","v":50},22,{"$f":"School_Listing[[#This Row],[System Code]]&School_Listing[[#This Row],[School Code]]","v":"5022"},"Carpenters Elementary School",{"$f":"School_Listing[[#This Row],[School Code]]","v":22},{"$nulls":7},350,"HARDEMAN COUNTY SCHOOLS"]
[50,"BLOUNT COUNTY",{"$f":"School_Listing[[#This Row],[System Code]]","v":50},23,{"$f":"School_Listing[[#This Row],[System Code]]&School_Listing[[#This Row],[School Code]]","v":"5023"},"Carpenters Middle School",{"$f":"School_Listing[[#This Row],[School Code]]","v":23},{"$nulls":7},360,"HARDIN COUNTY"]
[50,"BLOUNT COUNTY",{"$f":"School_Listing[[#This Row],[System Code]]","v":50},7001,{"$f":"School_Listing[[#This Row],[System Code]]&School_Listing[[#This Row],[School Code]]","v":"507001"},"Eagleton 1 Head Start",{"$f":"School_Listing[[#This Row],[School Code]]","v":7001},{"$nulls":7},370,"HAWKINS COUNTY"]
[50,"BLOUNT COUNTY",{"$f":"School_Listing[[#This Row],[System Code]]","v":50},31,{"$f":"School_Listing[[#This Row],[System Code]]&School_Listing[[#This Row],[School Code]]","v":"5031"},"Eagleton College and Career Academy",{"$f":"School_Listing[[#This Row],[School Code]]","v":31},{"$nulls":7},380,"HAYWOOD COUNTY"]
[50,"BLOUNT COUNTY",{"$f":"School_Listing[[#This Row],[System Code]]","v":50},43,{"$f":"School_Listing[[#This Row],[System Code]]&School_Listing[[#This Row],[School Code]]","v":"5043"},"Eagleton Elementary",{"$f":"School_Listing[[#This Row],[School Code]]","v":43},{"$nulls":7},390,"HENDERSON COUNTY"]
[50,"BLOUNT COUNTY",{"$f":"School_Listing[[#This Row],[System Code]]","v":50},45,{"$f":"School_Listing[[#This Row],[System Code]]&School_Listing[[#This Row],[School Code]]","v":"5045"},"Fairview Elementary",{"$f":"School_Listing[[#This Row],[School Code]]","v":45},{"$nulls":7},400,"HENRY COUNTY"]
[50,"BLOUNT COUNTY",{"$f":"School_Listing[[#This Row],[System Code]]","v":50},55,{"$f":"School_Listing[[#This Row],[System Code]]&School_Listing[[#This Row],[School Code]]","v":"5055"},"Friendsville Elementary",{"$f":"School_Listing[[#This Row],[School Code]]","v":55},{"$nulls":7},410,"HICKMAN COUNTY"]
[50,"BLOUNT COUNTY",{"$f":"School_Listing[[#This Row],[System Code]]","v":50},63,{"$f":"School_Listing[[#This Row],[System Code]]&School_Listing[[#This Row],[School Code]]","v":"5063"},"Heritage High School",{"$f":"School_Listing[[#This Row],[School Code]]","v":63},{"$nulls":7},92,"HOLLOW ROCK - BRUCETON"]
[50,"BLOUNT COUNTY",{"$f":"School_Listing[[#This Row],[System Code]]","v":50},61,{"$f":"School_Listing[[#This Row],[System Code]]&School_Listing[[#This Row],[School Code]]","v":"5061"},"Heritage Middle School",{"$f":"School_Listing[[#This Row],[School Code]]","v":61},{"$nulls":7},420,"HOUSTON COUNTY"]
[50,"BLOUNT COUNTY",{"$f":"School_Listing[[#This Row],[System Code]]","v":50},70,{"$f":"School_Listing[[#This Row],[System Code]]&School_Listing[[#This Row],[School Code]]","v":"5070"},"Lanier Elementary",{"$f":"School_Listing[[#This Row],[School Code]]","v":70},{"$nulls":7},271,"HUMBOLDT CITY SCHOOLS"]
[50,"BLOUNT COUNTY",{"$f":"School_Listing[[#This Row],[System Code]]","v":50},90,{"$f":"School_Listing[[#This Row],[System Code]]&School_Listing[[#This Row],[School Code]]","v":"5090"},"Mary Blount Elementary",{"$f":"School_Listing[[#This Row],[School Code]]","v":90},{"$nulls":7},430,"HUMPHREYS COUNTY"]
[50,"BLOUNT COUNTY",{"$f":"School_Listing[[#This Row],[System Code]]","v":50},93,{"$f":"School_Listing[[#This Row],[System Code]]&School_Listing[[#This Row],[School Code]]","v":"5093"},"Middlesettlements",{"$f":"School_Listing[[#This Row],[School Code]]","v":93},{"$nulls":7},93,"HUNTINGDON SPECIAL SCHOOL DISTRICT"]
[50,"BLOUNT COUNTY",{"$f":"School_Listing[[#This Row],[System Code]]","v":50},94,{"$f":"School_Listing[[#This Row],[System Code]]&School_Listing[[#This Row],[School Code]]","v":"5094"},"Montvale Elementary",{"$f":"School_Listing[[#This Row],[School Code]]","v":94},{"$nulls":7},440,"JACKSON COUNTY"]
[50,"BLOUNT COUNTY",{"$f":"School_Listing[[#This Row],[System Code]]","v":50},95,{"$f":"School_Listing[[#This Row],[System Code]]&School_Listing[[#This Row],[School Code]]","v":"5095"},"Porter Elementary",{"$f":"School_Listing[[#This Row],[School Code]]","v":95},{"$nulls":7},450,"JEFFERSON COUNTY"]
[50,"BLOUNT COUNTY",{"$f":"School_Listing[[#This Row],[System Code]]","v":50},160,{"$f":"School_Listing[[#This Row],[System Code]]&School_Listing[[#This Row],[School Code]]","v":"50160"},"Prospect Elementary School",{"$f":"School_Listing[[#This Row],[School Code]]","v":160},{"$nulls":7},901,"JOHNSON CITY"]
[50,"BLOUNT COUNTY",{"$f":"School_Listing[[#This Row],[System Code]]","v":50},110,{"$f":"School_Listing[[#This Row],[System Code]]&School_Listing[[#This Row],[School Code]]","v":"50110"},"Rockford Elementary",{"$f":"School_Listing[[#This Row],[School Code]]","v":110},{"$nulls":7},460,"JOHNSON COUNTY"]
[50,"BLOUNT COUNTY",{"$f":"School_Listing[[#This Row],[System Code]]","v":50},123,{"$f":"School_Listing[[#This Row],[System Code]]&School_Listing[[#This Row],[School Code]]","v":"50123"},"Samuel Everett School of Innovation",{"$f":"School_Listing[[#This Row],[School Code]]","v":123},{"$nulls":7},822,"KINGSPORT"]
[50,"BLOUNT COUNTY",{"$f":"School_Listing[[#This Row],[System Code]]","v":50},125,{"$f":"School_Listing[[#This Row],[System Code]]&School_Listing[[#This Row],[School Code]]","v":"50125"},"Townsend Elementary",{"$f":"School_Listing[[#This Row],[School Code]]","v":125},{"$nulls":7},470,"KNOX COUNTY"]
[50,"BLOUNT COUNTY",{"$f":"School_Listing[[#This Row],[System Code]]","v":50},138,{"$f":"School_Listing[[#This Row],[System Code]]&School_Listing[[#This Row],[School Code]]","v":"50138"},"Union Grove Elementary School",{"$f":"School_Listing[[#This Row],[School Code]]","v":138},{"$nulls":7},480,"LAKE COUNTY"]
[50,"BLOUNT COUNTY",{"$f":"School_Listing[[#This Row],[System Code]]","v":50},84,{"$f":"School_Listing[[#This Row],[System Code]]&School_Listing[[#This Row],[School Code]]","v":"5084"},"Union Grove Middle School",{"$f":"School_Listing[[#This Row],[School Code]]","v":84},{"$nulls":7},797,"LAKELAND"]
[50,"BLOUNT COUNTY",{"$f":"School_Listing[[#This Row],[System Code]]","v":50},145,{"$f":"School_Listing[[#This Row],[System Code]]&School_Listing[[#This Row],[School Code]]","v":"50145"},"Walland Elementary School",{"$f":"School_Listing[[#This Row],[School Code]]","v":145},{"$nulls":7},490,"LAUDERDALE COUNTY"]
[50,"BLOUNT COUNTY",{"$f":"School_Listing[[#This Row],[System Code]]","v":50},155,{"$f":"School_Listing[[#This Row],[System Code]]&School_Listing[[#This Row],[School Code]]","v":"50155"},"William Blount High School",{"$f":"School_Listing[[#This Row],[School Code]]","v":155},{"$nulls":7},500,"LAWRENCE COUNTY"]
[51,"ALCOA",{"$f":"School_Listing[[#This Row],[System Code]]","v":51},5,{"$f":"School_Listing[[#This Row],[System Code]]&School_Listing[[#This Row],[School Code]]","v":"515"},"Alcoa Elementary",{"$f":"School_Listing[[#This Row],[School Code]]","v":5},{"$nulls":7},951,"LEBANON"]
[51,"ALCOA",{"$f":"School_Listing[[#This Row],[System Code]]","v":51},10,{"$f":"School_Listing[[#This Row],[System Code]]&School_Listing[[#This Row],[School Code]]","v":"5110"},"Alcoa High School",{"$f":"School_Listing[[#This Row],[School Code]]","v":10},{"$nulls":7},531,"LENOIR CITY"]
[51,"ALCOA",{"$f":"School_Listing[[#This Row],[System Code]]","v":51},12,{"$f":"School_Listing[[#This Row],[System Code]]&School_Listing[[#This Row],[School Code]]","v":"5112"},"Alcoa Intermediate School",{"$f":"School_Listing[[#This Row],[School Code]]","v":12},{"$nulls":7},510,"LEWIS COUNTY"]
[51,"ALCOA",{"$f":"School_Listing[[#This Row],[System Code]]","v":51},6,{"$f":"School_Listing[[#This Row],[System Code]]&School_Listing[[#This Row],[School Code]]","v":"516"},"Alcoa Middle School",{"$f":"School_Listing[[#This Row],[School Code]]","v":6},{"$nulls":7},391,"LEXINGTON"]
[52,"MARYVILLE",{"$f":"School_Listing[[#This Row],[System Code]]","v":52},35,{"$f":"School_Listing[[#This Row],[System Code]]&School_Listing[[#This Row],[School Code]]","v":"5235"},"Coulter Grove Intermediate School",{"$f":"School_Listing[[#This Row],[School Code]]","v":35},{"$nulls":7},520,"LINCOLN COUNTY"]
[52,"MARYVILLE",{"$f":"School_Listing[[#This Row],[System Code]]","v":52},30,{"$f":"School_Listing[[#This Row],[System Code]]&School_Listing[[#This Row],[School Code]]","v":"5230"},"Foothills Elementary",{"$f":"School_Listing[[#This Row],[School Code]]","v":30},{"$nulls":7},530,"LOUDON COUNTY"]
[52,"MARYVILLE",{"$f":"School_Listing[[#This Row],[System Code]]","v":52},10,{"$f":"School_Listing[[#This Row],[System Code]]&School_Listing[[#This Row],[School Code]]","v":"5210"},"John Sevier Elementary",{"$f":"School_Listing[[#This Row],[School Code]]","v":10},{"$nulls":7},560,"MACON COUNTY"]
[52,"MARYVILLE",{"$f":"School_Listing[[#This Row],[System Code]]","v":52},15,{"$f":"School_Listing[[#This Row],[System Code]]&School_Listing[[#This Row],[School Code]]","v":"5215"},"Maryville High School",{"$f":"School_Listing[[#This Row],[School Code]]","v":15},{"$nulls":7},570,"MADISON COUNTY"]
[52,"MARYVILLE",{"$f":"School_Listing[[#This Row],[System Code]]","v":52},20,{"$f":"School_Listing[[#This Row],[System Code]]&School_Listing[[#This Row],[School Code]]","v":"5220"},"Maryville Junior High School",{"$f":"School_Listing[[#This Row],[School Code]]","v":20},{"$nulls":7},161,"MANCHESTER"]
[52,"MARYVILLE",{"$f":"School_Listing[[#This Row],[System Code]]","v":52},22,{"$f":"School_Listing[[#This Row],[System Code]]&School_Listing[[#This Row],[School Code]]","v":"5222"},"Maryville Virtual School",{"$f":"School_Listing[[#This Row],[School Code]]","v":22},{"$nulls":7},580,"MARION COUNTY"]
[52,"MARYVILLE",{"$f":"School_Listing[[#This Row],[System Code]]","v":52},18,{"$f":"School_Listing[[#This Row],[System Code]]&School_Listing[[#This Row],[School Code]]","v":"5218"},"Montgomery Ridge Intermediate School",{"$f":"School_Listing[[#This Row],[School Code]]","v":18},{"$nulls":7},590,"MARSHALL COUNTY"]
[52,"MARYVILLE",{"$f":"School_Listing[[#This Row],[System Code]]","v":52},25,{"$f":"School_Listing[[#This Row],[System Code]]&School_Listing[[#This Row],[School Code]]","v":"5225"},"Sam Houston Elementary",{"$f":"School_Listing[[#This Row],[School Code]]","v":25},{"$nulls":7},52,"MARYVILLE"]
[60,"BRADLEY COUNTY",{"$f":"School_Listing[[#This Row],[System Code]]","v":60},10,{"$f":"School_Listing[[#This Row],[System Code]]&School_Listing[[#This Row],[School Code]]","v":"6010"},"Black Fox Elementary School",{"$f":"School_Listing[[#This Row],[School Code]]","v":10},{"$nulls":7},600,"MAURY COUNTY"]
[60,"BRADLEY COUNTY",{"$f":"School_Listing[[#This Row],[System Code]]","v":60},20,{"$f":"School_Listing[[#This Row],[System Code]]&School_Listing[[#This Row],[School Code]]","v":"6020"},"Bradley Central High School",{"$f":"School_Listing[[#This Row],[School Code]]","v":20},{"$nulls":7},94,"MCKENZIE"]
[60,"BRADLEY COUNTY",{"$f":"School_Listing[[#This Row],[System Code]]","v":60},105,{"$f":"School_Listing[[#This Row],[System Code]]&School_Listing[[#This Row],[School Code]]","v":"60105"},"Bradley County Virtual School",{"$f":"School_Listing[[#This Row],[School Code]]","v":105},{"$nulls":7},540,"MCMINN COUNTY"]
[60,"BRADLEY COUNTY",{"$f":"School_Listing[[#This Row],[System Code]]","v":60},30,{"$f":"School_Listing[[#This Row],[System Code]]&School_Listing[[#This Row],[School Code]]","v":"6030"},"Charleston Elementary School",{"$f":"School_Listing[[#This Row],[School Code]]","v":30},{"$nulls":7},550,"MCNAIRY COUNTY"]
[60,"BRADLEY COUNTY",{"$f":"School_Listing[[#This Row],[System Code]]","v":60},40,{"$f":"School_Listing[[#This Row],[System Code]]&School_Listing[[#This Row],[School Code]]","v":"6040"},"Hopewell Elementary School",{"$f":"School_Listing[[#This Row],[School Code]]","v":40},{"$nulls":7},610,"MEIGS COUNTY"]
[60,"BRADLEY COUNTY",{"$f":"School_Listing[[#This Row],[System Code]]","v":60},72,{"$f":"School_Listing[[#This Row],[System Code]]&School_Listing[[#This Row],[School Code]]","v":"6072"},"Lake Forest Middle School",{"$f":"School_Listing[[#This Row],[School Code]]","v":72},{"$nulls":7},792,"MEMPHIS-SHELBY COUNTY SCHOOLS"]
[60,"BRADLEY COUNTY",{"$f":"School_Listing[[#This Row],[System Code]]","v":60},50,{"$f":"School_Listing[[#This Row],[System Code]]&School_Listing[[#This Row],[School Code]]","v":"6050"},"Michigan Avenue Elementary School",{"$f":"School_Listing[[#This Row],[School Code]]","v":50},{"$nulls":7},272,"MILAN"]
[60,"BRADLEY COUNTY",{"$f":"School_Listing[[#This Row],[System Code]]","v":60},53,{"$f":"School_Listing[[#This Row],[System Code]]&School_Listing[[#This Row],[School Code]]","v":"6053"},"North Cleveland GOAL Academy",{"$f":"School_Listing[[#This Row],[School Code]]","v":53},{"$nulls":7},798,"MILLINGTON MUNICIPAL SCHOOLS"]
[60,"BRADLEY COUNTY",{"$f":"School_Listing[[#This Row],[System Code]]","v":60},55,{"$f":"School_Listing[[#This Row],[System Code]]&School_Listing[[#This Row],[School Code]]","v":"6055"},"North Lee Elementary School",{"$f":"School_Listing[[#This Row],[School Code]]","v":55},{"$nulls":7},620,"MONROE COUNTY"]
[60,"BRADLEY COUNTY",{"$f":"School_Listing[[#This Row],[System Code]]","v":60},60,{"$f":"School_Listing[[#This Row],[System Code]]&School_Listing[[#This Row],[School Code]]","v":"6060"},"Oak Grove Elementary School",{"$f":"School_Listing[[#This Row],[School Code]]","v":60},{"$nulls":7},630,"MONTGOMERY COUNTY"]
[60,"BRADLEY COUNTY",{"$f":"School_Listing[[#This Row],[System Code]]","v":60},18,{"$f":"School_Listing[[#This Row],[System Code]]&School_Listing[[#This Row],[School Code]]","v":"6018"},"Ocoee Middle School",{"$f":"School_Listing[[#This Row],[School Code]]","v":18},{"$nulls":7},640,"MOORE COUNTY"]
[60,"BRADLEY COUNTY",{"$f":"School_Listing[[#This Row],[System Code]]","v":60},102,{"$f":"School_Listing[[#This Row],[System Code]]&School_Listing[[#This Row],[School Code]]","v":"60102"},"Park View Elementary School",{"$f":"School_Listing[[#This Row],[School Code]]","v":102},{"$nulls":7},650,"MORGAN COUNTY"]
[60,"BRADLEY COUNTY",{"$f":"School_Listing[[#This Row],[System Code]]","v":60},62,{"$f":"School_Listing[[#This Row],[System Code]]&School_Listing[[#This Row],[School Code]]","v":"6062"},"PIE Innovation Center",{"$f":"School_Listing[[#This Row],[School Code]]","v":62},{"$nulls":7},751,"MURFREESBORO"]
[60,"BRADLEY COUNTY",{"$f":"School_Listing[[#This Row],[System Code]]","v":60},65,{"$f":"School_Listing[[#This Row],[System Code]]&School_Listing[[#This Row],[School Code]]","v":"6065"},"Prospect Elementary School",{"$f":"School_Listing[[#This Row],[School Code]]","v":65},{"$nulls":7},151,"NEWPORT"]
[60,"BRADLEY COUNTY",{"$f":"School_Listing[[#This Row],[System Code]]","v":60},70,{"$f":"School_Listing[[#This Row],[System Code]]&School_Listing[[#This Row],[School Code]]","v":"6070"},"Taylor Elementary School",{"$f":"School_Listing[[#This Row],[School Code]]","v":70},{"$nulls":7},12,"OAK RIDGE"]
[60,"BRADLEY COUNTY",{"$f":"School_Listing[[#This Row],[System Code]]","v":60},75,{"$f":"School_Listing[[#This Row],[System Code]]&School_Listing[[#This Row],[School Code]]","v":"6075"},"Valley View Elementary School",{"$f":"School_Listing[[#This Row],[School Code]]","v":75},{"$nulls":7},660,"OBION COUNTY"]
[60,"BRADLEY COUNTY",{"$f":"School_Listing[[#This Row],[System Code]]","v":60},78,{"$f":"School_Listing[[#This Row],[System Code]]&School_Listing[[#This Row],[School Code]]","v":"6078"},"Walker Valley High School",{"$f":"School_Listing[[#This Row],[School Code]]","v":78},{"$nulls":7},761,"ONEIDA"]
[60,"BRADLEY COUNTY",{"$f":"School_Listing[[#This Row],[System Code]]","v":60},100,{"$f":"School_Listing[[#This Row],[System Code]]&School_Listing[[#This Row],[School Code]]","v":"60100"},"Waterville Community Elementary School",{"$f":"School_Listing[[#This Row],[School Code]]","v":100},{"$nulls":7},670,"OVERTON COUNTY"]
[61,"CLEVELAND",{"$f":"School_Listing[[#This Row],[System Code]]","v":61},10,{"$f":"School_Listing[[#This Row],[System Code]]&School_Listing[[#This Row],[School Code]]","v":"6110"},"Arnold Memorial Elementary",{"$f":"School_Listing[[#This Row],[School Code]]","v":10},{"$nulls":7},401,"PARIS"]
[61,"CLEVELAND",{"$f":"School_Listing[[#This Row],[System Code]]","v":61},12,{"$f":"School_Listing[[#This Row],[System Code]]&School_Listing[[#This Row],[School Code]]","v":"6112"},"Blythe-Bower Elementary",{"$f":"School_Listing[[#This Row],[School Code]]","v":12},{"$nulls":7},680,"PERRY COUNTY"]
[61,"CLEVELAND",{"$f":"School_Listing[[#This Row],[System Code]]","v":61},45,{"$f":"School_Listing[[#This Row],[System Code]]&School_Listing[[#This Row],[School Code]]","v":"6145"},"Candy's Creek Cherokee Elementary School",{"$f":"School_Listing[[#This Row],[School Code]]","v":45},{"$nulls":7},690,"PICKETT COUNTY"]
[61,"CLEVELAND",{"$f":"School_Listing[[#This Row],[System Code]]","v":61},20,{"$f":"School_Listing[[#This Row],[System Code]]&School_Listing[[#This Row],[School Code]]","v":"6120"},"Cleveland High",{"$f":"School_Listing[[#This Row],[School Code]]","v":20},{"$nulls":7},700,"POLK COUNTY"]
[61,"CLEVELAND",{"$f":"School_Listing[[#This Row],[System Code]]","v":61},18,{"$f":"School_Listing[[#This Row],[System Code]]&School_Listing[[#This Row],[School Code]]","v":"6118"},"Cleveland Middle",{"$f":"School_Listing[[#This Row],[School Code]]","v":18},{"$nulls":7},710,"PUTNAM COUNTY"]
[61,"CLEVELAND",{"$f":"School_Listing[[#This Row],[System Code]]","v":61},21,{"$f":"School_Listing[[#This Row],[System Code]]&School_Listing[[#This Row],[School Code]]","v":"6121"},"D.P. Yates Primary",{"$f":"School_Listing[[#This Row],[School Code]]","v":21},{"$nulls":7},720,"RHEA COUNTY"]
[61,"CLEVELAND",{"$f":"School_Listing[[#This Row],[System Code]]","v":61},22,{"$f":"School_Listing[[#This Row],[System Code]]&School_Listing[[#This Row],[School Code]]","v":"6122"},"E.L. Ross Elementary",{"$f":"School_Listing[[#This Row],[School Code]]","v":22},{"$nulls":7},581,"RICHARD CITY"]
[61,"CLEVELAND",{"$f":"School_Listing[[#This Row],[System Code]]","v":61},25,{"$f":"School_Listing[[#This Row],[System Code]]&School_Listing[[#This Row],[School Code]]","v":"6125"},"G.R. Stuart Elementary",{"$f":"School_Listing[[#This Row],[School Code]]","v":25},{"$nulls":7},730,"ROANE COUNTY"]
[61,"CLEVELAND",{"$f":"School_Listing[[#This Row],[System Code]]","v":61},30,{"$f":"School_Listing[[#This Row],[System Code]]&School_Listing[[#This Row],[School Code]]","v":"6130"},"Mayfield Elementary",{"$f":"School_Listing[[#This Row],[School Code]]","v":30},{"$nulls":7},740,"ROBERTSON COUNTY"]
[70,"CAMPBELL COUNTY",{"$f":"School_Listing[[#This Row],[System Code]]","v":70},2,{"$f":"School_Listing[[#This Row],[System Code]]&School_Listing[[#This Row],[School Code]]","v":"702"},"Campbell Co Adult High School",{"$f":"School_Listing[[#This Row],[School Code]]","v":2},{"$nulls":7},371,"ROGERSVILLE"]
[70,"CAMPBELL COUNTY",{"$f":"School_Listing[[#This Row],[System Code]]","v":70},3,{"$f":"School_Listing[[#This Row],[System Code]]&School_Listing[[#This Row],[School Code]]","v":"703"},"Campbell County Comprehensive High School",{"$f":"School_Listing[[#This Row],[School Code]]","v":3},{"$nulls":7},750,"RUTHERFORD COUNTY"]
[70,"CAMPBELL COUNTY",{"$f":"School_Listing[[#This Row],[System Code]]","v":70},5,{"$f":"School_Listing[[#This Row],[System Code]]&School_Listing[[#This Row],[School Code]]","v":"705"},"Caryville Elementary",{"$f":"School_Listing[[#This Row],[School Code]]","v":5},{"$nulls":7},760,"SCOTT COUNTY"]
[70,"CAMPBELL COUNTY",{"$f":"School_Listing[[#This Row],[System Code]]","v":70},160,{"$f":"School_Listing[[#This Row],[System Code]]&School_Listing[[#This Row],[School Code]]","v":"70160"},"East Lafollette Learning Academy",{"$f":"School_Listing[[#This Row],[School Code]]","v":160},{"$nulls":7},770,"SEQUATCHIE COUNTY"]
[70,"CAMPBELL COUNTY",{"$f":"School_Listing[[#This Row],[System Code]]","v":70},40,{"$f":"School_Listing[[#This Row],[System Code]]&School_Listing[[#This Row],[School Code]]","v":"7040"},"Elk Valley Elementary",{"$f":"School_Listing[[#This Row],[School Code]]","v":40},{"$nulls":7},780,"SEVIER COUNTY"]
[70,"CAMPBELL COUNTY",{"$f":"School_Listing[[#This Row],[System Code]]","v":70},60,{"$f":"School_Listing[[#This Row],[System Code]]&School_Listing[[#This Row],[School Code]]","v":"7060"},"Jacksboro Elementary",{"$f":"School_Listing[[#This Row],[School Code]]","v":60},{"$nulls":7},800,"SMITH COUNTY"]
[70,"CAMPBELL COUNTY",{"$f":"School_Listing[[#This Row],[System Code]]","v":70},65,{"$f":"School_Listing[[#This Row],[System Code]]&School_Listing[[#This Row],[School Code]]","v":"7065"},"Jacksboro Middle School",{"$f":"School_Listing[[#This Row],[School Code]]","v":65},{"$nulls":7},95,"SOUTH CARROLL"]
[70,"CAMPBELL COUNTY",{"$f":"School_Listing[[#This Row],[System Code]]","v":70},70,{"$f":"School_Listing[[#This Row],[System Code]]&School_Listing[[#This Row],[School Code]]","v":"7070"},"Jellico Elementary",{"$f":"School_Listing[[#This Row],[School Code]]","v":70},{"$nulls":7},810,"STEWART COUNTY"]
[70,"CAMPBELL COUNTY",{"$f":"School_Listing[[#This Row],[System Code]]","v":70},75,{"$f":"School_Listing[[#This Row],[System Code]]&School_Listing[[#This Row],[School Code]]","v":"7075"},"Jellico High School",{"$f":"School_Listing[[#This Row],[School Code]]","v":75},{"$nulls":7},820,"SULLIVAN COUNTY"]
[70,"CAMPBELL COUNTY",{"$f":"School_Listing[[#This Row],[System Code]]","v":70},155,{"$f":"School_Listing[[#This Row],[System Code]]&School_Listing[[#This Row],[School Code]]","v":"70155"},"Jellico Learning Academy",{"$f":"School_Listing[[#This Row],[School Code]]","v":155},{"$nulls":7},830,"SUMNER COUNTY"]
[70,"CAMPBELL COUNTY",{"$f":"School_Listing[[#This Row],[System Code]]","v":70},77,{"$f":"School_Listing[[#This Row],[System Code]]&School_Listing[[#This Row],[School Code]]","v":"7077"},"LaFollette Elementary School",{"$f":"School_Listing[[#This Row],[School Code]]","v":77},{"$nulls":7},621,"SWEETWATER"]
[70,"CAMPBELL COUNTY",{"$f":"School_Listing[[#This Row],[System Code]]","v":70},80,{"$f":"School_Listing[[#This Row],[System Code]]&School_Listing[[#This Row],[School Code]]","v":"7080"},"Lafollette Middle School",{"$f":"School_Listing[[#This Row],[School Code]]","v":80},{"$nulls":7},987,"TENNESSEE PUBLIC CHARTER SCHOOL COMMISSION"]
[70,"CAMPBELL COUNTY",{"$f":"School_Listing[[#This Row],[System Code]]","v":70},4,{"$f":"School_Listing[[#This Row],[System Code]]&School_Listing[[#This Row],[School Code]]","v":"704"},"North Cumberland Online School",{"$f":"School_Listing[[#This Row],[School Code]]","v":4},{"$nulls":7},963,"TENNESSEE SCHOOL FOR BLIND"]
[70,"CAMPBELL COUNTY",{"$f":"School_Listing[[#This Row],[System Code]]","v":70},135,{"$f":"School_Listing[[#This Row],[System Code]]&School_Listing[[#This Row],[School Code]]","v":"70135"},"Valley View Elementary",{"$f":"School_Listing[[#This Row],[School Code]]","v":135},{"$nulls":7},964,"TENNESSEE SCHOOLS FOR THE DEAF"]
[70,"CAMPBELL COUNTY",{"$f":"School_Listing[[#This Row],[System Code]]","v":70},140,{"$f":"School_Listing[[#This Row],[System Code]]&School_Listing[[#This Row],[School Code]]","v":"70140"},"White Oak Elementary",{"$f":"School_Listing[[#This Row],[School Code]]","v":140},{"$nulls":7},840,"TIPTON COUNTY"]
[70,"CAMPBELL COUNTY",{"$f":"School_Listing[[#This Row],[System Code]]","v":70},150,{"$f":"School_Listing[[#This Row],[System Code]]&School_Listing[[#This Row],[School Code]]","v":"70150"},"Wynn Habersham Elementary",{"$f":"School_Listing[[#This Row],[School Code]]","v":150},{"$nulls":7},273,"TRENTON"]
[80,"CANNON COUNTY",{"$f":"School_Listing[[#This Row],[System Code]]","v":80},17,{"$f":"School_Listing[[#This Row],[System Code]]&School_Listing[[#This Row],[School Code]]","v":"8017"},"Cannon County Elementary School",{"$f":"School_Listing[[#This Row],[School Code]]","v":17},{"$nulls":7},850,"TROUSDALE COUNTY"]
[80,"CANNON COUNTY",{"$f":"School_Listing[[#This Row],[System Code]]","v":80},16,{"$f":"School_Listing[[#This Row],[System Code]]&School_Listing[[#This Row],[School Code]]","v":"8016"},"Cannon County High School",{"$f":"School_Listing[[#This Row],[School Code]]","v":16},{"$nulls":7},162,"TULLAHOMA"]
[80,"CANNON COUNTY",{"$f":"School_Listing[[#This Row],[System Code]]","v":80},21,{"$f":"School_Listing[[#This Row],[System Code]]&School_Listing[[#This Row],[School Code]]","v":"8021"},"Cannon County Middle School",{"$f":"School_Listing[[#This Row],[School Code]]","v":21},{"$nulls":7},860,"UNICOI COUNTY"]
[80,"CANNON COUNTY",{"$f":"School_Listing[[#This Row],[System Code]]","v":80},18,{"$f":"School_Listing[[#This Row],[System Code]]&School_Listing[[#This Row],[School Code]]","v":"8018"},"Cannon North Elementary School",{"$f":"School_Listing[[#This Row],[School Code]]","v":18},{"$nulls":7},661,"UNION CITY"]
[80,"CANNON COUNTY",{"$f":"School_Listing[[#This Row],[System Code]]","v":80},19,{"$f":"School_Listing[[#This Row],[System Code]]&School_Listing[[#This Row],[School Code]]","v":"8019"},"Cannon South Elementary School",{"$f":"School_Listing[[#This Row],[School Code]]","v":19},{"$nulls":7},870,"UNION COUNTY"]
[90,"CARROLL COUNTY",{"$f":"School_Listing[[#This Row],[System Code]]","v":90},7,{"$f":"School_Listing[[#This Row],[System Code]]&School_Listing[[#This Row],[School Code]]","v":"907"},"Carroll Co Tech Center",{"$f":"School_Listing[[#This Row],[School Code]]","v":7},{"$nulls":7},880,"VAN BUREN COUNTY"]
[92,"HOLLOW ROCK - BRUCETON",{"$f":"School_Listing[[#This Row],[System Code]]","v":92},5,{"$f":"School_Listing[[#This Row],[System Code]]&School_Listing[[#This Row],[School Code]]","v":"925"},"Central Elementary",{"$f":"School_Listing[[#This Row],[School Code]]","v":5},{"$nulls":7},890,"WARREN COUNTY"]
[92,"HOLLOW ROCK - BRUCETON",{"$f":"School_Listing[[#This Row],[System Code]]","v":92},10,{"$f":"School_Listing[[#This Row],[System Code]]&School_Listing[[#This Row],[School Code]]","v":"9210"},"Central High School",{"$f":"School_Listing[[#This Row],[School Code]]","v":10},{"$nulls":7},900,"WASHINGTON COUNTY"]
[93,"HUNTINGDON SPECIAL SCHOOL DISTRICT",{"$f":"School_Listing[[#This Row],[System Code]]","v":93},10,{"$f":"School_Listing[[#This Row],[System Code]]&School_Listing[[#This Row],[School Code]]","v":"9310"},"Huntingdon High School",{"$f":"School_Listing[[#This Row],[School Code]]","v":10},{"$nulls":7},910,"WAYNE COUNTY"]
[93,"HUNTINGDON SPECIAL SCHOOL DISTRICT",{"$f":"School_Listing[[#This Row],[System Code]]","v":93},5,{"$f":"School_Listing[[#This Row],[System Code]]&School_Listing[[#This Row],[School Code]]","v":"935"},"Huntingdon Middle School",{"$f":"School_Listing[[#This Row],[School Code]]","v":5},{"$nulls":7},920,"WEAKLEY COUNTY"]
[93,"HUNTINGDON SPECIAL SCHOOL DISTRICT",{"$f":"School_Listing[[#This Row],[System Code]]","v":93},15,{"$f":"School_Listing[[#This Row],[System Code]]&School_Listing[[#This Row],[School Code]]","v":"9315"},"Huntingdon Primary",{"$f":"School_Listing[[#This Row],[School Code]]","v":15},{"$nulls":7},97,"WEST CARROLL SP DIST"]
[93,"HUNTINGDON SPECIAL SCHOOL DISTRICT",{"$f":"School_Listing[[#This Row],[System Code]]","v":93},7001,{"$f":"School_Listing[[#This Row],[System Code]]&School_Listing[[#This Row],[School Code]]","v":"937001"},"Northwest Head Start - Huntingdon",{"$f":"School_Listing[[#This Row],[School Code]]","v":7001},{"$nulls":7},960,"WEST TENNESSEE SCHOOL FOR THE DEAF"]
[94,"MCKENZIE",{"$f":"School_Listing[[#This Row],[System Code]]","v":94},5,{"$f":"School_Listing[[#This Row],[System Code]]&School_Listing[[#This Row],[School Code]]","v":"945"},"McKenzie Elementary",{"$f":"School_Listing[[#This Row],[School Code]]","v":5},{"$nulls":7},930,"WHITE COUNTY"]
[94,"MCKENZIE",{"$f":"School_Listing[[#This Row],[System Code]]","v":94},10,{"$f":"School_Listing[[#This Row],[System Code]]&School_Listing[[#This Row],[School Code]]","v":"9410"},"McKenzie High School",{"$f":"School_Listing[[#This Row],[School Code]]","v":10},{"$nulls":7},940,"WILLIAMSON COUNTY"]
[94,"MCKENZIE",{"$f":"School_Listing[[#This Row],[System Code]]","v":94},15,{"$f":"School_Listing[[#This Row],[System Code]]&School_Listing[[#This Row],[School Code]]","v":"9415"},"McKenzie Middle School",{"$f":"School_Listing[[#This Row],[School Code]]","v":15},{"$nulls":7},950,"WILSON COUNTY"]
[95,"SOUTH CARROLL",{"$f":"School_Listing[[#This Row],[System Code]]","v":95},5,{"$f":"School_Listing[[#This Row],[System Code]]&School_Listing[[#This Row],[School Code]]","v":"955"},"Clarksburg School",{"$f":"School_Listing[[#This Row],[School Code]]","v":5}]
[97,"WEST CARROLL SP DIST",{"$f":"School_Listing[[#This Row],[System Code]]","v":97},25,{"$f":"School_Listing[[#This Row],[System Code]]&School_Listing[[#This Row],[School Code]]","v":"9725"},"West Carroll Elementary School",{"$f":"School_Listing[[#This Row],[School Code]]","v":25}]
[97,"WEST CARROLL SP DIST",{"$f":"School_Listing[[#This Row],[System Code]]","v":97},5,{"$f":"School_Listing[[#This Row],[System Code]]&School_Listing[[#This Row],[School Code]]","v":"975"},"West Carroll Junior/Senior High School",{"$f":"School_Listing[[#This Row],[School Code]]","v":5}]
[97,"WEST CARROLL SP DIST",{"$f":"School_Listing[[#This Row],[System Code]]","v":97},20,{"$f":"School_Listing[[#This Row],[System Code]]&School_Listing[[#This Row],[School Code]]","v":"9720"},"West Carroll Primary",{"$f":"School_Listing[[#This Row],[School Code]]","v":20}]
[100,"CARTER COUNTY",{"$f":"School_Listing[[#This Row],[System Code]]","v":100},4,{"$f":"School_Listing[[#This Row],[System Code]]&School_Listing[[#This Row],[School Code]]","v":"1004"},"Carter County Online Academy",{"$f":"School_Listing[[#This Row],[School Code]]","v":4}]
[100,"CARTER COUNTY",{"$f":"School_Listing[[#This Row],[System Code]]","v":100},5,{"$f":"School_Listing[[#This Row],[System Code]]&School_Listing[[#This Row],[School Code]]","v":"1005"},"Central Elementary",{"$f":"School_Listing[[#This Row],[School Code]]","v":5}]
[100,"CARTER COUNTY",{"$f":"School_Listing[[#This Row],[System Code]]","v":100},13,{"$f":"School_Listing[[#This Row],[System Code]]&School_Listing[[#This Row],[School Code]]","v":"10013"},"Cloudland Elementary School",{"$f":"School_Listing[[#This Row],[School Code]]","v":13}]
[100,"CARTER COUNTY",{"$f":"School_Listing[[#This Row],[System Code]]","v":100},15,{"$f":"School_Listing[[#This Row],[System Code]]&School_Listing[[#This Row],[School Code]]","v":"10015"},"Cloudland High School",{"$f":"School_Listing[[#This Row],[School Code]]","v":15}]
[100,"CARTER COUNTY",{"$f":"School_Listing[[#This Row],[System Code]]","v":100},25,{"$f":"School_Listing[[#This Row],[System Code]]&School_Listing[[#This Row],[School Code]]","v":"10025"},"Hampton Elementary",{"$f":"School_Listing[[#This Row],[School Code]]","v":25}]
[100,"CARTER COUNTY",{"$f":"School_Listing[[#This Row],[System Code]]","v":100},30,{"$f":"School_Listing[[#This Row],[System Code]]&School_Listing[[#This Row],[School Code]]","v":"10030"},"Hampton High School",{"$f":"School_Listing[[#This Row],[School Code]]","v":30}]
[100,"CARTER COUNTY",{"$f":"School_Listing[[#This Row],[System Code]]","v":100},35,{"$f":"School_Listing[[#This Row],[System Code]]&School_Listing[[#This Row],[School Code]]","v":"10035"},"Happy Valley Elementary",{"$f":"School_Listing[[#This Row],[School Code]]","v":35}]
[100,"CARTER COUNTY",{"$f":"School_Listing[[#This Row],[System Code]]","v":100},40,{"$f":"School_Listing[[#This Row],[System Code]]&School_Listing[[#This Row],[School Code]]","v":"10040"},"Happy Valley High School",{"$f":"School_Listing[[#This Row],[School Code]]","v":40}]
[100,"CARTER COUNTY",{"$f":"School_Listing[[#This Row],[System Code]]","v":100},43,{"$f":"School_Listing[[#This Row],[System Code]]&School_Listing[[#This Row],[School Code]]","v":"10043"},"Happy Valley Middle School",{"$f":"School_Listing[[#This Row],[School Code]]","v":43}]
[100,"CARTER COUNTY",{"$f":"School_Listing[[#This Row],[System Code]]","v":100},45,{"$f":"School_Listing[[#This Row],[System Code]]&School_Listing[[#This Row],[School Code]]","v":"10045"},"Hunter Elementary",{"$f":"School_Listing[[#This Row],[School Code]]","v":45}]
[100,"CARTER COUNTY",{"$f":"School_Listing[[#This Row],[System Code]]","v":100},50,{"$f":"School_Listing[[#This Row],[System Code]]&School_Listing[[#This Row],[School Code]]","v":"10050"},"Keenburg Elementary",{"$f":"School_Listing[[#This Row],[School Code]]","v":50}]
[100,"CARTER COUNTY",{"$f":"School_Listing[[#This Row],[System Code]]","v":100},55,{"$f":"School_Listing[[#This Row],[System Code]]&School_Listing[[#This Row],[School Code]]","v":"10055"},"Little Milligan",{"$f":"School_Listing[[#This Row],[School Code]]","v":55}]
[100,"CARTER COUNTY",{"$f":"School_Listing[[#This Row],[System Code]]","v":100},52,{"$f":"School_Listing[[#This Row],[System Code]]&School_Listing[[#This Row],[School Code]]","v":"10052"},"Siam Learning Center",{"$f":"School_Listing[[#This Row],[School Code]]","v":52}]
[100,"CARTER COUNTY",{"$f":"School_Listing[[#This Row],[System Code]]","v":100},85,{"$f":"School_Listing[[#This Row],[System Code]]&School_Listing[[#This Row],[School Code]]","v":"10085"},"Unaka Elementary",{"$f":"School_Listing[[#This Row],[School Code]]","v":85}]
[100,"CARTER COUNTY",{"$f":"School_Listing[[#This Row],[System Code]]","v":100},90,{"$f":"School_Listing[[#This Row],[System Code]]&School_Listing[[#This Row],[School Code]]","v":"10090"},"Unaka High School",{"$f":"School_Listing[[#This Row],[School Code]]","v":90}]
[100,"CARTER COUNTY",{"$f":"School_Listing[[#This Row],[System Code]]","v":100},95,{"$f":"School_Listing[[#This Row],[System Code]]&School_Listing[[#This Row],[School Code]]","v":"10095"},"Valley Forge Elementary",{"$f":"School_Listing[[#This Row],[School Code]]","v":95}]
[101,"ELIZABETHTON",{"$f":"School_Listing[[#This Row],[System Code]]","v":101},10,{"$f":"School_Listing[[#This Row],[System Code]]&School_Listing[[#This Row],[School Code]]","v":"10110"},"East Side Elementary",{"$f":"School_Listing[[#This Row],[School Code]]","v":10}]
[101,"ELIZABETHTON",{"$f":"School_Listing[[#This Row],[System Code]]","v":101},15,{"$f":"School_Listing[[#This Row],[System Code]]&School_Listing[[#This Row],[School Code]]","v":"10115"},"Elizabethton High School",{"$f":"School_Listing[[#This Row],[School Code]]","v":15}]
[101,"ELIZABETHTON",{"$f":"School_Listing[[#This Row],[System Code]]","v":101},20,{"$f":"School_Listing[[#This Row],[System Code]]&School_Listing[[#This Row],[School Code]]","v":"10120"},"Harold McCormick Elementary",{"$f":"School_Listing[[#This Row],[School Code]]","v":20}]
[101,"ELIZABETHTON",{"$f":"School_Listing[[#This Row],[System Code]]","v":101},25,{"$f":"School_Listing[[#This Row],[System Code]]&School_Listing[[#This Row],[School Code]]","v":"10125"},"T A Dugger Junior High School",{"$f":"School_Listing[[#This Row],[School Code]]","v":25}]
[101,"ELIZABETHTON",{"$f":"School_Listing[[#This Row],[System Code]]","v":101},30,{"$f":"School_Listing[[#This Row],[System Code]]&School_Listing[[#This Row],[School Code]]","v":"10130"},"West Side Elementary",{"$f":"School_Listing[[#This Row],[School Code]]","v":30}]
[110,"CHEATHAM COUNTY",{"$f":"School_Listing[[#This Row],[System Code]]","v":110},5,{"$f":"School_Listing[[#This Row],[System Code]]&School_Listing[[#This Row],[School Code]]","v":"1105"},"Ashland City Elementary",{"$f":"School_Listing[[#This Row],[School Code]]","v":5}]
[110,"CHEATHAM COUNTY",{"$f":"School_Listing[[#This Row],[System Code]]","v":110},10,{"$f":"School_Listing[[#This Row],[System Code]]&School_Listing[[#This Row],[School Code]]","v":"11010"},"Cheatham Co Central",{"$f":"School_Listing[[#This Row],[School Code]]","v":10}]
[110,"CHEATHAM COUNTY",{"$f":"School_Listing[[#This Row],[System Code]]","v":110},45,{"$f":"School_Listing[[#This Row],[System Code]]&School_Listing[[#This Row],[School Code]]","v":"11045"},"Cheatham County Virtual School",{"$f":"School_Listing[[#This Row],[School Code]]","v":45}]
[110,"CHEATHAM COUNTY",{"$f":"School_Listing[[#This Row],[System Code]]","v":110},14,{"$f":"School_Listing[[#This Row],[System Code]]&School_Listing[[#This Row],[School Code]]","v":"11014"},"Cheatham Middle School",{"$f":"School_Listing[[#This Row],[School Code]]","v":14}]
[110,"CHEATHAM COUNTY",{"$f":"School_Listing[[#This Row],[System Code]]","v":110},15,{"$f":"School_Listing[[#This Row],[System Code]]&School_Listing[[#This Row],[School Code]]","v":"11015"},"East Cheatham Elementary",{"$f":"School_Listing[[#This Row],[School Code]]","v":15}]
[110,"CHEATHAM COUNTY",{"$f":"School_Listing[[#This Row],[System Code]]","v":110},19,{"$f":"School_Listing[[#This Row],[System Code]]&School_Listing[[#This Row],[School Code]]","v":"11019"},"Harpeth High School",{"$f":"School_Listing[[#This Row],[School Code]]","v":19}]
[110,"CHEATHAM COUNTY",{"$f":"School_Listing[[#This Row],[System Code]]","v":110},18,{"$f":"School_Listing[[#This Row],[System Code]]&School_Listing[[#This Row],[School Code]]","v":"11018"},"Harpeth Middle School",{"$f":"School_Listing[[#This Row],[School Code]]","v":18}]
[110,"CHEATHAM COUNTY",{"$f":"School_Listing[[#This Row],[System Code]]","v":110},20,{"$f":"School_Listing[[#This Row],[System Code]]&School_Listing[[#This Row],[School Code]]","v":"11020"},"Kingston Springs Elementary",{"$f":"School_Listing[[#This Row],[School Code]]","v":20}]
[110,"CHEATHAM COUNTY",{"$f":"School_Listing[[#This Row],[System Code]]","v":110},25,{"$f":"School_Listing[[#This Row],[System Code]]&School_Listing[[#This Row],[School Code]]","v":"11025"},"Pegram Elementary Fine Arts Magnet School",{"$f":"School_Listing[[#This Row],[School Code]]","v":25}]
[110,"CHEATHAM COUNTY",{"$f":"School_Listing[[#This Row],[System Code]]","v":110},30,{"$f":"School_Listing[[#This Row],[System Code]]&School_Listing[[#This Row],[School Code]]","v":"11030"},"Pleasant View Elementary",{"$f":"School_Listing[[#This Row],[School Code]]","v":30}]
[110,"CHEATHAM COUNTY",{"$f":"School_Listing[[#This Row],[System Code]]","v":110},40,{"$f":"School_Listing[[#This Row],[System Code]]&School_Listing[[#This Row],[School Code]]","v":"11040"},"Riverside Academy",{"$f":"School_Listing[[#This Row],[School Code]]","v":40}]
[110,"CHEATHAM COUNTY",{"$f":"School_Listing[[#This Row],[System Code]]","v":110},33,{"$f":"School_Listing[[#This Row],[System Code]]&School_Listing[[#This Row],[School Code]]","v":"11033"},"Sycamore High School",{"$f":"School_Listing[[#This Row],[School Code]]","v":33}]
[110,"CHEATHAM COUNTY",{"$f":"School_Listing[[#This Row],[System Code]]","v":110},32,{"$f":"School_Listing[[#This Row],[System Code]]&School_Listing[[#This Row],[School Code]]","v":"11032"},"Sycamore Middle School",{"$f":"School_Listing[[#This Row],[School Code]]","v":32}]
[110,"CHEATHAM COUNTY",{"$f":"School_Listing[[#This Row],[System Code]]","v":110},35,{"$f":"School_Listing[[#This Row],[System Code]]&School_Listing[[#This Row],[School Code]]","v":"11035"},"West Cheatham Elementary",{"$f":"School_Listing[[#This Row],[School Code]]","v":35}]
[120,"CHESTER COUNTY",{"$f":"School_Listing[[#This Row],[System Code]]","v":120},8,{"$f":"School_Listing[[#This Row],[System Code]]&School_Listing[[#This Row],[School Code]]","v":"1208"},"Chester County High School",{"$f":"School_Listing[[#This Row],[School Code]]","v":8}]
[120,"CHESTER COUNTY",{"$f":"School_Listing[[#This Row],[System Code]]","v":120},10,{"$f":"School_Listing[[#This Row],[System Code]]&School_Listing[[#This Row],[School Code]]","v":"12010"},"Chester County Junior High School",{"$f":"School_Listing[[#This Row],[School Code]]","v":10}]
[120,"CHESTER COUNTY",{"$f":"School_Listing[[#This Row],[System Code]]","v":120},5,{"$f":"School_Listing[[#This Row],[System Code]]&School_Listing[[#This Row],[School Code]]","v":"1205"},"Chester County Middle School",{"$f":"School_Listing[[#This Row],[School Code]]","v":5}]
[120,"CHESTER COUNTY",{"$f":"School_Listing[[#This Row],[System Code]]","v":120},15,{"$f":"School_Listing[[#This Row],[System Code]]&School_Listing[[#This Row],[School Code]]","v":"12015"},"East Chester Elementary School",{"$f":"School_Listing[[#This Row],[School Code]]","v":15}]
[120,"CHESTER COUNTY",{"$f":"School_Listing[[#This Row],[System Code]]","v":120},25,{"$f":"School_Listing[[#This Row],[System Code]]&School_Listing[[#This Row],[School Code]]","v":"12025"},"Jacks Creek Elementary",{"$f":"School_Listing[[#This Row],[School Code]]","v":25}]
[120,"CHESTER COUNTY",{"$f":"School_Listing[[#This Row],[System Code]]","v":120},30,{"$f":"School_Listing[[#This Row],[System Code]]&School_Listing[[#This Row],[School Code]]","v":"12030"},"W Chester Elementary School",{"$f":"School_Listing[[#This Row],[School Code]]","v":30}]
[130,"CLAIBORNE COUNTY",{"$f":"School_Listing[[#This Row],[System Code]]","v":130},5,{"$f":"School_Listing[[#This Row],[System Code]]&School_Listing[[#This Row],[School Code]]","v":"1305"},"Claiborne Adult High School",{"$f":"School_Listing[[#This Row],[School Code]]","v":5}]
[130,"CLAIBORNE COUNTY",{"$f":"School_Listing[[#This Row],[System Code]]","v":130},110,{"$f":"School_Listing[[#This Row],[System Code]]&School_Listing[[#This Row],[School Code]]","v":"130110"},"Claiborne High School",{"$f":"School_Listing[[#This Row],[School Code]]","v":110}]
[130,"CLAIBORNE COUNTY",{"$f":"School_Listing[[#This Row],[System Code]]","v":130},10,{"$f":"School_Listing[[#This Row],[System Code]]&School_Listing[[#This Row],[School Code]]","v":"13010"},"Claiborne Virtual Learning Academy",{"$f":"School_Listing[[#This Row],[School Code]]","v":10}]
[130,"CLAIBORNE COUNTY",{"$f":"School_Listing[[#This Row],[System Code]]","v":130},35,{"$f":"School_Listing[[#This Row],[System Code]]&School_Listing[[#This Row],[School Code]]","v":"13035"},"Clairfield Elementary",{"$f":"School_Listing[[#This Row],[School Code]]","v":35}]
[130,"CLAIBORNE COUNTY",{"$f":"School_Listing[[#This Row],[System Code]]","v":130},93,{"$f":"School_Listing[[#This Row],[System Code]]&School_Listing[[#This Row],[School Code]]","v":"13093"},"Cumberland Gap High School",{"$f":"School_Listing[[#This Row],[School Code]]","v":93}]
[130,"CLAIBORNE COUNTY",{"$f":"School_Listing[[#This Row],[System Code]]","v":130},45,{"$f":"School_Listing[[#This Row],[System Code]]&School_Listing[[#This Row],[School Code]]","v":"13045"},"Ellen Myers Primary",{"$f":"School_Listing[[#This Row],[School Code]]","v":45}]
[130,"CLAIBORNE COUNTY",{"$f":"School_Listing[[#This Row],[System Code]]","v":130},50,{"$f":"School_Listing[[#This Row],[System Code]]&School_Listing[[#This Row],[School Code]]","v":"13050"},"Forge Ridge School",{"$f":"School_Listing[[#This Row],[School Code]]","v":50}]
[130,"CLAIBORNE COUNTY",{"$f":"School_Listing[[#This Row],[System Code]]","v":130},67,{"$f":"School_Listing[[#This Row],[System Code]]&School_Listing[[#This Row],[School Code]]","v":"13067"},"H. Y. Livesay Middle School",{"$f":"School_Listing[[#This Row],[School Code]]","v":67}]
[130,"CLAIBORNE COUNTY",{"$f":"School_Listing[[#This Row],[System Code]]","v":130},90,{"$f":"School_Listing[[#This Row],[System Code]]&School_Listing[[#This Row],[School Code]]","v":"13090"},"Midway Elementary",{"$f":"School_Listing[[#This Row],[School Code]]","v":90}]
[130,"CLAIBORNE COUNTY",{"$f":"School_Listing[[#This Row],[System Code]]","v":130},95,{"$f":"School_Listing[[#This Row],[System Code]]&School_Listing[[#This Row],[School Code]]","v":"13095"},"Powell Valley Elementary",{"$f":"School_Listing[[#This Row],[School Code]]","v":95}]
[130,"CLAIBORNE COUNTY",{"$f":"School_Listing[[#This Row],[System Code]]","v":130},105,{"$f":"School_Listing[[#This Row],[System Code]]&School_Listing[[#This Row],[School Code]]","v":"130105"},"Soldiers Memorial Middle School",{"$f":"School_Listing[[#This Row],[School Code]]","v":105}]
[130,"CLAIBORNE COUNTY",{"$f":"School_Listing[[#This Row],[System Code]]","v":130},115,{"$f":"School_Listing[[#This Row],[System Code]]&School_Listing[[#This Row],[School Code]]","v":"130115"},"Springdale Elementary",{"$f":"School_Listing[[#This Row],[School Code]]","v":115}]
[130,"CLAIBORNE COUNTY",{"$f":"School_Listing[[#This Row],[System Code]]","v":130},117,{"$f":"School_Listing[[#This Row],[System Code]]&School_Listing[[#This Row],[School Code]]","v":"130117"},"Tazewell-New Tazewell Elementary",{"$f":"School_Listing[[#This Row],[School Code]]","v":117}]
[130,"CLAIBORNE COUNTY",{"$f":"School_Listing[[#This Row],[System Code]]","v":130},140,{"$f":"School_Listing[[#This Row],[System Code]]&School_Listing[[#This Row],[School Code]]","v":"130140"},"The Alpha School",{"$f":"School_Listing[[#This Row],[School Code]]","v":140}]
[140,"CLAY COUNTY",{"$f":"School_Listing[[#This Row],[System Code]]","v":140},5,{"$f":"School_Listing[[#This Row],[System Code]]&School_Listing[[#This Row],[School Code]]","v":"1405"},"Celina K-8",{"$f":"School_Listing[[#This Row],[School Code]]","v":5}]
[140,"CLAY COUNTY",{"$f":"School_Listing[[#This Row],[System Code]]","v":140},14,{"$f":"School_Listing[[#This Row],[System Code]]&School_Listing[[#This Row],[School Code]]","v":"14014"},"Clay Co Adult High School",{"$f":"School_Listing[[#This Row],[School Code]]","v":14}]
[140,"CLAY COUNTY",{"$f":"School_Listing[[#This Row],[System Code]]","v":140},12,{"$f":"School_Listing[[#This Row],[System Code]]&School_Listing[[#This Row],[School Code]]","v":"14012"},"Clay County High School",{"$f":"School_Listing[[#This Row],[School Code]]","v":12}]
[140,"CLAY COUNTY",{"$f":"School_Listing[[#This Row],[System Code]]","v":140},20,{"$f":"School_Listing[[#This Row],[System Code]]&School_Listing[[#This Row],[School Code]]","v":"14020"},"Hermitage Springs Elementary School",{"$f":"School_Listing[[#This Row],[School Code]]","v":20}]
[150,"COCKE COUNTY",{"$f":"School_Listing[[#This Row],[System Code]]","v":150},5,{"$f":"School_Listing[[#This Row],[System Code]]&School_Listing[[#This Row],[School Code]]","v":"1505"},"Bridgeport Elementary",{"$f":"School_Listing[[#This Row],[School Code]]","v":5}]
[150,"COCKE COUNTY",{"$f":"School_Listing[[#This Row],[System Code]]","v":150},10,{"$f":"School_Listing[[#This Row],[System Code]]&School_Listing[[#This Row],[School Code]]","v":"15010"},"Centerview Elementary",{"$f":"School_Listing[[#This Row],[School Code]]","v":10}]
[150,"COCKE COUNTY",{"$f":"School_Listing[[#This Row],[System Code]]","v":150},12,{"$f":"School_Listing[[#This Row],[System Code]]&School_Listing[[#This Row],[School Code]]","v":"15012"},"Cocke Co Adult High School",{"$f":"School_Listing[[#This Row],[School Code]]","v":12}]
[150,"COCKE COUNTY",{"$f":"School_Listing[[#This Row],[System Code]]","v":150},15,{"$f":"School_Listing[[#This Row],[System Code]]&School_Listing[[#This Row],[School Code]]","v":"15015"},"Cocke Co High School",{"$f":"School_Listing[[#This Row],[School Code]]","v":15}]
[150,"COCKE COUNTY",{"$f":"School_Listing[[#This Row],[System Code]]","v":150},25,{"$f":"School_Listing[[#This Row],[System Code]]&School_Listing[[#This Row],[School Code]]","v":"15025"},"Cosby Elementary",{"$f":"School_Listing[[#This Row],[School Code]]","v":25}]
[150,"COCKE COUNTY",{"$f":"School_Listing[[#This Row],[System Code]]","v":150},27,{"$f":"School_Listing[[#This Row],[System Code]]&School_Listing[[#This Row],[School Code]]","v":"15027"},"Cosby High School",{"$f":"School_Listing[[#This Row],[School Code]]","v":27}]
[150,"COCKE COUNTY",{"$f":"School_Listing[[#This Row],[System Code]]","v":150},30,{"$f":"School_Listing[[#This Row],[System Code]]&School_Listing[[#This Row],[School Code]]","v":"15030"},"Del Rio Elementary",{"$f":"School_Listing[[#This Row],[School Code]]","v":30}]
[150,"COCKE COUNTY",{"$f":"School_Listing[[#This Row],[System Code]]","v":150},35,{"$f":"School_Listing[[#This Row],[System Code]]&School_Listing[[#This Row],[School Code]]","v":"15035"},"Edgemont Elementary",{"$f":"School_Listing[[#This Row],[School Code]]","v":35}]
[150,"COCKE COUNTY",{"$f":"School_Listing[[#This Row],[System Code]]","v":150},40,{"$f":"School_Listing[[#This Row],[System Code]]&School_Listing[[#This Row],[School Code]]","v":"15040"},"Grassy Fork Elementary",{"$f":"School_Listing[[#This Row],[School Code]]","v":40}]
[150,"COCKE COUNTY",{"$f":"School_Listing[[#This Row],[System Code]]","v":150},52,{"$f":"School_Listing[[#This Row],[System Code]]&School_Listing[[#This Row],[School Code]]","v":"15052"},"Northwest Elementary",{"$f":"School_Listing[[#This Row],[School Code]]","v":52}]
[150,"COCKE COUNTY",{"$f":"School_Listing[[#This Row],[System Code]]","v":150},55,{"$f":"School_Listing[[#This Row],[System Code]]&School_Listing[[#This Row],[School Code]]","v":"15055"},"Parrottsville Elementary",{"$f":"School_Listing[[#This Row],[School Code]]","v":55}]
[150,"COCKE COUNTY",{"$f":"School_Listing[[#This Row],[System Code]]","v":150},65,{"$f":"School_Listing[[#This Row],[System Code]]&School_Listing[[#This Row],[School Code]]","v":"15065"},"Smoky Mountain Elementary",{"$f":"School_Listing[[#This Row],[School Code]]","v":65}]
[151,"NEWPORT",{"$f":"School_Listing[[#This Row],[System Code]]","v":151},5,{"$f":"School_Listing[[#This Row],[System Code]]&School_Listing[[#This Row],[School Code]]","v":"1515"},"Newport Grammar School",{"$f":"School_Listing[[#This Row],[School Code]]","v":5}]
[160,"COFFEE COUNTY",{"$f":"School_Listing[[#This Row],[System Code]]","v":160},5,{"$f":"School_Listing[[#This Row],[System Code]]&School_Listing[[#This Row],[School Code]]","v":"1605"},"Coffee County Central High School",{"$f":"School_Listing[[#This Row],[School Code]]","v":5}]
[160,"COFFEE COUNTY",{"$f":"School_Listing[[#This Row],[System Code]]","v":160},45,{"$f":"School_Listing[[#This Row],[System Code]]&School_Listing[[#This Row],[School Code]]","v":"16045"},"Coffee County Koss Center",{"$f":"School_Listing[[#This Row],[School Code]]","v":45}]
[160,"COFFEE COUNTY",{"$f":"School_Listing[[#This Row],[System Code]]","v":160},10,{"$f":"School_Listing[[#This Row],[System Code]]&School_Listing[[#This Row],[School Code]]","v":"16010"},"Coffee County Middle School",{"$f":"School_Listing[[#This Row],[School Code]]","v":10}]
[160,"COFFEE COUNTY",{"$f":"School_Listing[[#This Row],[System Code]]","v":160},55,{"$f":"School_Listing[[#This Row],[System Code]]&School_Listing[[#This Row],[School Code]]","v":"16055"},"Coffee County Raider Academy",{"$f":"School_Listing[[#This Row],[School Code]]","v":55}]
[160,"COFFEE COUNTY",{"$f":"School_Listing[[#This Row],[System Code]]","v":160},57,{"$f":"School_Listing[[#This Row],[System Code]]&School_Listing[[#This Row],[School Code]]","v":"16057"},"Coffee County Virtual Academy",{"$f":"School_Listing[[#This Row],[School Code]]","v":57}]
[160,"COFFEE COUNTY",{"$f":"School_Listing[[#This Row],[System Code]]","v":160},50,{"$f":"School_Listing[[#This Row],[System Code]]&School_Listing[[#This Row],[School Code]]","v":"16050"},"Deerfield Elementary School",{"$f":"School_Listing[[#This Row],[School Code]]","v":50}]
[160,"COFFEE COUNTY",{"$f":"School_Listing[[#This Row],[System Code]]","v":160},15,{"$f":"School_Listing[[#This Row],[System Code]]&School_Listing[[#This Row],[School Code]]","v":"16015"},"East Coffee Elementary",{"$f":"School_Listing[[#This Row],[School Code]]","v":15}]
[160,"COFFEE COUNTY",{"$f":"School_Listing[[#This Row],[System Code]]","v":160},20,{"$f":"School_Listing[[#This Row],[System Code]]&School_Listing[[#This Row],[School Code]]","v":"16020"},"Hickerson Elementary",{"$f":"School_Listing[[#This Row],[School Code]]","v":20}]
[160,"COFFEE COUNTY",{"$f":"School_Listing[[#This Row],[System Code]]","v":160},25,{"$f":"School_Listing[[#This Row],[System Code]]&School_Listing[[#This Row],[School Code]]","v":"16025"},"Hillsboro Elementary",{"$f":"School_Listing[[#This Row],[School Code]]","v":25}]
[160,"COFFEE COUNTY",{"$f":"School_Listing[[#This Row],[System Code]]","v":160},35,{"$f":"School_Listing[[#This Row],[System Code]]&School_Listing[[#This Row],[School Code]]","v":"16035"},"New Union Elementary",{"$f":"School_Listing[[#This Row],[School Code]]","v":35}]
[160,"COFFEE COUNTY",{"$f":"School_Listing[[#This Row],[System Code]]","v":160},40,{"$f":"School_Listing[[#This Row],[System Code]]&School_Listing[[#This Row],[School Code]]","v":"16040"},"North Coffee Elementary",{"$f":"School_Listing[[#This Row],[School Code]]","v":40}]
[161,"MANCHESTER",{"$f":"School_Listing[[#This Row],[System Code]]","v":161},5,{"$f":"School_Listing[[#This Row],[System Code]]&School_Listing[[#This Row],[School Code]]","v":"1615"},"College Street Elementary",{"$f":"School_Listing[[#This Row],[School Code]]","v":5}]
[161,"MANCHESTER",{"$f":"School_Listing[[#This Row],[System Code]]","v":161},10,{"$f":"School_Listing[[#This Row],[System Code]]&School_Listing[[#This Row],[School Code]]","v":"16110"},"Westwood Elementary",{"$f":"School_Listing[[#This Row],[School Code]]","v":10}]
[161,"MANCHESTER",{"$f":"School_Listing[[#This Row],[System Code]]","v":161},15,{"$f":"School_Listing[[#This Row],[System Code]]&School_Listing[[#This Row],[School Code]]","v":"16115"},"Westwood Middle School",{"$f":"School_Listing[[#This Row],[School Code]]","v":15}]
[162,"TULLAHOMA",{"$f":"School_Listing[[#This Row],[System Code]]","v":162},5,{"$f":"School_Listing[[#This Row],[System Code]]&School_Listing[[#This Row],[School Code]]","v":"1625"},"Bel Aire Elementary",{"$f":"School_Listing[[#This Row],[School Code]]","v":5}]
[162,"TULLAHOMA",{"$f":"School_Listing[[#This Row],[System Code]]","v":162},20,{"$f":"School_Listing[[#This Row],[System Code]]&School_Listing[[#This Row],[School Code]]","v":"16220"},"East Lincoln Elementary",{"$f":"School_Listing[[#This Row],[School Code]]","v":20}]
[162,"TULLAHOMA",{"$f":"School_Listing[[#This Row],[System Code]]","v":162},15,{"$f":"School_Listing[[#This Row],[System Code]]&School_Listing[[#This Row],[School Code]]","v":"16215"},"East Middle School",{"$f":"School_Listing[[#This Row],[School Code]]","v":15}]
[162,"TULLAHOMA",{"$f":"School_Listing[[#This Row],[System Code]]","v":162},23,{"$f":"School_Listing[[#This Row],[System Code]]&School_Listing[[#This Row],[School Code]]","v":"16223"},"Jack T Farrar Elementary",{"$f":"School_Listing[[#This Row],[School Code]]","v":23}]
[162,"TULLAHOMA",{"$f":"School_Listing[[#This Row],[System Code]]","v":162},25,{"$f":"School_Listing[[#This Row],[System Code]]&School_Listing[[#This Row],[School Code]]","v":"16225"},"Robert E Lee Elementary",{"$f":"School_Listing[[#This Row],[School Code]]","v":25}]
[162,"TULLAHOMA",{"$f":"School_Listing[[#This Row],[System Code]]","v":162},35,{"$f":"School_Listing[[#This Row],[System Code]]&School_Listing[[#This Row],[School Code]]","v":"16235"},"Tullahoma High School",{"$f":"School_Listing[[#This Row],[School Code]]","v":35}]
[162,"TULLAHOMA",{"$f":"School_Listing[[#This Row],[System Code]]","v":162},37,{"$f":"School_Listing[[#This Row],[System Code]]&School_Listing[[#This Row],[School Code]]","v":"16237"},"Tullahoma Virtual Academy",{"$f":"School_Listing[[#This Row],[School Code]]","v":37}]
[162,"TULLAHOMA",{"$f":"School_Listing[[#This Row],[System Code]]","v":162},40,{"$f":"School_Listing[[#This Row],[System Code]]&School_Listing[[#This Row],[School Code]]","v":"16240"},"West Middle School",{"$f":"School_Listing[[#This Row],[School Code]]","v":40}]
[170,"CROCKETT COUNTY",{"$f":"School_Listing[[#This Row],[System Code]]","v":170},3,{"$f":"School_Listing[[#This Row],[System Code]]&School_Listing[[#This Row],[School Code]]","v":"1703"},"Crockett County High School",{"$f":"School_Listing[[#This Row],[School Code]]","v":3}]
[170,"CROCKETT COUNTY",{"$f":"School_Listing[[#This Row],[System Code]]","v":170},12,{"$f":"School_Listing[[#This Row],[System Code]]&School_Listing[[#This Row],[School Code]]","v":"17012"},"Crockett County Middle School",{"$f":"School_Listing[[#This Row],[School Code]]","v":12}]
[170,"CROCKETT COUNTY",{"$f":"School_Listing[[#This Row],[System Code]]","v":170},20,{"$f":"School_Listing[[#This Row],[System Code]]&School_Listing[[#This Row],[School Code]]","v":"17020"},"Friendship Elementary",{"$f":"School_Listing[[#This Row],[School Code]]","v":20}]
[170,"CROCKETT COUNTY",{"$f":"School_Listing[[#This Row],[System Code]]","v":170},25,{"$f":"School_Listing[[#This Row],[System Code]]&School_Listing[[#This Row],[School Code]]","v":"17025"},"Gadsden Elementary",{"$f":"School_Listing[[#This Row],[School Code]]","v":25}]
[170,"CROCKETT COUNTY",{"$f":"School_Listing[[#This Row],[System Code]]","v":170},40,{"$f":"School_Listing[[#This Row],[System Code]]&School_Listing[[#This Row],[School Code]]","v":"17040"},"Maury City Elementary",{"$f":"School_Listing[[#This Row],[School Code]]","v":40}]
[171,"ALAMO",{"$f":"School_Listing[[#This Row],[System Code]]","v":171},5,{"$f":"School_Listing[[#This Row],[System Code]]&School_Listing[[#This Row],[School Code]]","v":"1715"},"Alamo Elementary",{"$f":"School_Listing[[#This Row],[School Code]]","v":5}]
[172,"BELLS",{"$f":"School_Listing[[#This Row],[System Code]]","v":172},5,{"$f":"School_Listing[[#This Row],[System Code]]&School_Listing[[#This Row],[School Code]]","v":"1725"},"Bells Elementary",{"$f":"School_Listing[[#This Row],[School Code]]","v":5}]
[180,"CUMBERLAND COUNTY",{"$f":"School_Listing[[#This Row],[System Code]]","v":180},15,{"$f":"School_Listing[[#This Row],[System Code]]&School_Listing[[#This Row],[School Code]]","v":"18015"},"Crab Orchard Elementary",{"$f":"School_Listing[[#This Row],[School Code]]","v":15}]
[180,"CUMBERLAND COUNTY",{"$f":"School_Listing[[#This Row],[System Code]]","v":180},25,{"$f":"School_Listing[[#This Row],[System Code]]&School_Listing[[#This Row],[School Code]]","v":"18025"},"Cumberland County High School",{"$f":"School_Listing[[#This Row],[School Code]]","v":25}]
[180,"CUMBERLAND COUNTY",{"$f":"School_Listing[[#This Row],[System Code]]","v":180},8,{"$f":"School_Listing[[#This Row],[System Code]]&School_Listing[[#This Row],[School Code]]","v":"1808"},"Frank P. Brown Elementary",{"$f":"School_Listing[[#This Row],[School Code]]","v":8}]
[180,"CUMBERLAND COUNTY",{"$f":"School_Listing[[#This Row],[System Code]]","v":180},33,{"$f":"School_Listing[[#This Row],[System Code]]&School_Listing[[#This Row],[School Code]]","v":"18033"},"Glenn Martin Elementary",{"$f":"School_Listing[[#This Row],[School Code]]","v":33}]
[180,"CUMBERLAND COUNTY",{"$f":"School_Listing[[#This Row],[System Code]]","v":180},10,{"$f":"School_Listing[[#This Row],[System Code]]&School_Listing[[#This Row],[School Code]]","v":"18010"},"Homestead Elementary School",{"$f":"School_Listing[[#This Row],[School Code]]","v":10}]
[180,"CUMBERLAND COUNTY",{"$f":"School_Listing[[#This Row],[System Code]]","v":180},53,{"$f":"School_Listing[[#This Row],[System Code]]&School_Listing[[#This Row],[School Code]]","v":"18053"},"North Cumberland Elementary",{"$f":"School_Listing[[#This Row],[School Code]]","v":53}]
[180,"CUMBERLAND COUNTY",{"$f":"School_Listing[[#This Row],[System Code]]","v":180},55,{"$f":"School_Listing[[#This Row],[System Code]]&School_Listing[[#This Row],[School Code]]","v":"18055"},"Pine View Elementary",{"$f":"School_Listing[[#This Row],[School Code]]","v":55}]
[180,"CUMBERLAND COUNTY",{"$f":"School_Listing[[#This Row],[System Code]]","v":180},60,{"$f":"School_Listing[[#This Row],[System Code]]&School_Listing[[#This Row],[School Code]]","v":"18060"},"Pleasant Hill Elementary",{"$f":"School_Listing[[#This Row],[School Code]]","v":60}]
[180,"CUMBERLAND COUNTY",{"$f":"School_Listing[[#This Row],[System Code]]","v":180},73,{"$f":"School_Listing[[#This Row],[System Code]]&School_Listing[[#This Row],[School Code]]","v":"18073"},"South Cumberland Elementary",{"$f":"School_Listing[[#This Row],[School Code]]","v":73}]
[180,"CUMBERLAND COUNTY",{"$f":"School_Listing[[#This Row],[System Code]]","v":180},74,{"$f":"School_Listing[[#This Row],[System Code]]&School_Listing[[#This Row],[School Code]]","v":"18074"},"Stone Elementary",{"$f":"School_Listing[[#This Row],[School Code]]","v":74}]
[180,"CUMBERLAND COUNTY",{"$f":"School_Listing[[#This Row],[System Code]]","v":180},79,{"$f":"School_Listing[[#This Row],[System Code]]&School_Listing[[#This Row],[School Code]]","v":"18079"},"Stone Memorial High School",{"$f":"School_Listing[[#This Row],[School Code]]","v":79}]
[180,"CUMBERLAND COUNTY",{"$f":"School_Listing[[#This Row],[System Code]]","v":180},85,{"$f":"School_Listing[[#This Row],[System Code]]&School_Listing[[#This Row],[School Code]]","v":"18085"},"The Phoenix School",{"$f":"School_Listing[[#This Row],[School Code]]","v":85}]
[190,"DAVIDSON COUNTY",{"$f":"School_Listing[[#This Row],[System Code]]","v":190},1,{"$f":"School_Listing[[#This Row],[System Code]]&School_Listing[[#This Row],[School Code]]","v":"1901"},"A. Z. Kelley Elementary",{"$f":"School_Listing[[#This Row],[School Code]]","v":1}]
[190,"DAVIDSON COUNTY",{"$f":"School_Listing[[#This Row],[System Code]]","v":190},5,{"$f":"School_Listing[[#This Row],[System Code]]&School_Listing[[#This Row],[School Code]]","v":"1905"},"Alex Green Elementary",{"$f":"School_Listing[[#This Row],[School Code]]","v":5}]
[190,"DAVIDSON COUNTY",{"$f":"School_Listing[[#This Row],[System Code]]","v":190},10,{"$f":"School_Listing[[#This Row],[System Code]]&School_Listing[[#This Row],[School Code]]","v":"19010"},"Amqui Elementary",{"$f":"School_Listing[[#This Row],[School Code]]","v":10}]
[190,"DAVIDSON COUNTY",{"$f":"School_Listing[[#This Row],[System Code]]","v":190},15,{"$f":"School_Listing[[#This Row],[System Code]]&School_Listing[[#This Row],[School Code]]","v":"19015"},"Andrew Jackson Elementary",{"$f":"School_Listing[[#This Row],[School Code]]","v":15}]
[190,"DAVIDSON COUNTY",{"$f":"School_Listing[[#This Row],[System Code]]","v":190},20,{"$f":"School_Listing[[#This Row],[System Code]]&School_Listing[[#This Row],[School Code]]","v":"19020"},"Antioch High School",{"$f":"School_Listing[[#This Row],[School Code]]","v":20}]
[190,"DAVIDSON COUNTY",{"$f":"School_Listing[[#This Row],[System Code]]","v":190},23,{"$f":"School_Listing[[#This Row],[System Code]]&School_Listing[[#This Row],[School Code]]","v":"19023"},"Antioch Middle",{"$f":"School_Listing[[#This Row],[School Code]]","v":23}]
[190,"DAVIDSON COUNTY",{"$f":"School_Listing[[#This Row],[System Code]]","v":190},25,{"$f":"School_Listing[[#This Row],[System Code]]&School_Listing[[#This Row],[School Code]]","v":"19025"},"Apollo Middle",{"$f":"School_Listing[[#This Row],[School Code]]","v":25}]
[190,"DAVIDSON COUNTY",{"$f":"School_Listing[[#This Row],[System Code]]","v":190},8015,{"$f":"School_Listing[[#This Row],[System Code]]&School_Listing[[#This Row],[School Code]]","v":"1908015"},"Aventura Community School",{"$f":"School_Listing[[#This Row],[School Code]]","v":8015}]
[190,"DAVIDSON COUNTY",{"$f":"School_Listing[[#This Row],[System Code]]","v":190},40,{"$f":"School_Listing[[#This Row],[System Code]]&School_Listing[[#This Row],[School Code]]","v":"19040"},"Bellevue Middle",{"$f":"School_Listing[[#This Row],[School Code]]","v":40}]
[190,"DAVIDSON COUNTY",{"$f":"School_Listing[[#This Row],[System Code]]","v":190},45,{"$f":"School_Listing[[#This Row],[System Code]]&School_Listing[[#This Row],[School Code]]","v":"19045"},"Bellshire Elementary",{"$f":"School_Listing[[#This Row],[School Code]]","v":45}]
[190,"DAVIDSON COUNTY",{"$f":"School_Listing[[#This Row],[System Code]]","v":190},7005,{"$f":"School_Listing[[#This Row],[System Code]]&School_Listing[[#This Row],[School Code]]","v":"1907005"},"Cambridge Early Learning Center",{"$f":"School_Listing[[#This Row],[School Code]]","v":7005}]
[190,"DAVIDSON COUNTY",{"$f":"School_Listing[[#This Row],[System Code]]","v":190},82,{"$f":"School_Listing[[#This Row],[System Code]]&School_Listing[[#This Row],[School Code]]","v":"19082"},"Cane Ridge Elementary",{"$f":"School_Listing[[#This Row],[School Code]]","v":82}]
[190,"DAVIDSON COUNTY",{"$f":"School_Listing[[#This Row],[System Code]]","v":190},77,{"$f":"School_Listing[[#This Row],[System Code]]&School_Listing[[#This Row],[School Code]]","v":"19077"},"Cane Ridge High School",{"$f":"School_Listing[[#This Row],[School Code]]","v":77}]
[190,"DAVIDSON COUNTY",{"$f":"School_Listing[[#This Row],[System Code]]","v":190},670,{"$f":"School_Listing[[#This Row],[System Code]]&School_Listing[[#This Row],[School Code]]","v":"190670"},"Carter-Lawrence Elementary",{"$f":"School_Listing[[#This Row],[School Code]]","v":670}]
[190,"DAVIDSON COUNTY",{"$f":"School_Listing[[#This Row],[System Code]]","v":190},7020,{"$f":"School_Listing[[#This Row],[System Code]]&School_Listing[[#This Row],[School Code]]","v":"1907020"},"Casa Azafran Early Learning Center",{"$f":"School_Listing[[#This Row],[School Code]]","v":7020}]
[190,"DAVIDSON COUNTY",{"$f":"School_Listing[[#This Row],[System Code]]","v":190},105,{"$f":"School_Listing[[#This Row],[System Code]]&School_Listing[[#This Row],[School Code]]","v":"190105"},"Chadwell Elementary",{"$f":"School_Listing[[#This Row],[School Code]]","v":105}]
[190,"DAVIDSON COUNTY",{"$f":"School_Listing[[#This Row],[System Code]]","v":190},110,{"$f":"School_Listing[[#This Row],[System Code]]&School_Listing[[#This Row],[School Code]]","v":"190110"},"Charlotte Park Elementary",{"$f":"School_Listing[[#This Row],[School Code]]","v":110}]
[190,"DAVIDSON COUNTY",{"$f":"School_Listing[[#This Row],[System Code]]","v":190},120,{"$f":"School_Listing[[#This Row],[System Code]]&School_Listing[[#This Row],[School Code]]","v":"190120"},"Cockrill Elementary",{"$f":"School_Listing[[#This Row],[School Code]]","v":120}]
[190,"DAVIDSON COUNTY",{"$f":"School_Listing[[#This Row],[System Code]]","v":190},130,{"$f":"School_Listing[[#This Row],[System Code]]&School_Listing[[#This Row],[School Code]]","v":"190130"},"Cole Elementary",{"$f":"School_Listing[[#This Row],[School Code]]","v":130}]
[190,"DAVIDSON COUNTY",{"$f":"School_Listing[[#This Row],[System Code]]","v":190},443,{"$f":"School_Listing[[#This Row],[System Code]]&School_Listing[[#This Row],[School Code]]","v":"190443"},"Cora Howe School",{"$f":"School_Listing[[#This Row],[School Code]]","v":443}]
[190,"DAVIDSON COUNTY",{"$f":"School_Listing[[#This Row],[System Code]]","v":190},145,{"$f":"School_Listing[[#This Row],[System Code]]&School_Listing[[#This Row],[School Code]]","v":"190145"},"Crieve Hall Elementary",{"$f":"School_Listing[[#This Row],[School Code]]","v":145}]
[190,"DAVIDSON COUNTY",{"$f":"School_Listing[[#This Row],[System Code]]","v":190},148,{"$f":"School_Listing[[#This Row],[System Code]]&School_Listing[[#This Row],[School Code]]","v":"190148"},"Croft Middle",{"$f":"School_Listing[[#This Row],[School Code]]","v":148}]
[190,"DAVIDSON COUNTY",{"$f":"School_Listing[[#This Row],[System Code]]","v":190},150,{"$f":"School_Listing[[#This Row],[System Code]]&School_Listing[[#This Row],[School Code]]","v":"190150"},"Cumberland Elementary",{"$f":"School_Listing[[#This Row],[School Code]]","v":150}]
[190,"DAVIDSON COUNTY",{"$f":"School_Listing[[#This Row],[System Code]]","v":190},160,{"$f":"School_Listing[[#This Row],[System Code]]&School_Listing[[#This Row],[School Code]]","v":"190160"},"Dan Mills Elementary",{"$f":"School_Listing[[#This Row],[School Code]]","v":160}]
[190,"DAVIDSON COUNTY",{"$f":"School_Listing[[#This Row],[System Code]]","v":190},165,{"$f":"School_Listing[[#This Row],[System Code]]&School_Listing[[#This Row],[School Code]]","v":"190165"},"Dodson Elementary",{"$f":"School_Listing[[#This Row],[School Code]]","v":165}]
[190,"DAVIDSON COUNTY",{"$f":"School_Listing[[#This Row],[System Code]]","v":190},175,{"$f":"School_Listing[[#This Row],[System Code]]&School_Listing[[#This Row],[School Code]]","v":"190175"},"Donelson Middle",{"$f":"School_Listing[[#This Row],[School Code]]","v":175}]
[190,"DAVIDSON COUNTY",{"$f":"School_Listing[[#This Row],[System Code]]","v":190},180,{"$f":"School_Listing[[#This Row],[System Code]]&School_Listing[[#This Row],[School Code]]","v":"190180"},"DuPont Elementary",{"$f":"School_Listing[[#This Row],[School Code]]","v":180}]
[190,"DAVIDSON COUNTY",{"$f":"School_Listing[[#This Row],[System Code]]","v":190},190,{"$f":"School_Listing[[#This Row],[System Code]]&School_Listing[[#This Row],[School Code]]","v":"190190"},"DuPont Hadley Middle",{"$f":"School_Listing[[#This Row],[School Code]]","v":190}]
[190,"DAVIDSON COUNTY",{"$f":"School_Listing[[#This Row],[System Code]]","v":190},185,{"$f":"School_Listing[[#This Row],[System Code]]&School_Listing[[#This Row],[School Code]]","v":"190185"},"DuPont Tyler Middle",{"$f":"School_Listing[[#This Row],[School Code]]","v":185}]
[190,"DAVIDSON COUNTY",{"$f":"School_Listing[[#This Row],[System Code]]","v":190},115,{"$f":"School_Listing[[#This Row],[System Code]]&School_Listing[[#This Row],[School Code]]","v":"190115"},"Eagle View Elementary School",{"$f":"School_Listing[[#This Row],[School Code]]","v":115}]
[190,"DAVIDSON COUNTY",{"$f":"School_Listing[[#This Row],[System Code]]","v":190},195,{"$f":"School_Listing[[#This Row],[System Code]]&School_Listing[[#This Row],[School Code]]","v":"190195"},"Eakin Elementary",{"$f":"School_Listing[[#This Row],[School Code]]","v":195}]
[190,"DAVIDSON COUNTY",{"$f":"School_Listing[[#This Row],[System Code]]","v":190},437,{"$f":"School_Listing[[#This Row],[System Code]]&School_Listing[[#This Row],[School Code]]","v":"190437"},"Early College High School",{"$f":"School_Listing[[#This Row],[School Code]]","v":437}]
[190,"DAVIDSON COUNTY",{"$f":"School_Listing[[#This Row],[System Code]]","v":190},8009,{"$f":"School_Listing[[#This Row],[System Code]]&School_Listing[[#This Row],[School Code]]","v":"1908009"},"East End Preparatory School",{"$f":"School_Listing[[#This Row],[School Code]]","v":8009}]
[190,"DAVIDSON COUNTY",{"$f":"School_Listing[[#This Row],[System Code]]","v":190},203,{"$f":"School_Listing[[#This Row],[System Code]]&School_Listing[[#This Row],[School Code]]","v":"190203"},"East Nashville Magnet High School",{"$f":"School_Listing[[#This Row],[School Code]]","v":203}]
[190,"DAVIDSON COUNTY",{"$f":"School_Listing[[#This Row],[System Code]]","v":190},296,{"$f":"School_Listing[[#This Row],[System Code]]&School_Listing[[#This Row],[School Code]]","v":"190296"},"East Nashville Middle",{"$f":"School_Listing[[#This Row],[School Code]]","v":296}]
[190,"DAVIDSON COUNTY",{"$f":"School_Listing[[#This Row],[System Code]]","v":190},8060,{"$f":"School_Listing[[#This Row],[System Code]]&School_Listing[[#This Row],[School Code]]","v":"1908060"},"Explore Community School",{"$f":"School_Listing[[#This Row],[School Code]]","v":8060}]
[190,"DAVIDSON COUNTY",{"$f":"School_Listing[[#This Row],[System Code]]","v":190},220,{"$f":"School_Listing[[#This Row],[System Code]]&School_Listing[[#This Row],[School Code]]","v":"190220"},"Fall-Hamilton Elementary",{"$f":"School_Listing[[#This Row],[School Code]]","v":220}]
[190,"DAVIDSON COUNTY",{"$f":"School_Listing[[#This Row],[System Code]]","v":190},235,{"$f":"School_Listing[[#This Row],[System Code]]&School_Listing[[#This Row],[School Code]]","v":"190235"},"Gateway Elementary",{"$f":"School_Listing[[#This Row],[School Code]]","v":235}]
[190,"DAVIDSON COUNTY",{"$f":"School_Listing[[#This Row],[System Code]]","v":190},240,{"$f":"School_Listing[[#This Row],[System Code]]&School_Listing[[#This Row],[School Code]]","v":"190240"},"Glencliff Elementary",{"$f":"School_Listing[[#This Row],[School Code]]","v":240}]
[190,"DAVIDSON COUNTY",{"$f":"School_Listing[[#This Row],[System Code]]","v":190},245,{"$f":"School_Listing[[#This Row],[System Code]]&School_Listing[[#This Row],[School Code]]","v":"190245"},"Glencliff High School",{"$f":"School_Listing[[#This Row],[School Code]]","v":245}]
[190,"DAVIDSON COUNTY",{"$f":"School_Listing[[#This Row],[System Code]]","v":190},250,{"$f":"School_Listing[[#This Row],[System Code]]&School_Listing[[#This Row],[School Code]]","v":"190250"},"Glendale Elementary",{"$f":"School_Listing[[#This Row],[School Code]]","v":250}]
[190,"DAVIDSON COUNTY",{"$f":"School_Listing[[#This Row],[System Code]]","v":190},255,{"$f":"School_Listing[[#This Row],[System Code]]&School_Listing[[#This Row],[School Code]]","v":"190255"},"Glengarry Elementary",{"$f":"School_Listing[[#This Row],[School Code]]","v":255}]
[190,"DAVIDSON COUNTY",{"$f":"School_Listing[[#This Row],[System Code]]","v":190},265,{"$f":"School_Listing[[#This Row],[System Code]]&School_Listing[[#This Row],[School Code]]","v":"190265"},"Glenview Elementary",{"$f":"School_Listing[[#This Row],[School Code]]","v":265}]
[190,"DAVIDSON COUNTY",{"$f":"School_Listing[[#This Row],[System Code]]","v":190},270,{"$f":"School_Listing[[#This Row],[System Code]]&School_Listing[[#This Row],[School Code]]","v":"190270"},"Goodlettsville Elementary",{"$f":"School_Listing[[#This Row],[School Code]]","v":270}]
[190,"DAVIDSON COUNTY",{"$f":"School_Listing[[#This Row],[System Code]]","v":190},275,{"$f":"School_Listing[[#This Row],[System Code]]&School_Listing[[#This Row],[School Code]]","v":"190275"},"Goodlettsville Middle",{"$f":"School_Listing[[#This Row],[School Code]]","v":275}]
[190,"DAVIDSON COUNTY",{"$f":"School_Listing[[#This Row],[System Code]]","v":190},280,{"$f":"School_Listing[[#This Row],[System Code]]&School_Listing[[#This Row],[School Code]]","v":"190280"},"Gower Elementary",{"$f":"School_Listing[[#This Row],[School Code]]","v":280}]
[190,"DAVIDSON COUNTY",{"$f":"School_Listing[[#This Row],[System Code]]","v":190},290,{"$f":"School_Listing[[#This Row],[System Code]]&School_Listing[[#This Row],[School Code]]","v":"190290"},"Granbery Elementary",{"$f":"School_Listing[[#This Row],[School Code]]","v":290}]
[190,"DAVIDSON COUNTY",{"$f":"School_Listing[[#This Row],[System Code]]","v":190},295,{"$f":"School_Listing[[#This Row],[System Code]]&School_Listing[[#This Row],[School Code]]","v":"190295"},"H. G. Hill Middle",{"$f":"School_Listing[[#This Row],[School Code]]","v":295}]
[190,"DAVIDSON COUNTY",{"$f":"School_Listing[[#This Row],[System Code]]","v":190},300,{"$f":"School_Listing[[#This Row],[System Code]]&School_Listing[[#This Row],[School Code]]","v":"190300"},"Harpeth Valley Elementary",{"$f":"School_Listing[[#This Row],[School Code]]","v":300}]
[190,"DAVIDSON COUNTY",{"$f":"School_Listing[[#This Row],[System Code]]","v":190},302,{"$f":"School_Listing[[#This Row],[System Code]]&School_Listing[[#This Row],[School Code]]","v":"190302"},"Harris-Hillman Special Education",{"$f":"School_Listing[[#This Row],[School Code]]","v":302}]
[190,"DAVIDSON COUNTY",{"$f":"School_Listing[[#This Row],[System Code]]","v":190},140,{"$f":"School_Listing[[#This Row],[System Code]]&School_Listing[[#This Row],[School Code]]","v":"190140"},"Hattie Cotton Elementary",{"$f":"School_Listing[[#This Row],[School Code]]","v":140}]
[190,"DAVIDSON COUNTY",{"$f":"School_Listing[[#This Row],[System Code]]","v":190},305,{"$f":"School_Listing[[#This Row],[System Code]]&School_Listing[[#This Row],[School Code]]","v":"190305"},"Haynes Middle",{"$f":"School_Listing[[#This Row],[School Code]]","v":305}]
[190,"DAVIDSON COUNTY",{"$f":"School_Listing[[#This Row],[System Code]]","v":190},310,{"$f":"School_Listing[[#This Row],[System Code]]&School_Listing[[#This Row],[School Code]]","v":"190310"},"Haywood Elementary",{"$f":"School_Listing[[#This Row],[School Code]]","v":310}]
[190,"DAVIDSON COUNTY",{"$f":"School_Listing[[#This Row],[System Code]]","v":190},315,{"$f":"School_Listing[[#This Row],[System Code]]&School_Listing[[#This Row],[School Code]]","v":"190315"},"Head Middle",{"$f":"School_Listing[[#This Row],[School Code]]","v":315}]
[190,"DAVIDSON COUNTY",{"$f":"School_Listing[[#This Row],[System Code]]","v":190},318,{"$f":"School_Listing[[#This Row],[System Code]]&School_Listing[[#This Row],[School Code]]","v":"190318"},"Henry C. Maxwell Elementary",{"$f":"School_Listing[[#This Row],[School Code]]","v":318}]
[190,"DAVIDSON COUNTY",{"$f":"School_Listing[[#This Row],[System Code]]","v":190},320,{"$f":"School_Listing[[#This Row],[System Code]]&School_Listing[[#This Row],[School Code]]","v":"190320"},"Hermitage Elementary",{"$f":"School_Listing[[#This Row],[School Code]]","v":320}]
[190,"DAVIDSON COUNTY",{"$f":"School_Listing[[#This Row],[System Code]]","v":190},327,{"$f":"School_Listing[[#This Row],[System Code]]&School_Listing[[#This Row],[School Code]]","v":"190327"},"Hickman Elementary",{"$f":"School_Listing[[#This Row],[School Code]]","v":327}]
[190,"DAVIDSON COUNTY",{"$f":"School_Listing[[#This Row],[System Code]]","v":190},335,{"$f":"School_Listing[[#This Row],[System Code]]&School_Listing[[#This Row],[School Code]]","v":"190335"},"Hillsboro High",{"$f":"School_Listing[[#This Row],[School Code]]","v":335}]
[190,"DAVIDSON COUNTY",{"$f":"School_Listing[[#This Row],[System Code]]","v":190},340,{"$f":"School_Listing[[#This Row],[System Code]]&School_Listing[[#This Row],[School Code]]","v":"190340"},"Hillwood High",{"$f":"School_Listing[[#This Row],[School Code]]","v":340}]
[190,"DAVIDSON COUNTY",{"$f":"School_Listing[[#This Row],[System Code]]","v":190},350,{"$f":"School_Listing[[#This Row],[System Code]]&School_Listing[[#This Row],[School Code]]","v":"190350"},"Hull-Jackson Elementary",{"$f":"School_Listing[[#This Row],[School Code]]","v":350}]
[190,"DAVIDSON COUNTY",{"$f":"School_Listing[[#This Row],[System Code]]","v":190},355,{"$f":"School_Listing[[#This Row],[System Code]]&School_Listing[[#This Row],[School Code]]","v":"190355"},"Hume - Fogg High",{"$f":"School_Listing[[#This Row],[School Code]]","v":355}]
[190,"DAVIDSON COUNTY",{"$f":"School_Listing[[#This Row],[System Code]]","v":190},358,{"$f":"School_Listing[[#This Row],[System Code]]&School_Listing[[#This Row],[School Code]]","v":"190358"},"Hunters Lane High",{"$f":"School_Listing[[#This Row],[School Code]]","v":358}]
[190,"DAVIDSON COUNTY",{"$f":"School_Listing[[#This Row],[System Code]]","v":190},80,{"$f":"School_Listing[[#This Row],[System Code]]&School_Listing[[#This Row],[School Code]]","v":"19080"},"Ida B. Wells Elementary",{"$f":"School_Listing[[#This Row],[School Code]]","v":80}]
[190,"DAVIDSON COUNTY",{"$f":"School_Listing[[#This Row],[System Code]]","v":190},360,{"$f":"School_Listing[[#This Row],[System Code]]&School_Listing[[#This Row],[School Code]]","v":"190360"},"Inglewood Elementary",{"$f":"School_Listing[[#This Row],[School Code]]","v":360}]
[190,"DAVIDSON COUNTY",{"$f":"School_Listing[[#This Row],[System Code]]","v":190},8048,{"$f":"School_Listing[[#This Row],[System Code]]&School_Listing[[#This Row],[School Code]]","v":"1908048"},"Intrepid College Preparatory Charter School",{"$f":"School_Listing[[#This Row],[School Code]]","v":8048}]
[190,"DAVIDSON COUNTY",{"$f":"School_Listing[[#This Row],[System Code]]","v":190},365,{"$f":"School_Listing[[#This Row],[System Code]]&School_Listing[[#This Row],[School Code]]","v":"190365"},"Isaac Litton Middle",{"$f":"School_Listing[[#This Row],[School Code]]","v":365}]
[190,"DAVIDSON COUNTY",{"$f":"School_Listing[[#This Row],[System Code]]","v":190},700,{"$f":"School_Listing[[#This Row],[System Code]]&School_Listing[[#This Row],[School Code]]","v":"190700"},"Isaiah T. Creswell Middle School of the Arts",{"$f":"School_Listing[[#This Row],[School Code]]","v":700}]
[190,"DAVIDSON COUNTY",{"$f":"School_Listing[[#This Row],[System Code]]","v":190},7010,{"$f":"School_Listing[[#This Row],[System Code]]&School_Listing[[#This Row],[School Code]]","v":"1907010"},"Ivanetta H. Davis Learning Center at Bordeaux",{"$f":"School_Listing[[#This Row],[School Code]]","v":7010}]
[190,"DAVIDSON COUNTY",{"$f":"School_Listing[[#This Row],[System Code]]","v":190},370,{"$f":"School_Listing[[#This Row],[System Code]]&School_Listing[[#This Row],[School Code]]","v":"190370"},"J. E. Moss Elementary",{"$f":"School_Listing[[#This Row],[School Code]]","v":370}]
[190,"DAVIDSON COUNTY",{"$f":"School_Listing[[#This Row],[System Code]]","v":190},375,{"$f":"School_Listing[[#This Row],[System Code]]&School_Listing[[#This Row],[School Code]]","v":"190375"},"Jere Baxter Middle",{"$f":"School_Listing[[#This Row],[School Code]]","v":375}]
[190,"DAVIDSON COUNTY",{"$f":"School_Listing[[#This Row],[System Code]]","v":190},380,{"$f":"School_Listing[[#This Row],[System Code]]&School_Listing[[#This Row],[School Code]]","v":"190380"},"Joelton Elementary",{"$f":"School_Listing[[#This Row],[School Code]]","v":380}]
[190,"DAVIDSON COUNTY",{"$f":"School_Listing[[#This Row],[System Code]]","v":190},390,{"$f":"School_Listing[[#This Row],[System Code]]&School_Listing[[#This Row],[School Code]]","v":"190390"},"John B. Whitsitt Elementary",{"$f":"School_Listing[[#This Row],[School Code]]","v":390}]
[190,"DAVIDSON COUNTY",{"$f":"School_Listing[[#This Row],[System Code]]","v":190},386,{"$f":"School_Listing[[#This Row],[System Code]]&School_Listing[[#This Row],[School Code]]","v":"190386"},"John Early Middle",{"$f":"School_Listing[[#This Row],[School Code]]","v":386}]
[190,"DAVIDSON COUNTY",{"$f":"School_Listing[[#This Row],[System Code]]","v":190},393,{"$f":"School_Listing[[#This Row],[System Code]]&School_Listing[[#This Row],[School Code]]","v":"190393"},"John F. Kennedy Middle",{"$f":"School_Listing[[#This Row],[School Code]]","v":393}]
[190,"DAVIDSON COUNTY",{"$f":"School_Listing[[#This Row],[System Code]]","v":190},395,{"$f":"School_Listing[[#This Row],[System Code]]&School_Listing[[#This Row],[School Code]]","v":"190395"},"John Overton High",{"$f":"School_Listing[[#This Row],[School Code]]","v":395}]
[190,"DAVIDSON COUNTY",{"$f":"School_Listing[[#This Row],[System Code]]","v":190},490,{"$f":"School_Listing[[#This Row],[System Code]]&School_Listing[[#This Row],[School Code]]","v":"190490"},"John Trotwood Moore Middle",{"$f":"School_Listing[[#This Row],[School Code]]","v":490}]
[190,"DAVIDSON COUNTY",{"$f":"School_Listing[[#This Row],[System Code]]","v":190},740,{"$f":"School_Listing[[#This Row],[System Code]]&School_Listing[[#This Row],[School Code]]","v":"190740"},"Johnson Alternative Learning Center",{"$f":"School_Listing[[#This Row],[School Code]]","v":740}]
[190,"DAVIDSON COUNTY",{"$f":"School_Listing[[#This Row],[System Code]]","v":190},387,{"$f":"School_Listing[[#This Row],[System Code]]&School_Listing[[#This Row],[School Code]]","v":"190387"},"Jones Elementary",{"$f":"School_Listing[[#This Row],[School Code]]","v":387}]
[190,"DAVIDSON COUNTY",{"$f":"School_Listing[[#This Row],[System Code]]","v":190},415,{"$f":"School_Listing[[#This Row],[System Code]]&School_Listing[[#This Row],[School Code]]","v":"190415"},"Julia Green Elementary",{"$f":"School_Listing[[#This Row],[School Code]]","v":415}]
[190,"DAVIDSON COUNTY",{"$f":"School_Listing[[#This Row],[System Code]]","v":190},8105,{"$f":"School_Listing[[#This Row],[System Code]]&School_Listing[[#This Row],[School Code]]","v":"1908105"},"KA @ The Crossings",{"$f":"School_Listing[[#This Row],[School Code]]","v":8105}]
[190,"DAVIDSON COUNTY",{"$f":"School_Listing[[#This Row],[System Code]]","v":190},8002,{"$f":"School_Listing[[#This Row],[System Code]]&School_Listing[[#This Row],[School Code]]","v":"1908002"},"KIPP Academy Nashville",{"$f":"School_Listing[[#This Row],[School Code]]","v":8002}]
[190,"DAVIDSON COUNTY",{"$f":"School_Listing[[#This Row],[System Code]]","v":190},8095,{"$f":"School_Listing[[#This Row],[System Code]]&School_Listing[[#This Row],[School Code]]","v":"1908095"},"KIPP Academy Nashville Elementary School",{"$f":"School_Listing[[#This Row],[School Code]]","v":8095}]
[190,"DAVIDSON COUNTY",{"$f":"School_Listing[[#This Row],[System Code]]","v":190},8042,{"$f":"School_Listing[[#This Row],[System Code]]&School_Listing[[#This Row],[School Code]]","v":"1908042"},"KIPP Nashville College Prep",{"$f":"School_Listing[[#This Row],[School Code]]","v":8042}]
[190,"DAVIDSON COUNTY",{"$f":"School_Listing[[#This Row],[System Code]]","v":190},8085,{"$f":"School_Listing[[#This Row],[System Code]]&School_Listing[[#This Row],[School Code]]","v":"1908085"},"KIPP Nashville College Prep Elementary",{"$f":"School_Listing[[#This Row],[School Code]]","v":8085}]
[190,"DAVIDSON COUNTY",{"$f":"School_Listing[[#This Row],[System Code]]","v":190},8011,{"$f":"School_Listing[[#This Row],[System Code]]&School_Listing[[#This Row],[School Code]]","v":"1908011"},"KIPP Nashville Collegiate High School",{"$f":"School_Listing[[#This Row],[School Code]]","v":8011}]
[190,"DAVIDSON COUNTY",{"$f":"School_Listing[[#This Row],[System Code]]","v":190},8065,{"$f":"School_Listing[[#This Row],[System Code]]&School_Listing[[#This Row],[School Code]]","v":"1908065"},"Knowledge Academies High School",{"$f":"School_Listing[[#This Row],[School Code]]","v":8065}]
[190,"DAVIDSON COUNTY",{"$f":"School_Listing[[#This Row],[System Code]]","v":190},430,{"$f":"School_Listing[[#This Row],[System Code]]&School_Listing[[#This Row],[School Code]]","v":"190430"},"Lakeview Elementary",{"$f":"School_Listing[[#This Row],[School Code]]","v":430}]
[190,"DAVIDSON COUNTY",{"$f":"School_Listing[[#This Row],[System Code]]","v":190},8003,{"$f":"School_Listing[[#This Row],[System Code]]&School_Listing[[#This Row],[School Code]]","v":"1908003"},"Lead Academy",{"$f":"School_Listing[[#This Row],[School Code]]","v":8003}]
[190,"DAVIDSON COUNTY",{"$f":"School_Listing[[#This Row],[System Code]]","v":190},8010,{"$f":"School_Listing[[#This Row],[System Code]]&School_Listing[[#This Row],[School Code]]","v":"1908010"},"LEAD Cameron",{"$f":"School_Listing[[#This Row],[School Code]]","v":8010}]
[190,"DAVIDSON COUNTY",{"$f":"School_Listing[[#This Row],[System Code]]","v":190},8013,{"$f":"School_Listing[[#This Row],[System Code]]&School_Listing[[#This Row],[School Code]]","v":"1908013"},"LEAD Southeast",{"$f":"School_Listing[[#This Row],[School Code]]","v":8013}]
[190,"DAVIDSON COUNTY",{"$f":"School_Listing[[#This Row],[System Code]]","v":190},8005,{"$f":"School_Listing[[#This Row],[System Code]]&School_Listing[[#This Row],[School Code]]","v":"1908005"},"Liberty Collegiate Academy",{"$f":"School_Listing[[#This Row],[School Code]]","v":8005}]
[190,"DAVIDSON COUNTY",{"$f":"School_Listing[[#This Row],[System Code]]","v":190},435,{"$f":"School_Listing[[#This Row],[System Code]]&School_Listing[[#This Row],[School Code]]","v":"190435"},"Lockeland Elementary",{"$f":"School_Listing[[#This Row],[School Code]]","v":435}]
[190,"DAVIDSON COUNTY",{"$f":"School_Listing[[#This Row],[System Code]]","v":190},622,{"$f":"School_Listing[[#This Row],[System Code]]&School_Listing[[#This Row],[School Code]]","v":"190622"},"Madison Middle",{"$f":"School_Listing[[#This Row],[School Code]]","v":622}]
[190,"DAVIDSON COUNTY",{"$f":"School_Listing[[#This Row],[System Code]]","v":190},445,{"$f":"School_Listing[[#This Row],[System Code]]&School_Listing[[#This Row],[School Code]]","v":"190445"},"Maplewood High",{"$f":"School_Listing[[#This Row],[School Code]]","v":445}]
[190,"DAVIDSON COUNTY",{"$f":"School_Listing[[#This Row],[System Code]]","v":190},450,{"$f":"School_Listing[[#This Row],[System Code]]&School_Listing[[#This Row],[School Code]]","v":"190450"},"Margaret Allen Middle",{"$f":"School_Listing[[#This Row],[School Code]]","v":450}]
[190,"DAVIDSON COUNTY",{"$f":"School_Listing[[#This Row],[System Code]]","v":190},7001,{"$f":"School_Listing[[#This Row],[System Code]]&School_Listing[[#This Row],[School Code]]","v":"1907001"},"Martha O' Bryan Center",{"$f":"School_Listing[[#This Row],[School Code]]","v":7001}]
[190,"DAVIDSON COUNTY",{"$f":"School_Listing[[#This Row],[System Code]]","v":190},456,{"$f":"School_Listing[[#This Row],[System Code]]&School_Listing[[#This Row],[School Code]]","v":"190456"},"Martin Luther King Jr School",{"$f":"School_Listing[[#This Row],[School Code]]","v":456}]
[190,"DAVIDSON COUNTY",{"$f":"School_Listing[[#This Row],[System Code]]","v":190},608,{"$f":"School_Listing[[#This Row],[System Code]]&School_Listing[[#This Row],[School Code]]","v":"190608"},"May Werthan Shayne Elementary School",{"$f":"School_Listing[[#This Row],[School Code]]","v":608}]
[190,"DAVIDSON COUNTY",{"$f":"School_Listing[[#This Row],[System Code]]","v":190},465,{"$f":"School_Listing[[#This Row],[System Code]]&School_Listing[[#This Row],[School Code]]","v":"190465"},"McGavock Elementary",{"$f":"School_Listing[[#This Row],[School Code]]","v":465}]
[190,"DAVIDSON COUNTY",{"$f":"School_Listing[[#This Row],[System Code]]","v":190},470,{"$f":"School_Listing[[#This Row],[System Code]]&School_Listing[[#This Row],[School Code]]","v":"190470"},"McGavock High",{"$f":"School_Listing[[#This Row],[School Code]]","v":470}]
[190,"DAVIDSON COUNTY",{"$f":"School_Listing[[#This Row],[System Code]]","v":190},480,{"$f":"School_Listing[[#This Row],[System Code]]&School_Listing[[#This Row],[School Code]]","v":"190480"},"McMurray Middle",{"$f":"School_Listing[[#This Row],[School Code]]","v":480}]
[190,"DAVIDSON COUNTY",{"$f":"School_Listing[[#This Row],[System Code]]","v":190},330,{"$f":"School_Listing[[#This Row],[System Code]]&School_Listing[[#This Row],[School Code]]","v":"190330"},"Meigs Middle",{"$f":"School_Listing[[#This Row],[School Code]]","v":330}]
[190,"DAVIDSON COUNTY",{"$f":"School_Listing[[#This Row],[System Code]]","v":190},3,{"$f":"School_Listing[[#This Row],[System Code]]&School_Listing[[#This Row],[School Code]]","v":"1903"},"MNPS Virtual School",{"$f":"School_Listing[[#This Row],[School Code]]","v":3}]
[190,"DAVIDSON COUNTY",{"$f":"School_Listing[[#This Row],[System Code]]","v":190},35,{"$f":"School_Listing[[#This Row],[System Code]]&School_Listing[[#This Row],[School Code]]","v":"19035"},"Moses McKissack Middle",{"$f":"School_Listing[[#This Row],[School Code]]","v":35}]
[190,"DAVIDSON COUNTY",{"$f":"School_Listing[[#This Row],[System Code]]","v":190},493,{"$f":"School_Listing[[#This Row],[System Code]]&School_Listing[[#This Row],[School Code]]","v":"190493"},"Mt. View Elementary",{"$f":"School_Listing[[#This Row],[School Code]]","v":493}]
[190,"DAVIDSON COUNTY",{"$f":"School_Listing[[#This Row],[System Code]]","v":190},505,{"$f":"School_Listing[[#This Row],[System Code]]&School_Listing[[#This Row],[School Code]]","v":"190505"},"Murrell at Glenn School",{"$f":"School_Listing[[#This Row],[School Code]]","v":505}]
[190,"DAVIDSON COUNTY",{"$f":"School_Listing[[#This Row],[System Code]]","v":190},510,{"$f":"School_Listing[[#This Row],[System Code]]&School_Listing[[#This Row],[School Code]]","v":"190510"},"Napier Elementary",{"$f":"School_Listing[[#This Row],[School Code]]","v":510}]
[190,"DAVIDSON COUNTY",{"$f":"School_Listing[[#This Row],[System Code]]","v":190},53,{"$f":"School_Listing[[#This Row],[System Code]]&School_Listing[[#This Row],[School Code]]","v":"19053"},"Nashville Big Picture High School",{"$f":"School_Listing[[#This Row],[School Code]]","v":53}]
[190,"DAVIDSON COUNTY",{"$f":"School_Listing[[#This Row],[System Code]]","v":190},8044,{"$f":"School_Listing[[#This Row],[System Code]]&School_Listing[[#This Row],[School Code]]","v":"1908044"},"Nashville Classical",{"$f":"School_Listing[[#This Row],[School Code]]","v":8044}]
[190,"DAVIDSON COUNTY",{"$f":"School_Listing[[#This Row],[System Code]]","v":190},8008,{"$f":"School_Listing[[#This Row],[System Code]]&School_Listing[[#This Row],[School Code]]","v":"1908008"},"Nashville Prep",{"$f":"School_Listing[[#This Row],[School Code]]","v":8008}]
[190,"DAVIDSON COUNTY",{"$f":"School_Listing[[#This Row],[System Code]]","v":190},512,{"$f":"School_Listing[[#This Row],[System Code]]&School_Listing[[#This Row],[School Code]]","v":"190512"},"Nashville School Of The Arts",{"$f":"School_Listing[[#This Row],[School Code]]","v":512}]
[190,"DAVIDSON COUNTY",{"$f":"School_Listing[[#This Row],[System Code]]","v":190},515,{"$f":"School_Listing[[#This Row],[System Code]]&School_Listing[[#This Row],[School Code]]","v":"190515"},"Neely's Bend Elementary",{"$f":"School_Listing[[#This Row],[School Code]]","v":515}]
[190,"DAVIDSON COUNTY",{"$f":"School_Listing[[#This Row],[System Code]]","v":190},525,{"$f":"School_Listing[[#This Row],[System Code]]&School_Listing[[#This Row],[School Code]]","v":"190525"},"Norman Binkley Elementary",{"$f":"School_Listing[[#This Row],[School Code]]","v":525}]
[190,"DAVIDSON COUNTY",{"$f":"School_Listing[[#This Row],[System Code]]","v":190},535,{"$f":"School_Listing[[#This Row],[System Code]]&School_Listing[[#This Row],[School Code]]","v":"190535"},"Old Center Elementary",{"$f":"School_Listing[[#This Row],[School Code]]","v":535}]
[190,"DAVIDSON COUNTY",{"$f":"School_Listing[[#This Row],[System Code]]","v":190},540,{"$f":"School_Listing[[#This Row],[System Code]]&School_Listing[[#This Row],[School Code]]","v":"190540"},"Paragon Mills Elementary",{"$f":"School_Listing[[#This Row],[School Code]]","v":540}]
[190,"DAVIDSON COUNTY",{"$f":"School_Listing[[#This Row],[System Code]]","v":190},545,{"$f":"School_Listing[[#This Row],[System Code]]&School_Listing[[#This Row],[School Code]]","v":"190545"},"Park Avenue Elementary",{"$f":"School_Listing[[#This Row],[School Code]]","v":545}]
[190,"DAVIDSON COUNTY",{"$f":"School_Listing[[#This Row],[System Code]]","v":190},555,{"$f":"School_Listing[[#This Row],[System Code]]&School_Listing[[#This Row],[School Code]]","v":"190555"},"Pearl-Cohn High",{"$f":"School_Listing[[#This Row],[School Code]]","v":555}]
[190,"DAVIDSON COUNTY",{"$f":"School_Listing[[#This Row],[System Code]]","v":190},565,{"$f":"School_Listing[[#This Row],[System Code]]&School_Listing[[#This Row],[School Code]]","v":"190565"},"Pennington Elementary",{"$f":"School_Listing[[#This Row],[School Code]]","v":565}]
[190,"DAVIDSON COUNTY",{"$f":"School_Listing[[#This Row],[System Code]]","v":190},570,{"$f":"School_Listing[[#This Row],[System Code]]&School_Listing[[#This Row],[School Code]]","v":"190570"},"Percy Priest Elementary",{"$f":"School_Listing[[#This Row],[School Code]]","v":570}]
[190,"DAVIDSON COUNTY",{"$f":"School_Listing[[#This Row],[System Code]]","v":190},8046,{"$f":"School_Listing[[#This Row],[System Code]]&School_Listing[[#This Row],[School Code]]","v":"1908046"},"Purpose Prep",{"$f":"School_Listing[[#This Row],[School Code]]","v":8046}]
[190,"DAVIDSON COUNTY",{"$f":"School_Listing[[#This Row],[System Code]]","v":190},8100,{"$f":"School_Listing[[#This Row],[System Code]]&School_Listing[[#This Row],[School Code]]","v":"1908100"},"RePublic High School",{"$f":"School_Listing[[#This Row],[School Code]]","v":8100}]
[190,"DAVIDSON COUNTY",{"$f":"School_Listing[[#This Row],[System Code]]","v":190},618,{"$f":"School_Listing[[#This Row],[System Code]]&School_Listing[[#This Row],[School Code]]","v":"190618"},"Robert Churchwell Elementary",{"$f":"School_Listing[[#This Row],[School Code]]","v":618}]
[190,"DAVIDSON COUNTY",{"$f":"School_Listing[[#This Row],[System Code]]","v":190},8050,{"$f":"School_Listing[[#This Row],[System Code]]&School_Listing[[#This Row],[School Code]]","v":"1908050"},"Rocketship Nashville Northeast Elementary",{"$f":"School_Listing[[#This Row],[School Code]]","v":8050}]
[190,"DAVIDSON COUNTY",{"$f":"School_Listing[[#This Row],[System Code]]","v":190},8070,{"$f":"School_Listing[[#This Row],[System Code]]&School_Listing[[#This Row],[School Code]]","v":"1908070"},"Rocketship United",{"$f":"School_Listing[[#This Row],[School Code]]","v":8070}]
[190,"DAVIDSON COUNTY",{"$f":"School_Listing[[#This Row],[System Code]]","v":190},595,{"$f":"School_Listing[[#This Row],[System Code]]&School_Listing[[#This Row],[School Code]]","v":"190595"},"Rose Park Middle",{"$f":"School_Listing[[#This Row],[School Code]]","v":595}]
[190,"DAVIDSON COUNTY",{"$f":"School_Listing[[#This Row],[System Code]]","v":190},600,{"$f":"School_Listing[[#This Row],[System Code]]&School_Listing[[#This Row],[School Code]]","v":"190600"},"Rosebank Elementary",{"$f":"School_Listing[[#This Row],[School Code]]","v":600}]
[190,"DAVIDSON COUNTY",{"$f":"School_Listing[[#This Row],[System Code]]","v":190},7015,{"$f":"School_Listing[[#This Row],[System Code]]&School_Listing[[#This Row],[School Code]]","v":"1907015"},"Ross Early Learning Center",{"$f":"School_Listing[[#This Row],[School Code]]","v":7015}]
[190,"DAVIDSON COUNTY",{"$f":"School_Listing[[#This Row],[System Code]]","v":190},607,{"$f":"School_Listing[[#This Row],[System Code]]&School_Listing[[#This Row],[School Code]]","v":"190607"},"Ruby Major Elementary",{"$f":"School_Listing[[#This Row],[School Code]]","v":607}]
[190,"DAVIDSON COUNTY",{"$f":"School_Listing[[#This Row],[System Code]]","v":190},610,{"$f":"School_Listing[[#This Row],[System Code]]&School_Listing[[#This Row],[School Code]]","v":"190610"},"Shwab Elementary",{"$f":"School_Listing[[#This Row],[School Code]]","v":610}]
[190,"DAVIDSON COUNTY",{"$f":"School_Listing[[#This Row],[System Code]]","v":190},750,{"$f":"School_Listing[[#This Row],[System Code]]&School_Listing[[#This Row],[School Code]]","v":"190750"},"Smith Springs Elementary School",{"$f":"School_Listing[[#This Row],[School Code]]","v":750}]
[190,"DAVIDSON COUNTY",{"$f":"School_Listing[[#This Row],[System Code]]","v":190},8001,{"$f":"School_Listing[[#This Row],[System Code]]&School_Listing[[#This Row],[School Code]]","v":"1908001"},"Smithson Craighead Academy",{"$f":"School_Listing[[#This Row],[School Code]]","v":8001}]
[190,"DAVIDSON COUNTY",{"$f":"School_Listing[[#This Row],[System Code]]","v":190},615,{"$f":"School_Listing[[#This Row],[System Code]]&School_Listing[[#This Row],[School Code]]","v":"190615"},"Stanford Elementary",{"$f":"School_Listing[[#This Row],[School Code]]","v":615}]
[190,"DAVIDSON COUNTY",{"$f":"School_Listing[[#This Row],[System Code]]","v":190},8006,{"$f":"School_Listing[[#This Row],[System Code]]&School_Listing[[#This Row],[School Code]]","v":"1908006"},"STEM Prep Academy",{"$f":"School_Listing[[#This Row],[School Code]]","v":8006}]
[190,"DAVIDSON COUNTY",{"$f":"School_Listing[[#This Row],[System Code]]","v":190},8075,{"$f":"School_Listing[[#This Row],[System Code]]&School_Listing[[#This Row],[School Code]]","v":"1908075"},"STEM Prep High School",{"$f":"School_Listing[[#This Row],[School Code]]","v":8075}]
[190,"DAVIDSON COUNTY",{"$f":"School_Listing[[#This Row],[System Code]]","v":190},620,{"$f":"School_Listing[[#This Row],[System Code]]&School_Listing[[#This Row],[School Code]]","v":"190620"},"Stratford STEM Magnet School",{"$f":"School_Listing[[#This Row],[School Code]]","v":620}]
[190,"DAVIDSON COUNTY",{"$f":"School_Listing[[#This Row],[System Code]]","v":190},625,{"$f":"School_Listing[[#This Row],[System Code]]&School_Listing[[#This Row],[School Code]]","v":"190625"},"Stratton Elementary",{"$f":"School_Listing[[#This Row],[School Code]]","v":625}]
[190,"DAVIDSON COUNTY",{"$f":"School_Listing[[#This Row],[System Code]]","v":190},8090,{"$f":"School_Listing[[#This Row],[System Code]]&School_Listing[[#This Row],[School Code]]","v":"1908090"},"Strive Collegiate Academy",{"$f":"School_Listing[[#This Row],[School Code]]","v":8090}]
[190,"DAVIDSON COUNTY",{"$f":"School_Listing[[#This Row],[System Code]]","v":190},7002,{"$f":"School_Listing[[#This Row],[System Code]]&School_Listing[[#This Row],[School Code]]","v":"1907002"},"Susan Gray School",{"$f":"School_Listing[[#This Row],[School Code]]","v":7002}]
[190,"DAVIDSON COUNTY",{"$f":"School_Listing[[#This Row],[System Code]]","v":190},630,{"$f":"School_Listing[[#This Row],[System Code]]&School_Listing[[#This Row],[School Code]]","v":"190630"},"Sylvan Park Elementary",{"$f":"School_Listing[[#This Row],[School Code]]","v":630}]
[190,"DAVIDSON COUNTY",{"$f":"School_Listing[[#This Row],[System Code]]","v":190},720,{"$f":"School_Listing[[#This Row],[System Code]]&School_Listing[[#This Row],[School Code]]","v":"190720"},"The Academy at Hickory Hollow",{"$f":"School_Listing[[#This Row],[School Code]]","v":720}]
[190,"DAVIDSON COUNTY",{"$f":"School_Listing[[#This Row],[System Code]]","v":190},614,{"$f":"School_Listing[[#This Row],[System Code]]&School_Listing[[#This Row],[School Code]]","v":"190614"},"The Academy at Old Cockrill",{"$f":"School_Listing[[#This Row],[School Code]]","v":614}]
[190,"DAVIDSON COUNTY",{"$f":"School_Listing[[#This Row],[System Code]]","v":190},612,{"$f":"School_Listing[[#This Row],[System Code]]&School_Listing[[#This Row],[School Code]]","v":"190612"},"The Academy at Opry Mills",{"$f":"School_Listing[[#This Row],[School Code]]","v":612}]
[190,"DAVIDSON COUNTY",{"$f":"School_Listing[[#This Row],[System Code]]","v":190},208,{"$f":"School_Listing[[#This Row],[System Code]]&School_Listing[[#This Row],[School Code]]","v":"190208"},"Thomas A. Edison Elementary",{"$f":"School_Listing[[#This Row],[School Code]]","v":208}]
[190,"DAVIDSON COUNTY",{"$f":"School_Listing[[#This Row],[System Code]]","v":190},633,{"$f":"School_Listing[[#This Row],[System Code]]&School_Listing[[#This Row],[School Code]]","v":"190633"},"Thurgood Marshall Middle",{"$f":"School_Listing[[#This Row],[School Code]]","v":633}]
[190,"DAVIDSON COUNTY",{"$f":"School_Listing[[#This Row],[System Code]]","v":190},635,{"$f":"School_Listing[[#This Row],[System Code]]&School_Listing[[#This Row],[School Code]]","v":"190635"},"Tom Joy Elementary",{"$f":"School_Listing[[#This Row],[School Code]]","v":635}]
[190,"DAVIDSON COUNTY",{"$f":"School_Listing[[#This Row],[System Code]]","v":190},725,{"$f":"School_Listing[[#This Row],[System Code]]&School_Listing[[#This Row],[School Code]]","v":"190725"},"Transitions at Bass",{"$f":"School_Listing[[#This Row],[School Code]]","v":725}]
[190,"DAVIDSON COUNTY",{"$f":"School_Listing[[#This Row],[System Code]]","v":190},637,{"$f":"School_Listing[[#This Row],[System Code]]&School_Listing[[#This Row],[School Code]]","v":"190637"},"Tulip Grove Elementary",{"$f":"School_Listing[[#This Row],[School Code]]","v":637}]
[190,"DAVIDSON COUNTY",{"$f":"School_Listing[[#This Row],[System Code]]","v":190},645,{"$f":"School_Listing[[#This Row],[System Code]]&School_Listing[[#This Row],[School Code]]","v":"190645"},"Tusculum Elementary",{"$f":"School_Listing[[#This Row],[School Code]]","v":645}]
[190,"DAVIDSON COUNTY",{"$f":"School_Listing[[#This Row],[System Code]]","v":190},650,{"$f":"School_Listing[[#This Row],[System Code]]&School_Listing[[#This Row],[School Code]]","v":"190650"},"Two Rivers Middle",{"$f":"School_Listing[[#This Row],[School Code]]","v":650}]
[190,"DAVIDSON COUNTY",{"$f":"School_Listing[[#This Row],[System Code]]","v":190},655,{"$f":"School_Listing[[#This Row],[System Code]]&School_Listing[[#This Row],[School Code]]","v":"190655"},"Una Elementary",{"$f":"School_Listing[[#This Row],[School Code]]","v":655}]
[190,"DAVIDSON COUNTY",{"$f":"School_Listing[[#This Row],[System Code]]","v":190},8045,{"$f":"School_Listing[[#This Row],[System Code]]&School_Listing[[#This Row],[School Code]]","v":"1908045"},"Valor Flagship Academy",{"$f":"School_Listing[[#This Row],[School Code]]","v":8045}]
[190,"DAVIDSON COUNTY",{"$f":"School_Listing[[#This Row],[System Code]]","v":190},8080,{"$f":"School_Listing[[#This Row],[System Code]]&School_Listing[[#This Row],[School Code]]","v":"1908080"},"Valor Voyager Academy",{"$f":"School_Listing[[#This Row],[School Code]]","v":8080}]
[190,"DAVIDSON COUNTY",{"$f":"School_Listing[[#This Row],[System Code]]","v":190},125,{"$f":"School_Listing[[#This Row],[System Code]]&School_Listing[[#This Row],[School Code]]","v":"190125"},"W. A. Bass Adult Program",{"$f":"School_Listing[[#This Row],[School Code]]","v":125}]
[190,"DAVIDSON COUNTY",{"$f":"School_Listing[[#This Row],[System Code]]","v":190},126,{"$f":"School_Listing[[#This Row],[System Code]]&School_Listing[[#This Row],[School Code]]","v":"190126"},"W.A. Bass Alternative Learning Center",{"$f":"School_Listing[[#This Row],[School Code]]","v":126}]
[190,"DAVIDSON COUNTY",{"$f":"School_Listing[[#This Row],[System Code]]","v":190},675,{"$f":"School_Listing[[#This Row],[System Code]]&School_Listing[[#This Row],[School Code]]","v":"190675"},"Warner Elementary",{"$f":"School_Listing[[#This Row],[School Code]]","v":675}]
[190,"DAVIDSON COUNTY",{"$f":"School_Listing[[#This Row],[System Code]]","v":190},755,{"$f":"School_Listing[[#This Row],[System Code]]&School_Listing[[#This Row],[School Code]]","v":"190755"},"Waverly-Belmont Elementary School",{"$f":"School_Listing[[#This Row],[School Code]]","v":755}]
[190,"DAVIDSON COUNTY",{"$f":"School_Listing[[#This Row],[System Code]]","v":190},7003,{"$f":"School_Listing[[#This Row],[System Code]]&School_Listing[[#This Row],[School Code]]","v":"1907003"},"Wayne Reed Child Care Center",{"$f":"School_Listing[[#This Row],[School Code]]","v":7003}]
[190,"DAVIDSON COUNTY",{"$f":"School_Listing[[#This Row],[System Code]]","v":190},690,{"$f":"School_Listing[[#This Row],[System Code]]&School_Listing[[#This Row],[School Code]]","v":"190690"},"West End Middle",{"$f":"School_Listing[[#This Row],[School Code]]","v":690}]
[190,"DAVIDSON COUNTY",{"$f":"School_Listing[[#This Row],[System Code]]","v":190},695,{"$f":"School_Listing[[#This Row],[System Code]]&School_Listing[[#This Row],[School Code]]","v":"190695"},"Westmeade Elementary",{"$f":"School_Listing[[#This Row],[School Code]]","v":695}]
[190,"DAVIDSON COUNTY",{"$f":"School_Listing[[#This Row],[System Code]]","v":190},704,{"$f":"School_Listing[[#This Row],[System Code]]&School_Listing[[#This Row],[School Code]]","v":"190704"},"Whites Creek High",{"$f":"School_Listing[[#This Row],[School Code]]","v":704}]
[190,"DAVIDSON COUNTY",{"$f":"School_Listing[[#This Row],[System Code]]","v":190},538,{"$f":"School_Listing[[#This Row],[System Code]]&School_Listing[[#This Row],[School Code]]","v":"190538"},"William Henry Oliver Middle",{"$f":"School_Listing[[#This Row],[School Code]]","v":538}]
[190,"DAVIDSON COUNTY",{"$f":"School_Listing[[#This Row],[System Code]]","v":190},715,{"$f":"School_Listing[[#This Row],[System Code]]&School_Listing[[#This Row],[School Code]]","v":"190715"},"Wright Middle",{"$f":"School_Listing[[#This Row],[School Code]]","v":715}]
[200,"DECATUR COUNTY",{"$f":"School_Listing[[#This Row],[System Code]]","v":200},20,{"$f":"School_Listing[[#This Row],[System Code]]&School_Listing[[#This Row],[School Code]]","v":"20020"},"Decatur County Middle School",{"$f":"School_Listing[[#This Row],[School Code]]","v":20}]
[200,"DECATUR COUNTY",{"$f":"School_Listing[[#This Row],[System Code]]","v":200},5,{"$f":"School_Listing[[#This Row],[System Code]]&School_Listing[[#This Row],[School Code]]","v":"2005"},"Decaturville Elementary",{"$f":"School_Listing[[#This Row],[School Code]]","v":5}]
[200,"DECATUR COUNTY",{"$f":"School_Listing[[#This Row],[System Code]]","v":200},10,{"$f":"School_Listing[[#This Row],[System Code]]&School_Listing[[#This Row],[School Code]]","v":"20010"},"Parsons Elementary",{"$f":"School_Listing[[#This Row],[School Code]]","v":10}]
[200,"DECATUR COUNTY",{"$f":"School_Listing[[#This Row],[System Code]]","v":200},3,{"$f":"School_Listing[[#This Row],[System Code]]&School_Listing[[#This Row],[School Code]]","v":"2003"},"Riverside High School",{"$f":"School_Listing[[#This Row],[School Code]]","v":3}]
[210,"DEKALB COUNTY",{"$f":"School_Listing[[#This Row],[System Code]]","v":210},10,{"$f":"School_Listing[[#This Row],[System Code]]&School_Listing[[#This Row],[School Code]]","v":"21010"},"De Kalb County Adult High School",{"$f":"School_Listing[[#This Row],[School Code]]","v":10}]
[210,"DEKALB COUNTY",{"$f":"School_Listing[[#This Row],[System Code]]","v":210},25,{"$f":"School_Listing[[#This Row],[System Code]]&School_Listing[[#This Row],[School Code]]","v":"21025"},"De Kalb County High School",{"$f":"School_Listing[[#This Row],[School Code]]","v":25}]
[210,"DEKALB COUNTY",{"$f":"School_Listing[[#This Row],[System Code]]","v":210},37,{"$f":"School_Listing[[#This Row],[System Code]]&School_Listing[[#This Row],[School Code]]","v":"21037"},"DeKalb Middle School",{"$f":"School_Listing[[#This Row],[School Code]]","v":37}]
[210,"DEKALB COUNTY",{"$f":"School_Listing[[#This Row],[System Code]]","v":210},50,{"$f":"School_Listing[[#This Row],[System Code]]&School_Listing[[#This Row],[School Code]]","v":"21050"},"DeKalb West Elementary",{"$f":"School_Listing[[#This Row],[School Code]]","v":50}]
[210,"DEKALB COUNTY",{"$f":"School_Listing[[#This Row],[System Code]]","v":210},40,{"$f":"School_Listing[[#This Row],[System Code]]&School_Listing[[#This Row],[School Code]]","v":"21040"},"Northside Elementary",{"$f":"School_Listing[[#This Row],[School Code]]","v":40}]
[210,"DEKALB COUNTY",{"$f":"School_Listing[[#This Row],[System Code]]","v":210},45,{"$f":"School_Listing[[#This Row],[System Code]]&School_Listing[[#This Row],[School Code]]","v":"21045"},"Smithville Elementary",{"$f":"School_Listing[[#This Row],[School Code]]","v":45}]
[220,"DICKSON COUNTY",{"$f":"School_Listing[[#This Row],[System Code]]","v":220},55,{"$f":"School_Listing[[#This Row],[System Code]]&School_Listing[[#This Row],[School Code]]","v":"22055"},"Burns Middle School",{"$f":"School_Listing[[#This Row],[School Code]]","v":55}]
[220,"DICKSON COUNTY",{"$f":"School_Listing[[#This Row],[System Code]]","v":220},8,{"$f":"School_Listing[[#This Row],[System Code]]&School_Listing[[#This Row],[School Code]]","v":"2208"},"Centennial Elementary",{"$f":"School_Listing[[#This Row],[School Code]]","v":8}]
[220,"DICKSON COUNTY",{"$f":"School_Listing[[#This Row],[System Code]]","v":220},7,{"$f":"School_Listing[[#This Row],[System Code]]&School_Listing[[#This Row],[School Code]]","v":"2207"},"Charlotte Elementary",{"$f":"School_Listing[[#This Row],[School Code]]","v":7}]
[220,"DICKSON COUNTY",{"$f":"School_Listing[[#This Row],[System Code]]","v":220},15,{"$f":"School_Listing[[#This Row],[System Code]]&School_Listing[[#This Row],[School Code]]","v":"22015"},"Charlotte Middle School",{"$f":"School_Listing[[#This Row],[School Code]]","v":15}]
[220,"DICKSON COUNTY",{"$f":"School_Listing[[#This Row],[System Code]]","v":220},17,{"$f":"School_Listing[[#This Row],[System Code]]&School_Listing[[#This Row],[School Code]]","v":"22017"},"Creek Wood High School",{"$f":"School_Listing[[#This Row],[School Code]]","v":17}]
[220,"DICKSON COUNTY",{"$f":"School_Listing[[#This Row],[System Code]]","v":220},19,{"$f":"School_Listing[[#This Row],[System Code]]&School_Listing[[#This Row],[School Code]]","v":"22019"},"Dickson County Distance Learning Academy",{"$f":"School_Listing[[#This Row],[School Code]]","v":19}]
[220,"DICKSON COUNTY",{"$f":"School_Listing[[#This Row],[System Code]]","v":220},25,{"$f":"School_Listing[[#This Row],[System Code]]&School_Listing[[#This Row],[School Code]]","v":"22025"},"Dickson County High School",{"$f":"School_Listing[[#This Row],[School Code]]","v":25}]
[220,"DICKSON COUNTY",{"$f":"School_Listing[[#This Row],[System Code]]","v":220},20,{"$f":"School_Listing[[#This Row],[System Code]]&School_Listing[[#This Row],[School Code]]","v":"22020"},"Dickson Elementary",{"$f":"School_Listing[[#This Row],[School Code]]","v":20}]
[220,"DICKSON COUNTY",{"$f":"School_Listing[[#This Row],[System Code]]","v":220},23,{"$f":"School_Listing[[#This Row],[System Code]]&School_Listing[[#This Row],[School Code]]","v":"22023"},"Dickson Middle School",{"$f":"School_Listing[[#This Row],[School Code]]","v":23}]
[220,"DICKSON COUNTY",{"$f":"School_Listing[[#This Row],[System Code]]","v":220},10,{"$f":"School_Listing[[#This Row],[System Code]]&School_Listing[[#This Row],[School Code]]","v":"22010"},"New Directions Academy",{"$f":"School_Listing[[#This Row],[School Code]]","v":10}]
[220,"DICKSON COUNTY",{"$f":"School_Listing[[#This Row],[System Code]]","v":220},30,{"$f":"School_Listing[[#This Row],[System Code]]&School_Listing[[#This Row],[School Code]]","v":"22030"},"Oakmont Elementary",{"$f":"School_Listing[[#This Row],[School Code]]","v":30}]
[220,"DICKSON COUNTY",{"$f":"School_Listing[[#This Row],[System Code]]","v":220},7001,{"$f":"School_Listing[[#This Row],[System Code]]&School_Listing[[#This Row],[School Code]]","v":"2207001"},"Special Services",{"$f":"School_Listing[[#This Row],[School Code]]","v":7001}]
[220,"DICKSON COUNTY",{"$f":"School_Listing[[#This Row],[System Code]]","v":220},5,{"$f":"School_Listing[[#This Row],[System Code]]&School_Listing[[#This Row],[School Code]]","v":"2205"},"Stuart Burns Elementary",{"$f":"School_Listing[[#This Row],[School Code]]","v":5}]
[220,"DICKSON COUNTY",{"$f":"School_Listing[[#This Row],[System Code]]","v":220},28,{"$f":"School_Listing[[#This Row],[System Code]]&School_Listing[[#This Row],[School Code]]","v":"22028"},"The Discovery School",{"$f":"School_Listing[[#This Row],[School Code]]","v":28}]
[220,"DICKSON COUNTY",{"$f":"School_Listing[[#This Row],[System Code]]","v":220},40,{"$f":"School_Listing[[#This Row],[System Code]]&School_Listing[[#This Row],[School Code]]","v":"22040"},"Vanleer Elementary",{"$f":"School_Listing[[#This Row],[School Code]]","v":40}]
[220,"DICKSON COUNTY",{"$f":"School_Listing[[#This Row],[System Code]]","v":220},50,{"$f":"School_Listing[[#This Row],[System Code]]&School_Listing[[#This Row],[School Code]]","v":"22050"},"W James Middle School",{"$f":"School_Listing[[#This Row],[School Code]]","v":50}]
[220,"DICKSON COUNTY",{"$f":"School_Listing[[#This Row],[System Code]]","v":220},44,{"$f":"School_Listing[[#This Row],[System Code]]&School_Listing[[#This Row],[School Code]]","v":"22044"},"White Bluff Elementary",{"$f":"School_Listing[[#This Row],[School Code]]","v":44}]
[230,"DYER COUNTY",{"$f":"School_Listing[[#This Row],[System Code]]","v":230},18,{"$f":"School_Listing[[#This Row],[System Code]]&School_Listing[[#This Row],[School Code]]","v":"23018"},"Dyer County High School",{"$f":"School_Listing[[#This Row],[School Code]]","v":18}]
[230,"DYER COUNTY",{"$f":"School_Listing[[#This Row],[System Code]]","v":230},20,{"$f":"School_Listing[[#This Row],[System Code]]&School_Listing[[#This Row],[School Code]]","v":"23020"},"Fifth Consolidated School",{"$f":"School_Listing[[#This Row],[School Code]]","v":20}]
[230,"DYER COUNTY",{"$f":"School_Listing[[#This Row],[System Code]]","v":230},25,{"$f":"School_Listing[[#This Row],[System Code]]&School_Listing[[#This Row],[School Code]]","v":"23025"},"Finley Elementary",{"$f":"School_Listing[[#This Row],[School Code]]","v":25}]
[230,"DYER COUNTY",{"$f":"School_Listing[[#This Row],[System Code]]","v":230},30,{"$f":"School_Listing[[#This Row],[System Code]]&School_Listing[[#This Row],[School Code]]","v":"23030"},"Holice Powell Elementary",{"$f":"School_Listing[[#This Row],[School Code]]","v":30}]
[230,"DYER COUNTY",{"$f":"School_Listing[[#This Row],[System Code]]","v":230},35,{"$f":"School_Listing[[#This Row],[System Code]]&School_Listing[[#This Row],[School Code]]","v":"23035"},"Newbern Elementary School",{"$f":"School_Listing[[#This Row],[School Code]]","v":35}]
[230,"DYER COUNTY",{"$f":"School_Listing[[#This Row],[System Code]]","v":230},15,{"$f":"School_Listing[[#This Row],[System Code]]&School_Listing[[#This Row],[School Code]]","v":"23015"},"Northview Middle School",{"$f":"School_Listing[[#This Row],[School Code]]","v":15}]
[230,"DYER COUNTY",{"$f":"School_Listing[[#This Row],[System Code]]","v":230},43,{"$f":"School_Listing[[#This Row],[System Code]]&School_Listing[[#This Row],[School Code]]","v":"23043"},"Three Oaks Middle School",{"$f":"School_Listing[[#This Row],[School Code]]","v":43}]
[230,"DYER COUNTY",{"$f":"School_Listing[[#This Row],[System Code]]","v":230},45,{"$f":"School_Listing[[#This Row],[System Code]]&School_Listing[[#This Row],[School Code]]","v":"23045"},"Trimble Elementary",{"$f":"School_Listing[[#This Row],[School Code]]","v":45}]
[231,"DYERSBURG",{"$f":"School_Listing[[#This Row],[System Code]]","v":231},15,{"$f":"School_Listing[[#This Row],[System Code]]&School_Listing[[#This Row],[School Code]]","v":"23115"},"Dyersburg High School",{"$f":"School_Listing[[#This Row],[School Code]]","v":15}]
[231,"DYERSBURG",{"$f":"School_Listing[[#This Row],[System Code]]","v":231},12,{"$f":"School_Listing[[#This Row],[System Code]]&School_Listing[[#This Row],[School Code]]","v":"23112"},"Dyersburg Intermediate School",{"$f":"School_Listing[[#This Row],[School Code]]","v":12}]
[231,"DYERSBURG",{"$f":"School_Listing[[#This Row],[System Code]]","v":231},21,{"$f":"School_Listing[[#This Row],[System Code]]&School_Listing[[#This Row],[School Code]]","v":"23121"},"Dyersburg Middle School",{"$f":"School_Listing[[#This Row],[School Code]]","v":21}]
[231,"DYERSBURG",{"$f":"School_Listing[[#This Row],[System Code]]","v":231},25,{"$f":"School_Listing[[#This Row],[System Code]]&School_Listing[[#This Row],[School Code]]","v":"23125"},"Dyersburg Primary",{"$f":"School_Listing[[#This Row],[School Code]]","v":25}]
[240,"FAYETTE COUNTY PUBLIC SCHOOLS",{"$f":"School_Listing[[#This Row],[System Code]]","v":240},95,{"$f":"School_Listing[[#This Row],[System Code]]&School_Listing[[#This Row],[School Code]]","v":"24095"},"Buckley-Carpenter Elementary School",{"$f":"School_Listing[[#This Row],[School Code]]","v":95}]
[240,"FAYETTE COUNTY PUBLIC SCHOOLS",{"$f":"School_Listing[[#This Row],[System Code]]","v":240},18,{"$f":"School_Listing[[#This Row],[System Code]]&School_Listing[[#This Row],[School Code]]","v":"24018"},"East Jr. High School",{"$f":"School_Listing[[#This Row],[School Code]]","v":18}]
[240,"FAYETTE COUNTY PUBLIC SCHOOLS",{"$f":"School_Listing[[#This Row],[System Code]]","v":240},24,{"$f":"School_Listing[[#This Row],[System Code]]&School_Listing[[#This Row],[School Code]]","v":"24024"},"Fayette County Virtual Learning Academy",{"$f":"School_Listing[[#This Row],[School Code]]","v":24}]
[240,"FAYETTE COUNTY PUBLIC SCHOOLS",{"$f":"School_Listing[[#This Row],[System Code]]","v":240},26,{"$f":"School_Listing[[#This Row],[System Code]]&School_Listing[[#This Row],[School Code]]","v":"24026"},"Fayette Ware Comprehensive High School",{"$f":"School_Listing[[#This Row],[School Code]]","v":26}]
[240,"FAYETTE COUNTY PUBLIC SCHOOLS",{"$f":"School_Listing[[#This Row],[System Code]]","v":240},46,{"$f":"School_Listing[[#This Row],[System Code]]&School_Listing[[#This Row],[School Code]]","v":"24046"},"La Grange Moscow Elementary",{"$f":"School_Listing[[#This Row],[School Code]]","v":46}]
[240,"FAYETTE COUNTY PUBLIC SCHOOLS",{"$f":"School_Listing[[#This Row],[System Code]]","v":240},60,{"$f":"School_Listing[[#This Row],[System Code]]&School_Listing[[#This Row],[School Code]]","v":"24060"},"Oakland Elementary",{"$f":"School_Listing[[#This Row],[School Code]]","v":60}]
[240,"FAYETTE COUNTY PUBLIC SCHOOLS",{"$f":"School_Listing[[#This Row],[System Code]]","v":240},70,{"$f":"School_Listing[[#This Row],[System Code]]&School_Listing[[#This Row],[School Code]]","v":"24070"},"Southwest Elementary",{"$f":"School_Listing[[#This Row],[School Code]]","v":70}]
[240,"FAYETTE COUNTY PUBLIC SCHOOLS",{"$f":"School_Listing[[#This Row],[System Code]]","v":240},90,{"$f":"School_Listing[[#This Row],[System Code]]&School_Listing[[#This Row],[School Code]]","v":"24090"},"West Junior High School",{"$f":"School_Listing[[#This Row],[School Code]]","v":90}]
[250,"FENTRESS COUNTY",{"$f":"School_Listing[[#This Row],[System Code]]","v":250},5,{"$f":"School_Listing[[#This Row],[System Code]]&School_Listing[[#This Row],[School Code]]","v":"2505"},"Allardt Elementary",{"$f":"School_Listing[[#This Row],[School Code]]","v":5}]
[250,"FENTRESS COUNTY",{"$f":"School_Listing[[#This Row],[System Code]]","v":250},25,{"$f":"School_Listing[[#This Row],[System Code]]&School_Listing[[#This Row],[School Code]]","v":"25025"},"Clarkrange High School",{"$f":"School_Listing[[#This Row],[School Code]]","v":25}]
[250,"FENTRESS COUNTY",{"$f":"School_Listing[[#This Row],[System Code]]","v":250},52,{"$f":"School_Listing[[#This Row],[System Code]]&School_Listing[[#This Row],[School Code]]","v":"25052"},"Fentress Co Adult High School",{"$f":"School_Listing[[#This Row],[School Code]]","v":52}]
[250,"FENTRESS COUNTY",{"$f":"School_Listing[[#This Row],[System Code]]","v":250},40,{"$f":"School_Listing[[#This Row],[System Code]]&School_Listing[[#This Row],[School Code]]","v":"25040"},"Pine Haven Elementary",{"$f":"School_Listing[[#This Row],[School Code]]","v":40}]
[250,"FENTRESS COUNTY",{"$f":"School_Listing[[#This Row],[System Code]]","v":250},33,{"$f":"School_Listing[[#This Row],[System Code]]&School_Listing[[#This Row],[School Code]]","v":"25033"},"South Fentress Elementary School",{"$f":"School_Listing[[#This Row],[School Code]]","v":33}]
[250,"FENTRESS COUNTY",{"$f":"School_Listing[[#This Row],[System Code]]","v":250},60,{"$f":"School_Listing[[#This Row],[System Code]]&School_Listing[[#This Row],[School Code]]","v":"25060"},"York Elementary",{"$f":"School_Listing[[#This Row],[School Code]]","v":60}]
[260,"FRANKLIN COUNTY",{"$f":"School_Listing[[#This Row],[System Code]]","v":260},15,{"$f":"School_Listing[[#This Row],[System Code]]&School_Listing[[#This Row],[School Code]]","v":"26015"},"Broadview Elementary",{"$f":"School_Listing[[#This Row],[School Code]]","v":15}]
[260,"FRANKLIN COUNTY",{"$f":"School_Listing[[#This Row],[System Code]]","v":260},30,{"$f":"School_Listing[[#This Row],[System Code]]&School_Listing[[#This Row],[School Code]]","v":"26030"},"Clark Memorial School",{"$f":"School_Listing[[#This Row],[School Code]]","v":30}]
[260,"FRANKLIN COUNTY",{"$f":"School_Listing[[#This Row],[System Code]]","v":260},35,{"$f":"School_Listing[[#This Row],[System Code]]&School_Listing[[#This Row],[School Code]]","v":"26035"},"Cowan Elementary",{"$f":"School_Listing[[#This Row],[School Code]]","v":35}]
[260,"FRANKLIN COUNTY",{"$f":"School_Listing[[#This Row],[System Code]]","v":260},40,{"$f":"School_Listing[[#This Row],[System Code]]&School_Listing[[#This Row],[School Code]]","v":"26040"},"Decherd Elementary",{"$f":"School_Listing[[#This Row],[School Code]]","v":40}]
[260,"FRANKLIN COUNTY",{"$f":"School_Listing[[#This Row],[System Code]]","v":260},50,{"$f":"School_Listing[[#This Row],[System Code]]&School_Listing[[#This Row],[School Code]]","v":"26050"},"Franklin Co High School",{"$f":"School_Listing[[#This Row],[School Code]]","v":50}]
[260,"FRANKLIN COUNTY",{"$f":"School_Listing[[#This Row],[System Code]]","v":260},65,{"$f":"School_Listing[[#This Row],[System Code]]&School_Listing[[#This Row],[School Code]]","v":"26065"},"Huntland School",{"$f":"School_Listing[[#This Row],[School Code]]","v":65}]
[260,"FRANKLIN COUNTY",{"$f":"School_Listing[[#This Row],[System Code]]","v":260},82,{"$f":"School_Listing[[#This Row],[System Code]]&School_Listing[[#This Row],[School Code]]","v":"26082"},"North Lake Elementary",{"$f":"School_Listing[[#This Row],[School Code]]","v":82}]
[260,"FRANKLIN COUNTY",{"$f":"School_Listing[[#This Row],[System Code]]","v":260},80,{"$f":"School_Listing[[#This Row],[System Code]]&School_Listing[[#This Row],[School Code]]","v":"26080"},"North Middle School",{"$f":"School_Listing[[#This Row],[School Code]]","v":80}]
[260,"FRANKLIN COUNTY",{"$f":"School_Listing[[#This Row],[System Code]]","v":260},87,{"$f":"School_Listing[[#This Row],[System Code]]&School_Listing[[#This Row],[School Code]]","v":"26087"},"Rock Creek Elementary",{"$f":"School_Listing[[#This Row],[School Code]]","v":87}]
[260,"FRANKLIN COUNTY",{"$f":"School_Listing[[#This Row],[System Code]]","v":260},90,{"$f":"School_Listing[[#This Row],[System Code]]&School_Listing[[#This Row],[School Code]]","v":"26090"},"Sewanee Elementary",{"$f":"School_Listing[[#This Row],[School Code]]","v":90}]
[260,"FRANKLIN COUNTY",{"$f":"School_Listing[[#This Row],[System Code]]","v":260},115,{"$f":"School_Listing[[#This Row],[System Code]]&School_Listing[[#This Row],[School Code]]","v":"260115"},"South Middle School",{"$f":"School_Listing[[#This Row],[School Code]]","v":115}]
[271,"HUMBOLDT CITY SCHOOLS",{"$f":"School_Listing[[#This Row],[System Code]]","v":271},27,{"$f":"School_Listing[[#This Row],[System Code]]&School_Listing[[#This Row],[School Code]]","v":"27127"},"East Elementary School",{"$f":"School_Listing[[#This Row],[School Code]]","v":27}]
[271,"HUMBOLDT CITY SCHOOLS",{"$f":"School_Listing[[#This Row],[System Code]]","v":271},20,{"$f":"School_Listing[[#This Row],[System Code]]&School_Listing[[#This Row],[School Code]]","v":"27120"},"Humboldt Junior/Senior High School",{"$f":"School_Listing[[#This Row],[School Code]]","v":20}]
[271,"HUMBOLDT CITY SCHOOLS",{"$f":"School_Listing[[#This Row],[System Code]]","v":271},29,{"$f":"School_Listing[[#This Row],[System Code]]&School_Listing[[#This Row],[School Code]]","v":"27129"},"Stigall Primary School",{"$f":"School_Listing[[#This Row],[School Code]]","v":29}]
[272,"MILAN",{"$f":"School_Listing[[#This Row],[System Code]]","v":272},25,{"$f":"School_Listing[[#This Row],[System Code]]&School_Listing[[#This Row],[School Code]]","v":"27225"},"Milan Elementary",{"$f":"School_Listing[[#This Row],[School Code]]","v":25}]
[272,"MILAN",{"$f":"School_Listing[[#This Row],[System Code]]","v":272},10,{"$f":"School_Listing[[#This Row],[System Code]]&School_Listing[[#This Row],[School Code]]","v":"27210"},"Milan High School",{"$f":"School_Listing[[#This Row],[School Code]]","v":10}]
[272,"MILAN",{"$f":"School_Listing[[#This Row],[System Code]]","v":272},11,{"$f":"School_Listing[[#This Row],[System Code]]&School_Listing[[#This Row],[School Code]]","v":"27211"},"Milan High School Academy",{"$f":"School_Listing[[#This Row],[School Code]]","v":11}]
[272,"MILAN",{"$f":"School_Listing[[#This Row],[System Code]]","v":272},15,{"$f":"School_Listing[[#This Row],[System Code]]&School_Listing[[#This Row],[School Code]]","v":"27215"},"Milan Middle School",{"$f":"School_Listing[[#This Row],[School Code]]","v":15}]
[273,"TRENTON",{"$f":"School_Listing[[#This Row],[System Code]]","v":273},5,{"$f":"School_Listing[[#This Row],[System Code]]&School_Listing[[#This Row],[School Code]]","v":"2735"},"Peabody High School",{"$f":"School_Listing[[#This Row],[School Code]]","v":5}]
[273,"TRENTON",{"$f":"School_Listing[[#This Row],[System Code]]","v":273},15,{"$f":"School_Listing[[#This Row],[System Code]]&School_Listing[[#This Row],[School Code]]","v":"27315"},"Trenton Elementary",{"$f":"School_Listing[[#This Row],[School Code]]","v":15}]
[273,"TRENTON",{"$f":"School_Listing[[#This Row],[System Code]]","v":273},10,{"$f":"School_Listing[[#This Row],[System Code]]&School_Listing[[#This Row],[School Code]]","v":"27310"},"Trenton Middle School",{"$f":"School_Listing[[#This Row],[School Code]]","v":10}]
[274,"BRADFORD",{"$f":"School_Listing[[#This Row],[System Code]]","v":274},10,{"$f":"School_Listing[[#This Row],[System Code]]&School_Listing[[#This Row],[School Code]]","v":"27410"},"Bradford Elementary",{"$f":"School_Listing[[#This Row],[School Code]]","v":10}]
[274,"BRADFORD",{"$f":"School_Listing[[#This Row],[System Code]]","v":274},5,{"$f":"School_Listing[[#This Row],[System Code]]&School_Listing[[#This Row],[School Code]]","v":"2745"},"Bradford High School",{"$f":"School_Listing[[#This Row],[School Code]]","v":5}]
[275,"GIBSON CO SP DIST",{"$f":"School_Listing[[#This Row],[System Code]]","v":275},15,{"$f":"School_Listing[[#This Row],[System Code]]&School_Listing[[#This Row],[School Code]]","v":"27515"},"Dyer Elementary",{"$f":"School_Listing[[#This Row],[School Code]]","v":15}]
[275,"GIBSON CO SP DIST",{"$f":"School_Listing[[#This Row],[System Code]]","v":275},33,{"$f":"School_Listing[[#This Row],[System Code]]&School_Listing[[#This Row],[School Code]]","v":"27533"},"Gibson County High School",{"$f":"School_Listing[[#This Row],[School Code]]","v":33}]
[275,"GIBSON CO SP DIST",{"$f":"School_Listing[[#This Row],[System Code]]","v":275},35,{"$f":"School_Listing[[#This Row],[System Code]]&School_Listing[[#This Row],[School Code]]","v":"27535"},"Kenton Elementary School",{"$f":"School_Listing[[#This Row],[School Code]]","v":35}]
[275,"GIBSON CO SP DIST",{"$f":"School_Listing[[#This Row],[System Code]]","v":275},55,{"$f":"School_Listing[[#This Row],[System Code]]&School_Listing[[#This Row],[School Code]]","v":"27555"},"Rutherford Elementary",{"$f":"School_Listing[[#This Row],[School Code]]","v":55}]
[275,"GIBSON CO SP DIST",{"$f":"School_Listing[[#This Row],[System Code]]","v":275},40,{"$f":"School_Listing[[#This Row],[System Code]]&School_Listing[[#This Row],[School Code]]","v":"27540"},"South Gibson County Elementary School",{"$f":"School_Listing[[#This Row],[School Code]]","v":40}]
[275,"GIBSON CO SP DIST",{"$f":"School_Listing[[#This Row],[System Code]]","v":275},37,{"$f":"School_Listing[[#This Row],[System Code]]&School_Listing[[#This Row],[School Code]]","v":"27537"},"South Gibson County High School",{"$f":"School_Listing[[#This Row],[School Code]]","v":37}]
[275,"GIBSON CO SP DIST",{"$f":"School_Listing[[#This Row],[System Code]]","v":275},45,{"$f":"School_Listing[[#This Row],[System Code]]&School_Listing[[#This Row],[School Code]]","v":"27545"},"South Gibson County Middle School",{"$f":"School_Listing[[#This Row],[School Code]]","v":45}]
[275,"GIBSON CO SP DIST",{"$f":"School_Listing[[#This Row],[System Code]]","v":275},65,{"$f":"School_Listing[[#This Row],[System Code]]&School_Listing[[#This Row],[School Code]]","v":"27565"},"Spring Hill Elementary",{"$f":"School_Listing[[#This Row],[School Code]]","v":65}]
[275,"GIBSON CO SP DIST",{"$f":"School_Listing[[#This Row],[System Code]]","v":275},85,{"$f":"School_Listing[[#This Row],[System Code]]&School_Listing[[#This Row],[School Code]]","v":"27585"},"Yorkville Elementary",{"$f":"School_Listing[[#This Row],[School Code]]","v":85}]
[280,"GILES COUNTY",{"$f":"School_Listing[[#This Row],[System Code]]","v":280},7,{"$f":"School_Listing[[#This Row],[System Code]]&School_Listing[[#This Row],[School Code]]","v":"2807"},"Bridgeforth Middle School",{"$f":"School_Listing[[#This Row],[School Code]]","v":7}]
[280,"GILES COUNTY",{"$f":"School_Listing[[#This Row],[System Code]]","v":280},35,{"$f":"School_Listing[[#This Row],[System Code]]&School_Listing[[#This Row],[School Code]]","v":"28035"},"Elkton Elementary",{"$f":"School_Listing[[#This Row],[School Code]]","v":35}]
[280,"GILES COUNTY",{"$f":"School_Listing[[#This Row],[System Code]]","v":280},45,{"$f":"School_Listing[[#This Row],[System Code]]&School_Listing[[#This Row],[School Code]]","v":"28045"},"Giles Co High School",{"$f":"School_Listing[[#This Row],[School Code]]","v":45}]
[280,"GILES COUNTY",{"$f":"School_Listing[[#This Row],[System Code]]","v":280},65,{"$f":"School_Listing[[#This Row],[System Code]]&School_Listing[[#This Row],[School Code]]","v":"28065"},"Minor Hill School",{"$f":"School_Listing[[#This Row],[School Code]]","v":65}]
[280,"GILES COUNTY",{"$f":"School_Listing[[#This Row],[System Code]]","v":280},72,{"$f":"School_Listing[[#This Row],[System Code]]&School_Listing[[#This Row],[School Code]]","v":"28072"},"Pulaski Elementary",{"$f":"School_Listing[[#This Row],[School Code]]","v":72}]
[280,"GILES COUNTY",{"$f":"School_Listing[[#This Row],[System Code]]","v":280},81,{"$f":"School_Listing[[#This Row],[System Code]]&School_Listing[[#This Row],[School Code]]","v":"28081"},"Richland Elementary",{"$f":"School_Listing[[#This Row],[School Code]]","v":81}]
[280,"GILES COUNTY",{"$f":"School_Listing[[#This Row],[System Code]]","v":280},84,{"$f":"School_Listing[[#This Row],[System Code]]&School_Listing[[#This Row],[School Code]]","v":"28084"},"Richland School",{"$f":"School_Listing[[#This Row],[School Code]]","v":84}]
[280,"GILES COUNTY",{"$f":"School_Listing[[#This Row],[System Code]]","v":280},87,{"$f":"School_Listing[[#This Row],[System Code]]&School_Listing[[#This Row],[School Code]]","v":"28087"},"Southside Elementary",{"$f":"School_Listing[[#This Row],[School Code]]","v":87}]
[290,"GRAINGER COUNTY",{"$f":"School_Listing[[#This Row],[System Code]]","v":290},5,{"$f":"School_Listing[[#This Row],[System Code]]&School_Listing[[#This Row],[School Code]]","v":"2905"},"Bean Station Elementary",{"$f":"School_Listing[[#This Row],[School Code]]","v":5}]
[290,"GRAINGER COUNTY",{"$f":"School_Listing[[#This Row],[System Code]]","v":290},32,{"$f":"School_Listing[[#This Row],[System Code]]&School_Listing[[#This Row],[School Code]]","v":"29032"},"Grainger Academy",{"$f":"School_Listing[[#This Row],[School Code]]","v":32}]
[290,"GRAINGER COUNTY",{"$f":"School_Listing[[#This Row],[System Code]]","v":290},7,{"$f":"School_Listing[[#This Row],[System Code]]&School_Listing[[#This Row],[School Code]]","v":"2907"},"Grainger Co Adult High",{"$f":"School_Listing[[#This Row],[School Code]]","v":7}]
[290,"GRAINGER COUNTY",{"$f":"School_Listing[[#This Row],[System Code]]","v":290},8,{"$f":"School_Listing[[#This Row],[System Code]]&School_Listing[[#This Row],[School Code]]","v":"2908"},"Grainger High School",{"$f":"School_Listing[[#This Row],[School Code]]","v":8}]
[290,"GRAINGER COUNTY",{"$f":"School_Listing[[#This Row],[System Code]]","v":290},10,{"$f":"School_Listing[[#This Row],[System Code]]&School_Listing[[#This Row],[School Code]]","v":"29010"},"Joppa Elementary",{"$f":"School_Listing[[#This Row],[School Code]]","v":10}]
[290,"GRAINGER COUNTY",{"$f":"School_Listing[[#This Row],[System Code]]","v":290},18,{"$f":"School_Listing[[#This Row],[System Code]]&School_Listing[[#This Row],[School Code]]","v":"29018"},"Rutledge Elementary School",{"$f":"School_Listing[[#This Row],[School Code]]","v":18}]
[290,"GRAINGER COUNTY",{"$f":"School_Listing[[#This Row],[System Code]]","v":290},23,{"$f":"School_Listing[[#This Row],[System Code]]&School_Listing[[#This Row],[School Code]]","v":"29023"},"Rutledge Middle School",{"$f":"School_Listing[[#This Row],[School Code]]","v":23}]
[290,"GRAINGER COUNTY",{"$f":"School_Listing[[#This Row],[System Code]]","v":290},15,{"$f":"School_Listing[[#This Row],[System Code]]&School_Listing[[#This Row],[School Code]]","v":"29015"},"Rutledge Primary",{"$f":"School_Listing[[#This Row],[School Code]]","v":15}]
[290,"GRAINGER COUNTY",{"$f":"School_Listing[[#This Row],[System Code]]","v":290},30,{"$f":"School_Listing[[#This Row],[System Code]]&School_Listing[[#This Row],[School Code]]","v":"29030"},"Washburn School",{"$f":"School_Listing[[#This Row],[School Code]]","v":30}]
[300,"GREENE COUNTY",{"$f":"School_Listing[[#This Row],[System Code]]","v":300},5,{"$f":"School_Listing[[#This Row],[System Code]]&School_Listing[[#This Row],[School Code]]","v":"3005"},"Baileyton Elementary",{"$f":"School_Listing[[#This Row],[School Code]]","v":5}]
[300,"GREENE COUNTY",{"$f":"School_Listing[[#This Row],[System Code]]","v":300},10,{"$f":"School_Listing[[#This Row],[System Code]]&School_Listing[[#This Row],[School Code]]","v":"30010"},"Camp Creek Elementary",{"$f":"School_Listing[[#This Row],[School Code]]","v":10}]
[300,"GREENE COUNTY",{"$f":"School_Listing[[#This Row],[System Code]]","v":300},28,{"$f":"School_Listing[[#This Row],[System Code]]&School_Listing[[#This Row],[School Code]]","v":"30028"},"Chuckey Doak High School",{"$f":"School_Listing[[#This Row],[School Code]]","v":28}]
[300,"GREENE COUNTY",{"$f":"School_Listing[[#This Row],[System Code]]","v":300},25,{"$f":"School_Listing[[#This Row],[System Code]]&School_Listing[[#This Row],[School Code]]","v":"30025"},"Chuckey Doak Middle School",{"$f":"School_Listing[[#This Row],[School Code]]","v":25}]
[300,"GREENE COUNTY",{"$f":"School_Listing[[#This Row],[System Code]]","v":300},20,{"$f":"School_Listing[[#This Row],[System Code]]&School_Listing[[#This Row],[School Code]]","v":"30020"},"Chuckey Elementary",{"$f":"School_Listing[[#This Row],[School Code]]","v":20}]
[300,"GREENE COUNTY",{"$f":"School_Listing[[#This Row],[System Code]]","v":300},35,{"$f":"School_Listing[[#This Row],[System Code]]&School_Listing[[#This Row],[School Code]]","v":"30035"},"Doak Elementary",{"$f":"School_Listing[[#This Row],[School Code]]","v":35}]
[300,"GREENE COUNTY",{"$f":"School_Listing[[#This Row],[System Code]]","v":300},43,{"$f":"School_Listing[[#This Row],[System Code]]&School_Listing[[#This Row],[School Code]]","v":"30043"},"Greene Online Academy of Learning",{"$f":"School_Listing[[#This Row],[School Code]]","v":43}]
[300,"GREENE COUNTY",{"$f":"School_Listing[[#This Row],[System Code]]","v":300},55,{"$f":"School_Listing[[#This Row],[System Code]]&School_Listing[[#This Row],[School Code]]","v":"30055"},"McDonald Elementary",{"$f":"School_Listing[[#This Row],[School Code]]","v":55}]
[300,"GREENE COUNTY",{"$f":"School_Listing[[#This Row],[System Code]]","v":300},60,{"$f":"School_Listing[[#This Row],[System Code]]&School_Listing[[#This Row],[School Code]]","v":"30060"},"Mosheim Elementary",{"$f":"School_Listing[[#This Row],[School Code]]","v":60}]
[300,"GREENE COUNTY",{"$f":"School_Listing[[#This Row],[System Code]]","v":300},67,{"$f":"School_Listing[[#This Row],[System Code]]&School_Listing[[#This Row],[School Code]]","v":"30067"},"Nolachuckey Elementary",{"$f":"School_Listing[[#This Row],[School Code]]","v":67}]
[300,"GREENE COUNTY",{"$f":"School_Listing[[#This Row],[System Code]]","v":300},70,{"$f":"School_Listing[[#This Row],[System Code]]&School_Listing[[#This Row],[School Code]]","v":"30070"},"North Greene High School",{"$f":"School_Listing[[#This Row],[School Code]]","v":70}]
[300,"GREENE COUNTY",{"$f":"School_Listing[[#This Row],[System Code]]","v":300},71,{"$f":"School_Listing[[#This Row],[System Code]]&School_Listing[[#This Row],[School Code]]","v":"30071"},"North Greene Middle School",{"$f":"School_Listing[[#This Row],[School Code]]","v":71}]
[300,"GREENE COUNTY",{"$f":"School_Listing[[#This Row],[System Code]]","v":300},7002,{"$f":"School_Listing[[#This Row],[System Code]]&School_Listing[[#This Row],[School Code]]","v":"3007002"},"Small Miracles - Holston U. M. Home For Children",{"$f":"School_Listing[[#This Row],[School Code]]","v":7002}]
[300,"GREENE COUNTY",{"$f":"School_Listing[[#This Row],[System Code]]","v":300},80,{"$f":"School_Listing[[#This Row],[System Code]]&School_Listing[[#This Row],[School Code]]","v":"30080"},"South Greene High School",{"$f":"School_Listing[[#This Row],[School Code]]","v":80}]
[300,"GREENE COUNTY",{"$f":"School_Listing[[#This Row],[System Code]]","v":300},81,{"$f":"School_Listing[[#This Row],[System Code]]&School_Listing[[#This Row],[School Code]]","v":"30081"},"South Greene Middle School",{"$f":"School_Listing[[#This Row],[School Code]]","v":81}]
[300,"GREENE COUNTY",{"$f":"School_Listing[[#This Row],[System Code]]","v":300},7001,{"$f":"School_Listing[[#This Row],[System Code]]&School_Listing[[#This Row],[School Code]]","v":"3007001"},"The Children's Center - Holston U. M. Home For Children",{"$f":"School_Listing[[#This Row],[School Code]]","v":7001}]
[300,"GREENE COUNTY",{"$f":"School_Listing[[#This Row],[System Code]]","v":300},95,{"$f":"School_Listing[[#This Row],[System Code]]&School_Listing[[#This Row],[School Code]]","v":"30095"},"West Greene High School",{"$f":"School_Listing[[#This Row],[School Code]]","v":95}]
[300,"GREENE COUNTY",{"$f":"School_Listing[[#This Row],[System Code]]","v":300},96,{"$f":"School_Listing[[#This Row],[System Code]]&School_Listing[[#This Row],[School Code]]","v":"30096"},"West Greene Middle Schools",{"$f":"School_Listing[[#This Row],[School Code]]","v":96}]
[301,"GREENEVILLE",{"$f":"School_Listing[[#This Row],[System Code]]","v":301},8,{"$f":"School_Listing[[#This Row],[System Code]]&School_Listing[[#This Row],[School Code]]","v":"3018"},"C Hal Henard Elementary",{"$f":"School_Listing[[#This Row],[School Code]]","v":8}]
[301,"GREENEVILLE",{"$f":"School_Listing[[#This Row],[System Code]]","v":301},15,{"$f":"School_Listing[[#This Row],[System Code]]&School_Listing[[#This Row],[School Code]]","v":"30115"},"Eastview Elementary",{"$f":"School_Listing[[#This Row],[School Code]]","v":15}]
[301,"GREENEVILLE",{"$f":"School_Listing[[#This Row],[System Code]]","v":301},1010,{"$f":"School_Listing[[#This Row],[System Code]]&School_Listing[[#This Row],[School Code]]","v":"3011010"},"Greene Technology Center",{"$f":"School_Listing[[#This Row],[School Code]]","v":1010}]
[301,"GREENEVILLE",{"$f":"School_Listing[[#This Row],[System Code]]","v":301},20,{"$f":"School_Listing[[#This Row],[System Code]]&School_Listing[[#This Row],[School Code]]","v":"30120"},"Greeneville High School",{"$f":"School_Listing[[#This Row],[School Code]]","v":20}]
[301,"GREENEVILLE",{"$f":"School_Listing[[#This Row],[System Code]]","v":301},25,{"$f":"School_Listing[[#This Row],[System Code]]&School_Listing[[#This Row],[School Code]]","v":"30125"},"Greeneville Middle School",{"$f":"School_Listing[[#This Row],[School Code]]","v":25}]
[301,"GREENEVILLE",{"$f":"School_Listing[[#This Row],[System Code]]","v":301},30,{"$f":"School_Listing[[#This Row],[System Code]]&School_Listing[[#This Row],[School Code]]","v":"30130"},"Highland Elementary",{"$f":"School_Listing[[#This Row],[School Code]]","v":30}]
[301,"GREENEVILLE",{"$f":"School_Listing[[#This Row],[System Code]]","v":301},33,{"$f":"School_Listing[[#This Row],[System Code]]&School_Listing[[#This Row],[School Code]]","v":"30133"},"Tennessee Online Public School at Greeneville",{"$f":"School_Listing[[#This Row],[School Code]]","v":33}]
[301,"GREENEVILLE",{"$f":"School_Listing[[#This Row],[System Code]]","v":301},35,{"$f":"School_Listing[[#This Row],[System Code]]&School_Listing[[#This Row],[School Code]]","v":"30135"},"Tusculum View Elementary",{"$f":"School_Listing[[#This Row],[School Code]]","v":35}]
[310,"GRUNDY COUNTY",{"$f":"School_Listing[[#This Row],[System Code]]","v":310},15,{"$f":"School_Listing[[#This Row],[System Code]]&School_Listing[[#This Row],[School Code]]","v":"31015"},"Coalmont Elementary",{"$f":"School_Listing[[#This Row],[School Code]]","v":15}]
[310,"GRUNDY COUNTY",{"$f":"School_Listing[[#This Row],[System Code]]","v":310},20,{"$f":"School_Listing[[#This Row],[System Code]]&School_Listing[[#This Row],[School Code]]","v":"31020"},"Grundy Academy",{"$f":"School_Listing[[#This Row],[School Code]]","v":20}]
[310,"GRUNDY COUNTY",{"$f":"School_Listing[[#This Row],[System Code]]","v":310},25,{"$f":"School_Listing[[#This Row],[System Code]]&School_Listing[[#This Row],[School Code]]","v":"31025"},"Grundy County High School",{"$f":"School_Listing[[#This Row],[School Code]]","v":25}]
[310,"GRUNDY COUNTY",{"$f":"School_Listing[[#This Row],[System Code]]","v":310},35,{"$f":"School_Listing[[#This Row],[System Code]]&School_Listing[[#This Row],[School Code]]","v":"31035"},"North Elementary",{"$f":"School_Listing[[#This Row],[School Code]]","v":35}]
[310,"GRUNDY COUNTY",{"$f":"School_Listing[[#This Row],[System Code]]","v":310},40,{"$f":"School_Listing[[#This Row],[System Code]]&School_Listing[[#This Row],[School Code]]","v":"31040"},"Palmer Elementary",{"$f":"School_Listing[[#This Row],[School Code]]","v":40}]
[310,"GRUNDY COUNTY",{"$f":"School_Listing[[#This Row],[System Code]]","v":310},45,{"$f":"School_Listing[[#This Row],[System Code]]&School_Listing[[#This Row],[School Code]]","v":"31045"},"Pelham Elementary",{"$f":"School_Listing[[#This Row],[School Code]]","v":45}]
[310,"GRUNDY COUNTY",{"$f":"School_Listing[[#This Row],[System Code]]","v":310},60,{"$f":"School_Listing[[#This Row],[System Code]]&School_Listing[[#This Row],[School Code]]","v":"31060"},"Swiss Memorial Elementary",{"$f":"School_Listing[[#This Row],[School Code]]","v":60}]
[310,"GRUNDY COUNTY",{"$f":"School_Listing[[#This Row],[System Code]]","v":310},65,{"$f":"School_Listing[[#This Row],[System Code]]&School_Listing[[#This Row],[School Code]]","v":"31065"},"Tracy Elementary",{"$f":"School_Listing[[#This Row],[School Code]]","v":65}]
[320,"HAMBLEN COUNTY",{"$f":"School_Listing[[#This Row],[System Code]]","v":320},5,{"$f":"School_Listing[[#This Row],[System Code]]&School_Listing[[#This Row],[School Code]]","v":"3205"},"Alpha Elementary",{"$f":"School_Listing[[#This Row],[School Code]]","v":5}]
[320,"HAMBLEN COUNTY",{"$f":"School_Listing[[#This Row],[System Code]]","v":320},7,{"$f":"School_Listing[[#This Row],[System Code]]&School_Listing[[#This Row],[School Code]]","v":"3207"},"East Ridge Middle School",{"$f":"School_Listing[[#This Row],[School Code]]","v":7}]
[320,"HAMBLEN COUNTY",{"$f":"School_Listing[[#This Row],[System Code]]","v":320},10,{"$f":"School_Listing[[#This Row],[System Code]]&School_Listing[[#This Row],[School Code]]","v":"32010"},"Fairview Marguerite",{"$f":"School_Listing[[#This Row],[School Code]]","v":10}]
[320,"HAMBLEN COUNTY",{"$f":"School_Listing[[#This Row],[System Code]]","v":320},11,{"$f":"School_Listing[[#This Row],[System Code]]&School_Listing[[#This Row],[School Code]]","v":"32011"},"Hamblen County Alternative School",{"$f":"School_Listing[[#This Row],[School Code]]","v":11}]
[320,"HAMBLEN COUNTY",{"$f":"School_Listing[[#This Row],[System Code]]","v":320},12,{"$f":"School_Listing[[#This Row],[System Code]]&School_Listing[[#This Row],[School Code]]","v":"32012"},"Hillcrest Elementary",{"$f":"School_Listing[[#This Row],[School Code]]","v":12}]
[320,"HAMBLEN COUNTY",{"$f":"School_Listing[[#This Row],[System Code]]","v":320},14,{"$f":"School_Listing[[#This Row],[System Code]]&School_Listing[[#This Row],[School Code]]","v":"32014"},"John Hay Elementary",{"$f":"School_Listing[[#This Row],[School Code]]","v":14}]
[320,"HAMBLEN COUNTY",{"$f":"School_Listing[[#This Row],[System Code]]","v":320},18,{"$f":"School_Listing[[#This Row],[System Code]]&School_Listing[[#This Row],[School Code]]","v":"32018"},"Lincoln Heights Elementary",{"$f":"School_Listing[[#This Row],[School Code]]","v":18}]
[320,"HAMBLEN COUNTY",{"$f":"School_Listing[[#This Row],[System Code]]","v":320},27,{"$f":"School_Listing[[#This Row],[System Code]]&School_Listing[[#This Row],[School Code]]","v":"32027"},"Lincoln Heights Middle School",{"$f":"School_Listing[[#This Row],[School Code]]","v":27}]
[320,"HAMBLEN COUNTY",{"$f":"School_Listing[[#This Row],[System Code]]","v":320},15,{"$f":"School_Listing[[#This Row],[System Code]]&School_Listing[[#This Row],[School Code]]","v":"32015"},"Manley Elementary",{"$f":"School_Listing[[#This Row],[School Code]]","v":15}]
[320,"HAMBLEN COUNTY",{"$f":"School_Listing[[#This Row],[System Code]]","v":320},37,{"$f":"School_Listing[[#This Row],[System Code]]&School_Listing[[#This Row],[School Code]]","v":"32037"},"Meadowview Middle School",{"$f":"School_Listing[[#This Row],[School Code]]","v":37}]
[320,"HAMBLEN COUNTY",{"$f":"School_Listing[[#This Row],[System Code]]","v":320},42,{"$f":"School_Listing[[#This Row],[System Code]]&School_Listing[[#This Row],[School Code]]","v":"32042"},"Morristown East High",{"$f":"School_Listing[[#This Row],[School Code]]","v":42}]
[320,"HAMBLEN COUNTY",{"$f":"School_Listing[[#This Row],[System Code]]","v":320},45,{"$f":"School_Listing[[#This Row],[System Code]]&School_Listing[[#This Row],[School Code]]","v":"32045"},"Morristown West High",{"$f":"School_Listing[[#This Row],[School Code]]","v":45}]
[320,"HAMBLEN COUNTY",{"$f":"School_Listing[[#This Row],[System Code]]","v":320},20,{"$f":"School_Listing[[#This Row],[System Code]]&School_Listing[[#This Row],[School Code]]","v":"32020"},"Russellville Elementary",{"$f":"School_Listing[[#This Row],[School Code]]","v":20}]
[320,"HAMBLEN COUNTY",{"$f":"School_Listing[[#This Row],[System Code]]","v":320},30,{"$f":"School_Listing[[#This Row],[System Code]]&School_Listing[[#This Row],[School Code]]","v":"32030"},"Union Heights Elementary",{"$f":"School_Listing[[#This Row],[School Code]]","v":30}]
[320,"HAMBLEN COUNTY",{"$f":"School_Listing[[#This Row],[System Code]]","v":320},48,{"$f":"School_Listing[[#This Row],[System Code]]&School_Listing[[#This Row],[School Code]]","v":"32048"},"West Elementary",{"$f":"School_Listing[[#This Row],[School Code]]","v":48}]
[320,"HAMBLEN COUNTY",{"$f":"School_Listing[[#This Row],[System Code]]","v":320},33,{"$f":"School_Listing[[#This Row],[System Code]]&School_Listing[[#This Row],[School Code]]","v":"32033"},"West View Middle School",{"$f":"School_Listing[[#This Row],[School Code]]","v":33}]
[320,"HAMBLEN COUNTY",{"$f":"School_Listing[[#This Row],[System Code]]","v":320},35,{"$f":"School_Listing[[#This Row],[System Code]]&School_Listing[[#This Row],[School Code]]","v":"32035"},"Whitesburg Elementary",{"$f":"School_Listing[[#This Row],[School Code]]","v":35}]
[320,"HAMBLEN COUNTY",{"$f":"School_Listing[[#This Row],[System Code]]","v":320},40,{"$f":"School_Listing[[#This Row],[System Code]]&School_Listing[[#This Row],[School Code]]","v":"32040"},"Witt Elementary",{"$f":"School_Listing[[#This Row],[School Code]]","v":40}]
[330,"HAMILTON COUNTY",{"$f":"School_Listing[[#This Row],[System Code]]","v":330},5,{"$f":"School_Listing[[#This Row],[System Code]]&School_Listing[[#This Row],[School Code]]","v":"3305"},"Allen Elementary",{"$f":"School_Listing[[#This Row],[School Code]]","v":5}]
[330,"HAMILTON COUNTY",{"$f":"School_Listing[[#This Row],[System Code]]","v":330},10,{"$f":"School_Listing[[#This Row],[System Code]]&School_Listing[[#This Row],[School Code]]","v":"33010"},"Alpine Crest Elementary",{"$f":"School_Listing[[#This Row],[School Code]]","v":10}]
[330,"HAMILTON COUNTY",{"$f":"School_Listing[[#This Row],[System Code]]","v":330},13,{"$f":"School_Listing[[#This Row],[System Code]]&School_Listing[[#This Row],[School Code]]","v":"33013"},"Apison Elementary School",{"$f":"School_Listing[[#This Row],[School Code]]","v":13}]
[330,"HAMILTON COUNTY",{"$f":"School_Listing[[#This Row],[System Code]]","v":330},97,{"$f":"School_Listing[[#This Row],[System Code]]&School_Listing[[#This Row],[School Code]]","v":"33097"},"Barger Academy",{"$f":"School_Listing[[#This Row],[School Code]]","v":97}]
[330,"HAMILTON COUNTY",{"$f":"School_Listing[[#This Row],[System Code]]","v":330},16,{"$f":"School_Listing[[#This Row],[System Code]]&School_Listing[[#This Row],[School Code]]","v":"33016"},"Battle Academy For Teaching Learning",{"$f":"School_Listing[[#This Row],[School Code]]","v":16}]
[330,"HAMILTON COUNTY",{"$f":"School_Listing[[#This Row],[System Code]]","v":330},17,{"$f":"School_Listing[[#This Row],[System Code]]&School_Listing[[#This Row],[School Code]]","v":"33017"},"Bess T Shepherd Elementary",{"$f":"School_Listing[[#This Row],[School Code]]","v":17}]
[330,"HAMILTON COUNTY",{"$f":"School_Listing[[#This Row],[System Code]]","v":330},19,{"$f":"School_Listing[[#This Row],[System Code]]&School_Listing[[#This Row],[School Code]]","v":"33019"},"Big Ridge Elementary",{"$f":"School_Listing[[#This Row],[School Code]]","v":19}]
[330,"HAMILTON COUNTY",{"$f":"School_Listing[[#This Row],[System Code]]","v":330},21,{"$f":"School_Listing[[#This Row],[System Code]]&School_Listing[[#This Row],[School Code]]","v":"33021"},"Brainerd High School",{"$f":"School_Listing[[#This Row],[School Code]]","v":21}]
[330,"HAMILTON COUNTY",{"$f":"School_Listing[[#This Row],[System Code]]","v":330},35,{"$f":"School_Listing[[#This Row],[System Code]]&School_Listing[[#This Row],[School Code]]","v":"33035"},"Brown Middle School",{"$f":"School_Listing[[#This Row],[School Code]]","v":35}]
[330,"HAMILTON COUNTY",{"$f":"School_Listing[[#This Row],[System Code]]","v":330},37,{"$f":"School_Listing[[#This Row],[System Code]]&School_Listing[[#This Row],[School Code]]","v":"33037"},"Calvin Donaldson Environmental Science Academy",{"$f":"School_Listing[[#This Row],[School Code]]","v":37}]
[330,"HAMILTON COUNTY",{"$f":"School_Listing[[#This Row],[System Code]]","v":330},40,{"$f":"School_Listing[[#This Row],[System Code]]&School_Listing[[#This Row],[School Code]]","v":"33040"},"Central High School",{"$f":"School_Listing[[#This Row],[School Code]]","v":40}]
[330,"HAMILTON COUNTY",{"$f":"School_Listing[[#This Row],[System Code]]","v":330},45,{"$f":"School_Listing[[#This Row],[System Code]]&School_Listing[[#This Row],[School Code]]","v":"33045"},"Chatt High Center For Creative Arts",{"$f":"School_Listing[[#This Row],[School Code]]","v":45}]
[330,"HAMILTON COUNTY",{"$f":"School_Listing[[#This Row],[System Code]]","v":330},8003,{"$f":"School_Listing[[#This Row],[System Code]]&School_Listing[[#This Row],[School Code]]","v":"3308003"},"Chattanooga Charter School of Excellence",{"$f":"School_Listing[[#This Row],[School Code]]","v":8003}]
[330,"HAMILTON COUNTY",{"$f":"School_Listing[[#This Row],[System Code]]","v":330},8015,{"$f":"School_Listing[[#This Row],[System Code]]&School_Listing[[#This Row],[School Code]]","v":"3308015"},"Chattanooga Charter School of Excellence High",{"$f":"School_Listing[[#This Row],[School Code]]","v":8015}]
[330,"HAMILTON COUNTY",{"$f":"School_Listing[[#This Row],[System Code]]","v":330},8010,{"$f":"School_Listing[[#This Row],[System Code]]&School_Listing[[#This Row],[School Code]]","v":"3308010"},"Chattanooga Charter School of Excellence Middle",{"$f":"School_Listing[[#This Row],[School Code]]","v":8010}]
[330,"HAMILTON COUNTY",{"$f":"School_Listing[[#This Row],[System Code]]","v":330},8001,{"$f":"School_Listing[[#This Row],[System Code]]&School_Listing[[#This Row],[School Code]]","v":"3308001"},"Chattanooga Girls Leadership Academy",{"$f":"School_Listing[[#This Row],[School Code]]","v":8001}]
[330,"HAMILTON COUNTY",{"$f":"School_Listing[[#This Row],[System Code]]","v":330},8011,{"$f":"School_Listing[[#This Row],[System Code]]&School_Listing[[#This Row],[School Code]]","v":"3308011"},"Chattanooga Preparatory School",{"$f":"School_Listing[[#This Row],[School Code]]","v":8011}]
[330,"HAMILTON COUNTY",{"$f":"School_Listing[[#This Row],[System Code]]","v":330},46,{"$f":"School_Listing[[#This Row],[System Code]]&School_Listing[[#This Row],[School Code]]","v":"33046"},"Chattanooga School For Arts And Sciences Upper",{"$f":"School_Listing[[#This Row],[School Code]]","v":46}]
[330,"HAMILTON COUNTY",{"$f":"School_Listing[[#This Row],[System Code]]","v":330},47,{"$f":"School_Listing[[#This Row],[System Code]]&School_Listing[[#This Row],[School Code]]","v":"33047"},"Chattanooga School For The Arts And Science Lower",{"$f":"School_Listing[[#This Row],[School Code]]","v":47}]
[330,"HAMILTON COUNTY",{"$f":"School_Listing[[#This Row],[System Code]]","v":330},162,{"$f":"School_Listing[[#This Row],[System Code]]&School_Listing[[#This Row],[School Code]]","v":"330162"},"Chattanooga School For The Liberal Arts",{"$f":"School_Listing[[#This Row],[School Code]]","v":162}]
[330,"HAMILTON COUNTY",{"$f":"School_Listing[[#This Row],[System Code]]","v":330},48,{"$f":"School_Listing[[#This Row],[System Code]]&School_Listing[[#This Row],[School Code]]","v":"33048"},"Clifton Hills Elementary",{"$f":"School_Listing[[#This Row],[School Code]]","v":48}]
[330,"HAMILTON COUNTY",{"$f":"School_Listing[[#This Row],[System Code]]","v":330},50,{"$f":"School_Listing[[#This Row],[System Code]]&School_Listing[[#This Row],[School Code]]","v":"33050"},"Daisy Elementary",{"$f":"School_Listing[[#This Row],[School Code]]","v":50}]
[330,"HAMILTON COUNTY",{"$f":"School_Listing[[#This Row],[System Code]]","v":330},55,{"$f":"School_Listing[[#This Row],[System Code]]&School_Listing[[#This Row],[School Code]]","v":"33055"},"Dalewood Middle School",{"$f":"School_Listing[[#This Row],[School Code]]","v":55}]
[330,"HAMILTON COUNTY",{"$f":"School_Listing[[#This Row],[System Code]]","v":330},58,{"$f":"School_Listing[[#This Row],[System Code]]&School_Listing[[#This Row],[School Code]]","v":"33058"},"DuPont Elementary",{"$f":"School_Listing[[#This Row],[School Code]]","v":58}]
[330,"HAMILTON COUNTY",{"$f":"School_Listing[[#This Row],[System Code]]","v":330},62,{"$f":"School_Listing[[#This Row],[System Code]]&School_Listing[[#This Row],[School Code]]","v":"33062"},"East Brainerd Elementary",{"$f":"School_Listing[[#This Row],[School Code]]","v":62}]
[330,"HAMILTON COUNTY",{"$f":"School_Listing[[#This Row],[System Code]]","v":330},59,{"$f":"School_Listing[[#This Row],[System Code]]&School_Listing[[#This Row],[School Code]]","v":"33059"},"East Hamilton High School",{"$f":"School_Listing[[#This Row],[School Code]]","v":59}]
[330,"HAMILTON COUNTY",{"$f":"School_Listing[[#This Row],[System Code]]","v":330},60,{"$f":"School_Listing[[#This Row],[System Code]]&School_Listing[[#This Row],[School Code]]","v":"33060"},"East Hamilton Middle School",{"$f":"School_Listing[[#This Row],[School Code]]","v":60}]
[330,"HAMILTON COUNTY",{"$f":"School_Listing[[#This Row],[System Code]]","v":330},64,{"$f":"School_Listing[[#This Row],[System Code]]&School_Listing[[#This Row],[School Code]]","v":"33064"},"East Lake Academy Of Fine Arts",{"$f":"School_Listing[[#This Row],[School Code]]","v":64}]
[330,"HAMILTON COUNTY",{"$f":"School_Listing[[#This Row],[System Code]]","v":330},63,{"$f":"School_Listing[[#This Row],[System Code]]&School_Listing[[#This Row],[School Code]]","v":"33063"},"East Lake Elementary",{"$f":"School_Listing[[#This Row],[School Code]]","v":63}]
[330,"HAMILTON COUNTY",{"$f":"School_Listing[[#This Row],[System Code]]","v":330},65,{"$f":"School_Listing[[#This Row],[System Code]]&School_Listing[[#This Row],[School Code]]","v":"33065"},"East Ridge Elementary",{"$f":"School_Listing[[#This Row],[School Code]]","v":65}]
[330,"HAMILTON COUNTY",{"$f":"School_Listing[[#This Row],[System Code]]","v":330},70,{"$f":"School_Listing[[#This Row],[System Code]]&School_Listing[[#This Row],[School Code]]","v":"33070"},"East Ridge High School",{"$f":"School_Listing[[#This Row],[School Code]]","v":70}]
[330,"HAMILTON COUNTY",{"$f":"School_Listing[[#This Row],[System Code]]","v":330},75,{"$f":"School_Listing[[#This Row],[System Code]]&School_Listing[[#This Row],[School Code]]","v":"33075"},"East Ridge Middle School",{"$f":"School_Listing[[#This Row],[School Code]]","v":75}]
[330,"HAMILTON COUNTY",{"$f":"School_Listing[[#This Row],[System Code]]","v":330},78,{"$f":"School_Listing[[#This Row],[System Code]]&School_Listing[[#This Row],[School Code]]","v":"33078"},"East Side Elementary",{"$f":"School_Listing[[#This Row],[School Code]]","v":78}]
[330,"HAMILTON COUNTY",{"$f":"School_Listing[[#This Row],[System Code]]","v":330},86,{"$f":"School_Listing[[#This Row],[System Code]]&School_Listing[[#This Row],[School Code]]","v":"33086"},"Hamilton County Collegiate High at Chattanooga State",{"$f":"School_Listing[[#This Row],[School Code]]","v":86}]
[330,"HAMILTON COUNTY",{"$f":"School_Listing[[#This Row],[System Code]]","v":330},275,{"$f":"School_Listing[[#This Row],[System Code]]&School_Listing[[#This Row],[School Code]]","v":"330275"},"Hamilton County Virtual School",{"$f":"School_Listing[[#This Row],[School Code]]","v":275}]
[330,"HAMILTON COUNTY",{"$f":"School_Listing[[#This Row],[System Code]]","v":330},110,{"$f":"School_Listing[[#This Row],[System Code]]&School_Listing[[#This Row],[School Code]]","v":"330110"},"Hardy Elementary School",{"$f":"School_Listing[[#This Row],[School Code]]","v":110}]
[330,"HAMILTON COUNTY",{"$f":"School_Listing[[#This Row],[System Code]]","v":330},90,{"$f":"School_Listing[[#This Row],[System Code]]&School_Listing[[#This Row],[School Code]]","v":"33090"},"Harrison Elementary",{"$f":"School_Listing[[#This Row],[School Code]]","v":90}]
[330,"HAMILTON COUNTY",{"$f":"School_Listing[[#This Row],[System Code]]","v":330},127,{"$f":"School_Listing[[#This Row],[System Code]]&School_Listing[[#This Row],[School Code]]","v":"330127"},"Hixson Elementary",{"$f":"School_Listing[[#This Row],[School Code]]","v":127}]
[330,"HAMILTON COUNTY",{"$f":"School_Listing[[#This Row],[System Code]]","v":330},128,{"$f":"School_Listing[[#This Row],[System Code]]&School_Listing[[#This Row],[School Code]]","v":"330128"},"Hixson High School",{"$f":"School_Listing[[#This Row],[School Code]]","v":128}]
[330,"HAMILTON COUNTY",{"$f":"School_Listing[[#This Row],[System Code]]","v":330},129,{"$f":"School_Listing[[#This Row],[System Code]]&School_Listing[[#This Row],[School Code]]","v":"330129"},"Hixson Middle School",{"$f":"School_Listing[[#This Row],[School Code]]","v":129}]
[330,"HAMILTON COUNTY",{"$f":"School_Listing[[#This Row],[System Code]]","v":330},98,{"$f":"School_Listing[[#This Row],[System Code]]&School_Listing[[#This Row],[School Code]]","v":"33098"},"Howard Connect Academy",{"$f":"School_Listing[[#This Row],[School Code]]","v":98}]
[330,"HAMILTON COUNTY",{"$f":"School_Listing[[#This Row],[System Code]]","v":330},100,{"$f":"School_Listing[[#This Row],[System Code]]&School_Listing[[#This Row],[School Code]]","v":"330100"},"Hunter Middle School",{"$f":"School_Listing[[#This Row],[School Code]]","v":100}]
[330,"HAMILTON COUNTY",{"$f":"School_Listing[[#This Row],[System Code]]","v":330},8005,{"$f":"School_Listing[[#This Row],[System Code]]&School_Listing[[#This Row],[School Code]]","v":"3308005"},"Ivy Academy's Skillern Elementary",{"$f":"School_Listing[[#This Row],[School Code]]","v":8005}]
[330,"HAMILTON COUNTY",{"$f":"School_Listing[[#This Row],[System Code]]","v":330},8002,{"$f":"School_Listing[[#This Row],[System Code]]&School_Listing[[#This Row],[School Code]]","v":"3308002"},"Ivy Academy, Inc.",{"$f":"School_Listing[[#This Row],[School Code]]","v":8002}]
[330,"HAMILTON COUNTY",{"$f":"School_Listing[[#This Row],[System Code]]","v":330},120,{"$f":"School_Listing[[#This Row],[System Code]]&School_Listing[[#This Row],[School Code]]","v":"330120"},"Loftis Middle School",{"$f":"School_Listing[[#This Row],[School Code]]","v":120}]
[330,"HAMILTON COUNTY",{"$f":"School_Listing[[#This Row],[System Code]]","v":330},125,{"$f":"School_Listing[[#This Row],[System Code]]&School_Listing[[#This Row],[School Code]]","v":"330125"},"Lookout Mountain Elementary",{"$f":"School_Listing[[#This Row],[School Code]]","v":125}]
[330,"HAMILTON COUNTY",{"$f":"School_Listing[[#This Row],[System Code]]","v":330},241,{"$f":"School_Listing[[#This Row],[System Code]]&School_Listing[[#This Row],[School Code]]","v":"330241"},"Lookout Valley Elementary",{"$f":"School_Listing[[#This Row],[School Code]]","v":241}]
[330,"HAMILTON COUNTY",{"$f":"School_Listing[[#This Row],[System Code]]","v":330},165,{"$f":"School_Listing[[#This Row],[System Code]]&School_Listing[[#This Row],[School Code]]","v":"330165"},"Lookout Valley Middle / High School",{"$f":"School_Listing[[#This Row],[School Code]]","v":165}]
[330,"HAMILTON COUNTY",{"$f":"School_Listing[[#This Row],[System Code]]","v":330},51,{"$f":"School_Listing[[#This Row],[System Code]]&School_Listing[[#This Row],[School Code]]","v":"33051"},"McConnell Elementary",{"$f":"School_Listing[[#This Row],[School Code]]","v":51}]
[330,"HAMILTON COUNTY",{"$f":"School_Listing[[#This Row],[System Code]]","v":330},85,{"$f":"School_Listing[[#This Row],[System Code]]&School_Listing[[#This Row],[School Code]]","v":"33085"},"Middle Valley Elementary",{"$f":"School_Listing[[#This Row],[School Code]]","v":85}]
[330,"HAMILTON COUNTY",{"$f":"School_Listing[[#This Row],[System Code]]","v":330},8142,{"$f":"School_Listing[[#This Row],[System Code]]&School_Listing[[#This Row],[School Code]]","v":"3308142"},"Montessori Elementary at Highland Park",{"$f":"School_Listing[[#This Row],[School Code]]","v":8142}]
[330,"HAMILTON COUNTY",{"$f":"School_Listing[[#This Row],[System Code]]","v":330},149,{"$f":"School_Listing[[#This Row],[System Code]]&School_Listing[[#This Row],[School Code]]","v":"330149"},"Nolan Elementary",{"$f":"School_Listing[[#This Row],[School Code]]","v":149}]
[330,"HAMILTON COUNTY",{"$f":"School_Listing[[#This Row],[System Code]]","v":330},41,{"$f":"School_Listing[[#This Row],[System Code]]&School_Listing[[#This Row],[School Code]]","v":"33041"},"Normal Park Museum Magnet School",{"$f":"School_Listing[[#This Row],[School Code]]","v":41}]
[330,"HAMILTON COUNTY",{"$f":"School_Listing[[#This Row],[System Code]]","v":330},147,{"$f":"School_Listing[[#This Row],[System Code]]&School_Listing[[#This Row],[School Code]]","v":"330147"},"North Hamilton Elementary",{"$f":"School_Listing[[#This Row],[School Code]]","v":147}]
[330,"HAMILTON COUNTY",{"$f":"School_Listing[[#This Row],[System Code]]","v":330},155,{"$f":"School_Listing[[#This Row],[System Code]]&School_Listing[[#This Row],[School Code]]","v":"330155"},"Ooltewah Elementary",{"$f":"School_Listing[[#This Row],[School Code]]","v":155}]
[330,"HAMILTON COUNTY",{"$f":"School_Listing[[#This Row],[System Code]]","v":330},160,{"$f":"School_Listing[[#This Row],[System Code]]&School_Listing[[#This Row],[School Code]]","v":"330160"},"Ooltewah High School",{"$f":"School_Listing[[#This Row],[School Code]]","v":160}]
[330,"HAMILTON COUNTY",{"$f":"School_Listing[[#This Row],[System Code]]","v":330},157,{"$f":"School_Listing[[#This Row],[System Code]]&School_Listing[[#This Row],[School Code]]","v":"330157"},"Ooltewah Middle School",{"$f":"School_Listing[[#This Row],[School Code]]","v":157}]
[330,"HAMILTON COUNTY",{"$f":"School_Listing[[#This Row],[System Code]]","v":330},194,{"$f":"School_Listing[[#This Row],[System Code]]&School_Listing[[#This Row],[School Code]]","v":"330194"},"Orchard Knob Elementary",{"$f":"School_Listing[[#This Row],[School Code]]","v":194}]
[330,"HAMILTON COUNTY",{"$f":"School_Listing[[#This Row],[System Code]]","v":330},200,{"$f":"School_Listing[[#This Row],[System Code]]&School_Listing[[#This Row],[School Code]]","v":"330200"},"Orchard Knob Middle",{"$f":"School_Listing[[#This Row],[School Code]]","v":200}]
[330,"HAMILTON COUNTY",{"$f":"School_Listing[[#This Row],[System Code]]","v":330},171,{"$f":"School_Listing[[#This Row],[System Code]]&School_Listing[[#This Row],[School Code]]","v":"330171"},"Red Bank Elementary",{"$f":"School_Listing[[#This Row],[School Code]]","v":171}]
[330,"HAMILTON COUNTY",{"$f":"School_Listing[[#This Row],[System Code]]","v":330},175,{"$f":"School_Listing[[#This Row],[System Code]]&School_Listing[[#This Row],[School Code]]","v":"330175"},"Red Bank High School",{"$f":"School_Listing[[#This Row],[School Code]]","v":175}]
[330,"HAMILTON COUNTY",{"$f":"School_Listing[[#This Row],[System Code]]","v":330},180,{"$f":"School_Listing[[#This Row],[System Code]]&School_Listing[[#This Row],[School Code]]","v":"330180"},"Red Bank Middle School",{"$f":"School_Listing[[#This Row],[School Code]]","v":180}]
[330,"HAMILTON COUNTY",{"$f":"School_Listing[[#This Row],[System Code]]","v":330},183,{"$f":"School_Listing[[#This Row],[System Code]]&School_Listing[[#This Row],[School Code]]","v":"330183"},"Rivermont Elementary",{"$f":"School_Listing[[#This Row],[School Code]]","v":183}]
[330,"HAMILTON COUNTY",{"$f":"School_Listing[[#This Row],[System Code]]","v":330},190,{"$f":"School_Listing[[#This Row],[System Code]]&School_Listing[[#This Row],[School Code]]","v":"330190"},"Sale Creek Middle / High School",{"$f":"School_Listing[[#This Row],[School Code]]","v":190}]
[330,"HAMILTON COUNTY",{"$f":"School_Listing[[#This Row],[System Code]]","v":330},196,{"$f":"School_Listing[[#This Row],[System Code]]&School_Listing[[#This Row],[School Code]]","v":"330196"},"Sequoyah High School",{"$f":"School_Listing[[#This Row],[School Code]]","v":196}]
[330,"HAMILTON COUNTY",{"$f":"School_Listing[[#This Row],[System Code]]","v":330},210,{"$f":"School_Listing[[#This Row],[System Code]]&School_Listing[[#This Row],[School Code]]","v":"330210"},"Signal Mountain Middle/High School",{"$f":"School_Listing[[#This Row],[School Code]]","v":210}]
[330,"HAMILTON COUNTY",{"$f":"School_Listing[[#This Row],[System Code]]","v":330},215,{"$f":"School_Listing[[#This Row],[System Code]]&School_Listing[[#This Row],[School Code]]","v":"330215"},"Snow Hill Elementary",{"$f":"School_Listing[[#This Row],[School Code]]","v":215}]
[330,"HAMILTON COUNTY",{"$f":"School_Listing[[#This Row],[System Code]]","v":330},220,{"$f":"School_Listing[[#This Row],[System Code]]&School_Listing[[#This Row],[School Code]]","v":"330220"},"Soddy Daisy High School",{"$f":"School_Listing[[#This Row],[School Code]]","v":220}]
[330,"HAMILTON COUNTY",{"$f":"School_Listing[[#This Row],[System Code]]","v":330},225,{"$f":"School_Listing[[#This Row],[System Code]]&School_Listing[[#This Row],[School Code]]","v":"330225"},"Soddy Daisy Middle School",{"$f":"School_Listing[[#This Row],[School Code]]","v":225}]
[330,"HAMILTON COUNTY",{"$f":"School_Listing[[#This Row],[System Code]]","v":330},230,{"$f":"School_Listing[[#This Row],[System Code]]&School_Listing[[#This Row],[School Code]]","v":"330230"},"Soddy Elementary",{"$f":"School_Listing[[#This Row],[School Code]]","v":230}]
[330,"HAMILTON COUNTY",{"$f":"School_Listing[[#This Row],[System Code]]","v":330},235,{"$f":"School_Listing[[#This Row],[System Code]]&School_Listing[[#This Row],[School Code]]","v":"330235"},"Spring Creek Elementary",{"$f":"School_Listing[[#This Row],[School Code]]","v":235}]
[330,"HAMILTON COUNTY",{"$f":"School_Listing[[#This Row],[System Code]]","v":330},280,{"$f":"School_Listing[[#This Row],[System Code]]&School_Listing[[#This Row],[School Code]]","v":"330280"},"STEM School Chattanooga",{"$f":"School_Listing[[#This Row],[School Code]]","v":280}]
[330,"HAMILTON COUNTY",{"$f":"School_Listing[[#This Row],[System Code]]","v":330},137,{"$f":"School_Listing[[#This Row],[System Code]]&School_Listing[[#This Row],[School Code]]","v":"330137"},"The Howard School",{"$f":"School_Listing[[#This Row],[School Code]]","v":137}]
[330,"HAMILTON COUNTY",{"$f":"School_Listing[[#This Row],[System Code]]","v":330},240,{"$f":"School_Listing[[#This Row],[System Code]]&School_Listing[[#This Row],[School Code]]","v":"330240"},"Thrasher Elementary",{"$f":"School_Listing[[#This Row],[School Code]]","v":240}]
[330,"HAMILTON COUNTY",{"$f":"School_Listing[[#This Row],[System Code]]","v":330},33,{"$f":"School_Listing[[#This Row],[System Code]]&School_Listing[[#This Row],[School Code]]","v":"33033"},"Tommie F. Brown Academy",{"$f":"School_Listing[[#This Row],[School Code]]","v":33}]
[330,"HAMILTON COUNTY",{"$f":"School_Listing[[#This Row],[System Code]]","v":330},237,{"$f":"School_Listing[[#This Row],[System Code]]&School_Listing[[#This Row],[School Code]]","v":"330237"},"Tyner Academy",{"$f":"School_Listing[[#This Row],[School Code]]","v":237}]
[330,"HAMILTON COUNTY",{"$f":"School_Listing[[#This Row],[System Code]]","v":330},239,{"$f":"School_Listing[[#This Row],[System Code]]&School_Listing[[#This Row],[School Code]]","v":"330239"},"Tyner Middle Academy",{"$f":"School_Listing[[#This Row],[School Code]]","v":239}]
[330,"HAMILTON COUNTY",{"$f":"School_Listing[[#This Row],[System Code]]","v":330},260,{"$f":"School_Listing[[#This Row],[System Code]]&School_Listing[[#This Row],[School Code]]","v":"330260"},"Wallace A. Smith Elementary",{"$f":"School_Listing[[#This Row],[School Code]]","v":260}]
[330,"HAMILTON COUNTY",{"$f":"School_Listing[[#This Row],[System Code]]","v":330},265,{"$f":"School_Listing[[#This Row],[System Code]]&School_Listing[[#This Row],[School Code]]","v":"330265"},"Westview Elementary",{"$f":"School_Listing[[#This Row],[School Code]]","v":265}]
[330,"HAMILTON COUNTY",{"$f":"School_Listing[[#This Row],[System Code]]","v":330},148,{"$f":"School_Listing[[#This Row],[System Code]]&School_Listing[[#This Row],[School Code]]","v":"330148"},"Wolftever Creek Elementary",{"$f":"School_Listing[[#This Row],[School Code]]","v":148}]
[330,"HAMILTON COUNTY",{"$f":"School_Listing[[#This Row],[System Code]]","v":330},245,{"$f":"School_Listing[[#This Row],[System Code]]&School_Listing[[#This Row],[School Code]]","v":"330245"},"Woodmore Elementary",{"$f":"School_Listing[[#This Row],[School Code]]","v":245}]
[340,"HANCOCK COUNTY",{"$f":"School_Listing[[#This Row],[System Code]]","v":340},7001,{"$f":"School_Listing[[#This Row],[System Code]]&School_Listing[[#This Row],[School Code]]","v":"3407001"},"Hancock County Early Learning Center",{"$f":"School_Listing[[#This Row],[School Code]]","v":7001}]
[340,"HANCOCK COUNTY",{"$f":"School_Listing[[#This Row],[System Code]]","v":340},20,{"$f":"School_Listing[[#This Row],[System Code]]&School_Listing[[#This Row],[School Code]]","v":"34020"},"Hancock County Elementary",{"$f":"School_Listing[[#This Row],[School Code]]","v":20}]
[340,"HANCOCK COUNTY",{"$f":"School_Listing[[#This Row],[System Code]]","v":340},25,{"$f":"School_Listing[[#This Row],[System Code]]&School_Listing[[#This Row],[School Code]]","v":"34025"},"Hancock High School",{"$f":"School_Listing[[#This Row],[School Code]]","v":25}]
[350,"HARDEMAN COUNTY SCHOOLS",{"$f":"School_Listing[[#This Row],[System Code]]","v":350},5,{"$f":"School_Listing[[#This Row],[System Code]]&School_Listing[[#This Row],[School Code]]","v":"3505"},"Bolivar Elementary",{"$f":"School_Listing[[#This Row],[School Code]]","v":5}]
[350,"HARDEMAN COUNTY SCHOOLS",{"$f":"School_Listing[[#This Row],[System Code]]","v":350},10,{"$f":"School_Listing[[#This Row],[System Code]]&School_Listing[[#This Row],[School Code]]","v":"35010"},"Bolivar Middle School",{"$f":"School_Listing[[#This Row],[School Code]]","v":10}]
[350,"HARDEMAN COUNTY SCHOOLS",{"$f":"School_Listing[[#This Row],[System Code]]","v":350},15,{"$f":"School_Listing[[#This Row],[System Code]]&School_Listing[[#This Row],[School Code]]","v":"35015"},"Central High School",{"$f":"School_Listing[[#This Row],[School Code]]","v":15}]
[350,"HARDEMAN COUNTY SCHOOLS",{"$f":"School_Listing[[#This Row],[System Code]]","v":350},25,{"$f":"School_Listing[[#This Row],[System Code]]&School_Listing[[#This Row],[School Code]]","v":"35025"},"Grand Junction Elementary",{"$f":"School_Listing[[#This Row],[School Code]]","v":25}]
[350,"HARDEMAN COUNTY SCHOOLS",{"$f":"School_Listing[[#This Row],[System Code]]","v":350},30,{"$f":"School_Listing[[#This Row],[System Code]]&School_Listing[[#This Row],[School Code]]","v":"35030"},"Hornsby Elementary",{"$f":"School_Listing[[#This Row],[School Code]]","v":30}]
[350,"HARDEMAN COUNTY SCHOOLS",{"$f":"School_Listing[[#This Row],[System Code]]","v":350},35,{"$f":"School_Listing[[#This Row],[System Code]]&School_Listing[[#This Row],[School Code]]","v":"35035"},"Middleton Elementary",{"$f":"School_Listing[[#This Row],[School Code]]","v":35}]
[350,"HARDEMAN COUNTY SCHOOLS",{"$f":"School_Listing[[#This Row],[System Code]]","v":350},40,{"$f":"School_Listing[[#This Row],[System Code]]&School_Listing[[#This Row],[School Code]]","v":"35040"},"Middleton High School",{"$f":"School_Listing[[#This Row],[School Code]]","v":40}]
[350,"HARDEMAN COUNTY SCHOOLS",{"$f":"School_Listing[[#This Row],[System Code]]","v":350},45,{"$f":"School_Listing[[#This Row],[System Code]]&School_Listing[[#This Row],[School Code]]","v":"35045"},"Toone Elementary",{"$f":"School_Listing[[#This Row],[School Code]]","v":45}]
[350,"HARDEMAN COUNTY SCHOOLS",{"$f":"School_Listing[[#This Row],[System Code]]","v":350},55,{"$f":"School_Listing[[#This Row],[System Code]]&School_Listing[[#This Row],[School Code]]","v":"35055"},"Whiteville Elementary",{"$f":"School_Listing[[#This Row],[School Code]]","v":55}]
[360,"HARDIN COUNTY",{"$f":"School_Listing[[#This Row],[System Code]]","v":360},19,{"$f":"School_Listing[[#This Row],[System Code]]&School_Listing[[#This Row],[School Code]]","v":"36019"},"East Hardin Elementary",{"$f":"School_Listing[[#This Row],[School Code]]","v":19}]
[360,"HARDIN COUNTY",{"$f":"School_Listing[[#This Row],[System Code]]","v":360},15,{"$f":"School_Listing[[#This Row],[System Code]]&School_Listing[[#This Row],[School Code]]","v":"36015"},"Hardin County High School",{"$f":"School_Listing[[#This Row],[School Code]]","v":15}]
[360,"HARDIN COUNTY",{"$f":"School_Listing[[#This Row],[System Code]]","v":360},17,{"$f":"School_Listing[[#This Row],[System Code]]&School_Listing[[#This Row],[School Code]]","v":"36017"},"Hardin County Middle School",{"$f":"School_Listing[[#This Row],[School Code]]","v":17}]
[360,"HARDIN COUNTY",{"$f":"School_Listing[[#This Row],[System Code]]","v":360},21,{"$f":"School_Listing[[#This Row],[System Code]]&School_Listing[[#This Row],[School Code]]","v":"36021"},"Northside Elementary",{"$f":"School_Listing[[#This Row],[School Code]]","v":21}]
[360,"HARDIN COUNTY",{"$f":"School_Listing[[#This Row],[System Code]]","v":360},45,{"$f":"School_Listing[[#This Row],[System Code]]&School_Listing[[#This Row],[School Code]]","v":"36045"},"Parris South Elementary",{"$f":"School_Listing[[#This Row],[School Code]]","v":45}]
[360,"HARDIN COUNTY",{"$f":"School_Listing[[#This Row],[System Code]]","v":360},50,{"$f":"School_Listing[[#This Row],[System Code]]&School_Listing[[#This Row],[School Code]]","v":"36050"},"Pickwick Southside School",{"$f":"School_Listing[[#This Row],[School Code]]","v":50}]
[360,"HARDIN COUNTY",{"$f":"School_Listing[[#This Row],[System Code]]","v":360},67,{"$f":"School_Listing[[#This Row],[System Code]]&School_Listing[[#This Row],[School Code]]","v":"36067"},"West Hardin Elementary",{"$f":"School_Listing[[#This Row],[School Code]]","v":67}]
[370,"HAWKINS COUNTY",{"$f":"School_Listing[[#This Row],[System Code]]","v":370},10,{"$f":"School_Listing[[#This Row],[System Code]]&School_Listing[[#This Row],[School Code]]","v":"37010"},"Bulls Gap School",{"$f":"School_Listing[[#This Row],[School Code]]","v":10}]
[370,"HAWKINS COUNTY",{"$f":"School_Listing[[#This Row],[System Code]]","v":370},15,{"$f":"School_Listing[[#This Row],[System Code]]&School_Listing[[#This Row],[School Code]]","v":"37015"},"Carter's Valley Elementary",{"$f":"School_Listing[[#This Row],[School Code]]","v":15}]
[370,"HAWKINS COUNTY",{"$f":"School_Listing[[#This Row],[System Code]]","v":370},17,{"$f":"School_Listing[[#This Row],[System Code]]&School_Listing[[#This Row],[School Code]]","v":"37017"},"Cherokee High School",{"$f":"School_Listing[[#This Row],[School Code]]","v":17}]
[370,"HAWKINS COUNTY",{"$f":"School_Listing[[#This Row],[System Code]]","v":370},20,{"$f":"School_Listing[[#This Row],[System Code]]&School_Listing[[#This Row],[School Code]]","v":"37020"},"Church Hill Elementary",{"$f":"School_Listing[[#This Row],[School Code]]","v":20}]
[370,"HAWKINS COUNTY",{"$f":"School_Listing[[#This Row],[System Code]]","v":370},23,{"$f":"School_Listing[[#This Row],[System Code]]&School_Listing[[#This Row],[School Code]]","v":"37023"},"Church Hill Intermediate School",{"$f":"School_Listing[[#This Row],[School Code]]","v":23}]
[370,"HAWKINS COUNTY",{"$f":"School_Listing[[#This Row],[System Code]]","v":370},25,{"$f":"School_Listing[[#This Row],[System Code]]&School_Listing[[#This Row],[School Code]]","v":"37025"},"Church Hill Middle School",{"$f":"School_Listing[[#This Row],[School Code]]","v":25}]
[370,"HAWKINS COUNTY",{"$f":"School_Listing[[#This Row],[System Code]]","v":370},30,{"$f":"School_Listing[[#This Row],[System Code]]&School_Listing[[#This Row],[School Code]]","v":"37030"},"Clinch School",{"$f":"School_Listing[[#This Row],[School Code]]","v":30}]
[370,"HAWKINS COUNTY",{"$f":"School_Listing[[#This Row],[System Code]]","v":370},44,{"$f":"School_Listing[[#This Row],[System Code]]&School_Listing[[#This Row],[School Code]]","v":"37044"},"Hawkins County Virtual Academy",{"$f":"School_Listing[[#This Row],[School Code]]","v":44}]
[370,"HAWKINS COUNTY",{"$f":"School_Listing[[#This Row],[System Code]]","v":370},75,{"$f":"School_Listing[[#This Row],[System Code]]&School_Listing[[#This Row],[School Code]]","v":"37075"},"Hawkins Elementary",{"$f":"School_Listing[[#This Row],[School Code]]","v":75}]
[370,"HAWKINS COUNTY",{"$f":"School_Listing[[#This Row],[System Code]]","v":370},78,{"$f":"School_Listing[[#This Row],[System Code]]&School_Listing[[#This Row],[School Code]]","v":"37078"},"Joseph Rogers Primary School",{"$f":"School_Listing[[#This Row],[School Code]]","v":78}]
[370,"HAWKINS COUNTY",{"$f":"School_Listing[[#This Row],[System Code]]","v":370},65,{"$f":"School_Listing[[#This Row],[System Code]]&School_Listing[[#This Row],[School Code]]","v":"37065"},"Mooresburg Elementary",{"$f":"School_Listing[[#This Row],[School Code]]","v":65}]
[370,"HAWKINS COUNTY",{"$f":"School_Listing[[#This Row],[System Code]]","v":370},55,{"$f":"School_Listing[[#This Row],[System Code]]&School_Listing[[#This Row],[School Code]]","v":"37055"},"Mt Carmel Elementary",{"$f":"School_Listing[[#This Row],[School Code]]","v":55}]
[370,"HAWKINS COUNTY",{"$f":"School_Listing[[#This Row],[System Code]]","v":370},57,{"$f":"School_Listing[[#This Row],[System Code]]&School_Listing[[#This Row],[School Code]]","v":"37057"},"Pathways Alternative School",{"$f":"School_Listing[[#This Row],[School Code]]","v":57}]
[370,"HAWKINS COUNTY",{"$f":"School_Listing[[#This Row],[System Code]]","v":370},80,{"$f":"School_Listing[[#This Row],[System Code]]&School_Listing[[#This Row],[School Code]]","v":"37080"},"Rogersville Middle School",{"$f":"School_Listing[[#This Row],[School Code]]","v":80}]
[370,"HAWKINS COUNTY",{"$f":"School_Listing[[#This Row],[System Code]]","v":370},90,{"$f":"School_Listing[[#This Row],[System Code]]&School_Listing[[#This Row],[School Code]]","v":"37090"},"St Clair Elementary",{"$f":"School_Listing[[#This Row],[School Code]]","v":90}]
[370,"HAWKINS COUNTY",{"$f":"School_Listing[[#This Row],[System Code]]","v":370},95,{"$f":"School_Listing[[#This Row],[System Code]]&School_Listing[[#This Row],[School Code]]","v":"37095"},"Surgoinsville Elementary",{"$f":"School_Listing[[#This Row],[School Code]]","v":95}]
[370,"HAWKINS COUNTY",{"$f":"School_Listing[[#This Row],[System Code]]","v":370},100,{"$f":"School_Listing[[#This Row],[System Code]]&School_Listing[[#This Row],[School Code]]","v":"370100"},"Surgoinsville Middle School",{"$f":"School_Listing[[#This Row],[School Code]]","v":100}]
[370,"HAWKINS COUNTY",{"$f":"School_Listing[[#This Row],[System Code]]","v":370},105,{"$f":"School_Listing[[#This Row],[System Code]]&School_Listing[[#This Row],[School Code]]","v":"370105"},"Volunteer High School",{"$f":"School_Listing[[#This Row],[School Code]]","v":105}]
[371,"ROGERSVILLE",{"$f":"School_Listing[[#This Row],[System Code]]","v":371},5,{"$f":"School_Listing[[#This Row],[System Code]]&School_Listing[[#This Row],[School Code]]","v":"3715"},"Rogersville Elementary",{"$f":"School_Listing[[#This Row],[School Code]]","v":5}]
[380,"HAYWOOD COUNTY",{"$f":"School_Listing[[#This Row],[System Code]]","v":380},5,{"$f":"School_Listing[[#This Row],[System Code]]&School_Listing[[#This Row],[School Code]]","v":"3805"},"Anderson Early Childhood",{"$f":"School_Listing[[#This Row],[School Code]]","v":5}]
[380,"HAYWOOD COUNTY",{"$f":"School_Listing[[#This Row],[System Code]]","v":380},25,{"$f":"School_Listing[[#This Row],[System Code]]&School_Listing[[#This Row],[School Code]]","v":"38025"},"East Side Elementary",{"$f":"School_Listing[[#This Row],[School Code]]","v":25}]
[380,"HAYWOOD COUNTY",{"$f":"School_Listing[[#This Row],[System Code]]","v":380},34,{"$f":"School_Listing[[#This Row],[System Code]]&School_Listing[[#This Row],[School Code]]","v":"38034"},"Haywood County Virtual Academy",{"$f":"School_Listing[[#This Row],[School Code]]","v":34}]
[380,"HAYWOOD COUNTY",{"$f":"School_Listing[[#This Row],[System Code]]","v":380},35,{"$f":"School_Listing[[#This Row],[System Code]]&School_Listing[[#This Row],[School Code]]","v":"38035"},"Haywood Elementary",{"$f":"School_Listing[[#This Row],[School Code]]","v":35}]
[380,"HAYWOOD COUNTY",{"$f":"School_Listing[[#This Row],[System Code]]","v":380},40,{"$f":"School_Listing[[#This Row],[System Code]]&School_Listing[[#This Row],[School Code]]","v":"38040"},"Haywood High School",{"$f":"School_Listing[[#This Row],[School Code]]","v":40}]
[380,"HAYWOOD COUNTY",{"$f":"School_Listing[[#This Row],[System Code]]","v":380},45,{"$f":"School_Listing[[#This Row],[System Code]]&School_Listing[[#This Row],[School Code]]","v":"38045"},"Haywood Middle School",{"$f":"School_Listing[[#This Row],[School Code]]","v":45}]
[380,"HAYWOOD COUNTY",{"$f":"School_Listing[[#This Row],[System Code]]","v":380},65,{"$f":"School_Listing[[#This Row],[System Code]]&School_Listing[[#This Row],[School Code]]","v":"38065"},"Sunny Hill Intermediate School",{"$f":"School_Listing[[#This Row],[School Code]]","v":65}]
[390,"HENDERSON COUNTY",{"$f":"School_Listing[[#This Row],[System Code]]","v":390},5,{"$f":"School_Listing[[#This Row],[System Code]]&School_Listing[[#This Row],[School Code]]","v":"3905"},"Bargerton Elementary",{"$f":"School_Listing[[#This Row],[School Code]]","v":5}]
[390,"HENDERSON COUNTY",{"$f":"School_Listing[[#This Row],[System Code]]","v":390},10,{"$f":"School_Listing[[#This Row],[System Code]]&School_Listing[[#This Row],[School Code]]","v":"39010"},"Beaver Elementary",{"$f":"School_Listing[[#This Row],[School Code]]","v":10}]
[390,"HENDERSON COUNTY",{"$f":"School_Listing[[#This Row],[System Code]]","v":390},15,{"$f":"School_Listing[[#This Row],[System Code]]&School_Listing[[#This Row],[School Code]]","v":"39015"},"Lexington High School",{"$f":"School_Listing[[#This Row],[School Code]]","v":15}]
[390,"HENDERSON COUNTY",{"$f":"School_Listing[[#This Row],[System Code]]","v":390},20,{"$f":"School_Listing[[#This Row],[System Code]]&School_Listing[[#This Row],[School Code]]","v":"39020"},"Pin Oak Elementary",{"$f":"School_Listing[[#This Row],[School Code]]","v":20}]
[390,"HENDERSON COUNTY",{"$f":"School_Listing[[#This Row],[System Code]]","v":390},38,{"$f":"School_Listing[[#This Row],[System Code]]&School_Listing[[#This Row],[School Code]]","v":"39038"},"Scotts Hill Elementary",{"$f":"School_Listing[[#This Row],[School Code]]","v":38}]
[390,"HENDERSON COUNTY",{"$f":"School_Listing[[#This Row],[System Code]]","v":390},39,{"$f":"School_Listing[[#This Row],[System Code]]&School_Listing[[#This Row],[School Code]]","v":"39039"},"Scotts Hill High School",{"$f":"School_Listing[[#This Row],[School Code]]","v":39}]
[390,"HENDERSON COUNTY",{"$f":"School_Listing[[#This Row],[System Code]]","v":390},40,{"$f":"School_Listing[[#This Row],[System Code]]&School_Listing[[#This Row],[School Code]]","v":"39040"},"South Haven Elementary",{"$f":"School_Listing[[#This Row],[School Code]]","v":40}]
[390,"HENDERSON COUNTY",{"$f":"School_Listing[[#This Row],[System Code]]","v":390},50,{"$f":"School_Listing[[#This Row],[System Code]]&School_Listing[[#This Row],[School Code]]","v":"39050"},"South Side Elementary",{"$f":"School_Listing[[#This Row],[School Code]]","v":50}]
[390,"HENDERSON COUNTY",{"$f":"School_Listing[[#This Row],[System Code]]","v":390},45,{"$f":"School_Listing[[#This Row],[System Code]]&School_Listing[[#This Row],[School Code]]","v":"39045"},"Westover Elementary",{"$f":"School_Listing[[#This Row],[School Code]]","v":45}]
[391,"LEXINGTON",{"$f":"School_Listing[[#This Row],[System Code]]","v":391},10,{"$f":"School_Listing[[#This Row],[System Code]]&School_Listing[[#This Row],[School Code]]","v":"39110"},"Lexington Middle School",{"$f":"School_Listing[[#This Row],[School Code]]","v":10}]
[391,"LEXINGTON",{"$f":"School_Listing[[#This Row],[System Code]]","v":391},5,{"$f":"School_Listing[[#This Row],[System Code]]&School_Listing[[#This Row],[School Code]]","v":"3915"},"Paul G. Caywood Elementary",{"$f":"School_Listing[[#This Row],[School Code]]","v":5}]
[400,"HENRY COUNTY",{"$f":"School_Listing[[#This Row],[System Code]]","v":400},12,{"$f":"School_Listing[[#This Row],[System Code]]&School_Listing[[#This Row],[School Code]]","v":"40012"},"Dorothy And Noble Harrelson School",{"$f":"School_Listing[[#This Row],[School Code]]","v":12}]
[400,"HENRY COUNTY",{"$f":"School_Listing[[#This Row],[System Code]]","v":400},15,{"$f":"School_Listing[[#This Row],[System Code]]&School_Listing[[#This Row],[School Code]]","v":"40015"},"E. W. Grove School",{"$f":"School_Listing[[#This Row],[School Code]]","v":15}]
[400,"HENRY COUNTY",{"$f":"School_Listing[[#This Row],[System Code]]","v":400},25,{"$f":"School_Listing[[#This Row],[System Code]]&School_Listing[[#This Row],[School Code]]","v":"40025"},"Henry Co High School",{"$f":"School_Listing[[#This Row],[School Code]]","v":25}]
[400,"HENRY COUNTY",{"$f":"School_Listing[[#This Row],[System Code]]","v":400},28,{"$f":"School_Listing[[#This Row],[System Code]]&School_Listing[[#This Row],[School Code]]","v":"40028"},"Henry County Virtual Academy",{"$f":"School_Listing[[#This Row],[School Code]]","v":28}]
[400,"HENRY COUNTY",{"$f":"School_Listing[[#This Row],[System Code]]","v":400},20,{"$f":"School_Listing[[#This Row],[System Code]]&School_Listing[[#This Row],[School Code]]","v":"40020"},"Henry Elementary",{"$f":"School_Listing[[#This Row],[School Code]]","v":20}]
[400,"HENRY COUNTY",{"$f":"School_Listing[[#This Row],[System Code]]","v":400},33,{"$f":"School_Listing[[#This Row],[System Code]]&School_Listing[[#This Row],[School Code]]","v":"40033"},"Lakewood Elementary",{"$f":"School_Listing[[#This Row],[School Code]]","v":33}]
[400,"HENRY COUNTY",{"$f":"School_Listing[[#This Row],[System Code]]","v":400},34,{"$f":"School_Listing[[#This Row],[System Code]]&School_Listing[[#This Row],[School Code]]","v":"40034"},"Lakewood Middle School",{"$f":"School_Listing[[#This Row],[School Code]]","v":34}]
[401,"PARIS",{"$f":"School_Listing[[#This Row],[System Code]]","v":401},20,{"$f":"School_Listing[[#This Row],[System Code]]&School_Listing[[#This Row],[School Code]]","v":"40120"},"Paris Elementary",{"$f":"School_Listing[[#This Row],[School Code]]","v":20}]
[401,"PARIS",{"$f":"School_Listing[[#This Row],[System Code]]","v":401},15,{"$f":"School_Listing[[#This Row],[System Code]]&School_Listing[[#This Row],[School Code]]","v":"40115"},"W G Rhea Elementary",{"$f":"School_Listing[[#This Row],[School Code]]","v":15}]
[401,"PARIS",{"$f":"School_Listing[[#This Row],[System Code]]","v":401},10,{"$f":"School_Listing[[#This Row],[System Code]]&School_Listing[[#This Row],[School Code]]","v":"40110"},"W O Inman Middle School",{"$f":"School_Listing[[#This Row],[School Code]]","v":10}]
[410,"HICKMAN COUNTY",{"$f":"School_Listing[[#This Row],[System Code]]","v":410},5,{"$f":"School_Listing[[#This Row],[System Code]]&School_Listing[[#This Row],[School Code]]","v":"4105"},"Centerville Elementary",{"$f":"School_Listing[[#This Row],[School Code]]","v":5}]
[410,"HICKMAN COUNTY",{"$f":"School_Listing[[#This Row],[System Code]]","v":410},7,{"$f":"School_Listing[[#This Row],[System Code]]&School_Listing[[#This Row],[School Code]]","v":"4107"},"Centerville Intermediate School",{"$f":"School_Listing[[#This Row],[School Code]]","v":7}]
[410,"HICKMAN COUNTY",{"$f":"School_Listing[[#This Row],[System Code]]","v":410},15,{"$f":"School_Listing[[#This Row],[System Code]]&School_Listing[[#This Row],[School Code]]","v":"41015"},"East Hickman Elementary",{"$f":"School_Listing[[#This Row],[School Code]]","v":15}]
[410,"HICKMAN COUNTY",{"$f":"School_Listing[[#This Row],[System Code]]","v":410},18,{"$f":"School_Listing[[#This Row],[System Code]]&School_Listing[[#This Row],[School Code]]","v":"41018"},"East Hickman High School",{"$f":"School_Listing[[#This Row],[School Code]]","v":18}]
[410,"HICKMAN COUNTY",{"$f":"School_Listing[[#This Row],[System Code]]","v":410},16,{"$f":"School_Listing[[#This Row],[System Code]]&School_Listing[[#This Row],[School Code]]","v":"41016"},"East Hickman Intermediate School",{"$f":"School_Listing[[#This Row],[School Code]]","v":16}]
[410,"HICKMAN COUNTY",{"$f":"School_Listing[[#This Row],[System Code]]","v":410},17,{"$f":"School_Listing[[#This Row],[System Code]]&School_Listing[[#This Row],[School Code]]","v":"41017"},"East Hickman Middle School",{"$f":"School_Listing[[#This Row],[School Code]]","v":17}]
[410,"HICKMAN COUNTY",{"$f":"School_Listing[[#This Row],[System Code]]","v":410},20,{"$f":"School_Listing[[#This Row],[System Code]]&School_Listing[[#This Row],[School Code]]","v":"41020"},"Hickman Co Middle School",{"$f":"School_Listing[[#This Row],[School Code]]","v":20}]
[410,"HICKMAN COUNTY",{"$f":"School_Listing[[#This Row],[System Code]]","v":410},30,{"$f":"School_Listing[[#This Row],[System Code]]&School_Listing[[#This Row],[School Code]]","v":"41030"},"Hickman Co Sr High School",{"$f":"School_Listing[[#This Row],[School Code]]","v":30}]
[410,"HICKMAN COUNTY",{"$f":"School_Listing[[#This Row],[System Code]]","v":410},19,{"$f":"School_Listing[[#This Row],[System Code]]&School_Listing[[#This Row],[School Code]]","v":"41019"},"Hickman County Learning Academy",{"$f":"School_Listing[[#This Row],[School Code]]","v":19}]
[420,"HOUSTON COUNTY",{"$f":"School_Listing[[#This Row],[System Code]]","v":420},5,{"$f":"School_Listing[[#This Row],[System Code]]&School_Listing[[#This Row],[School Code]]","v":"4205"},"Erin Elementary",{"$f":"School_Listing[[#This Row],[School Code]]","v":5}]
[420,"HOUSTON COUNTY",{"$f":"School_Listing[[#This Row],[System Code]]","v":420},13,{"$f":"School_Listing[[#This Row],[System Code]]&School_Listing[[#This Row],[School Code]]","v":"42013"},"Houston Co High School",{"$f":"School_Listing[[#This Row],[School Code]]","v":13}]
[420,"HOUSTON COUNTY",{"$f":"School_Listing[[#This Row],[System Code]]","v":420},10,{"$f":"School_Listing[[#This Row],[System Code]]&School_Listing[[#This Row],[School Code]]","v":"42010"},"Houston Co Middle School",{"$f":"School_Listing[[#This Row],[School Code]]","v":10}]
[420,"HOUSTON COUNTY",{"$f":"School_Listing[[#This Row],[System Code]]","v":420},12,{"$f":"School_Listing[[#This Row],[System Code]]&School_Listing[[#This Row],[School Code]]","v":"42012"},"Houston County Adult High School",{"$f":"School_Listing[[#This Row],[School Code]]","v":12}]
[420,"HOUSTON COUNTY",{"$f":"School_Listing[[#This Row],[System Code]]","v":420},20,{"$f":"School_Listing[[#This Row],[System Code]]&School_Listing[[#This Row],[School Code]]","v":"42020"},"Houston County Virtual Academy",{"$f":"School_Listing[[#This Row],[School Code]]","v":20}]
[420,"HOUSTON COUNTY",{"$f":"School_Listing[[#This Row],[System Code]]","v":420},15,{"$f":"School_Listing[[#This Row],[System Code]]&School_Listing[[#This Row],[School Code]]","v":"42015"},"Tennessee Ridge Elementary",{"$f":"School_Listing[[#This Row],[School Code]]","v":15}]
[430,"HUMPHREYS COUNTY",{"$f":"School_Listing[[#This Row],[System Code]]","v":430},5,{"$f":"School_Listing[[#This Row],[System Code]]&School_Listing[[#This Row],[School Code]]","v":"4305"},"Lakeview Elementary",{"$f":"School_Listing[[#This Row],[School Code]]","v":5}]
[430,"HUMPHREYS COUNTY",{"$f":"School_Listing[[#This Row],[System Code]]","v":430},9,{"$f":"School_Listing[[#This Row],[System Code]]&School_Listing[[#This Row],[School Code]]","v":"4309"},"Mc Ewen Elementary",{"$f":"School_Listing[[#This Row],[School Code]]","v":9}]
[430,"HUMPHREYS COUNTY",{"$f":"School_Listing[[#This Row],[System Code]]","v":430},15,{"$f":"School_Listing[[#This Row],[System Code]]&School_Listing[[#This Row],[School Code]]","v":"43015"},"Mc Ewen High School",{"$f":"School_Listing[[#This Row],[School Code]]","v":15}]
[430,"HUMPHREYS COUNTY",{"$f":"School_Listing[[#This Row],[System Code]]","v":430},20,{"$f":"School_Listing[[#This Row],[System Code]]&School_Listing[[#This Row],[School Code]]","v":"43020"},"Waverly Central High School",{"$f":"School_Listing[[#This Row],[School Code]]","v":20}]
[430,"HUMPHREYS COUNTY",{"$f":"School_Listing[[#This Row],[System Code]]","v":430},25,{"$f":"School_Listing[[#This Row],[System Code]]&School_Listing[[#This Row],[School Code]]","v":"43025"},"Waverly Elementary",{"$f":"School_Listing[[#This Row],[School Code]]","v":25}]
[430,"HUMPHREYS COUNTY",{"$f":"School_Listing[[#This Row],[System Code]]","v":430},30,{"$f":"School_Listing[[#This Row],[System Code]]&School_Listing[[#This Row],[School Code]]","v":"43030"},"Waverly Jr High School",{"$f":"School_Listing[[#This Row],[School Code]]","v":30}]
[440,"JACKSON COUNTY",{"$f":"School_Listing[[#This Row],[System Code]]","v":440},10,{"$f":"School_Listing[[#This Row],[System Code]]&School_Listing[[#This Row],[School Code]]","v":"44010"},"Dodson Branch Elementary",{"$f":"School_Listing[[#This Row],[School Code]]","v":10}]
[440,"JACKSON COUNTY",{"$f":"School_Listing[[#This Row],[System Code]]","v":440},25,{"$f":"School_Listing[[#This Row],[System Code]]&School_Listing[[#This Row],[School Code]]","v":"44025"},"Gainesboro Elementary",{"$f":"School_Listing[[#This Row],[School Code]]","v":25}]
[440,"JACKSON COUNTY",{"$f":"School_Listing[[#This Row],[System Code]]","v":440},5,{"$f":"School_Listing[[#This Row],[System Code]]&School_Listing[[#This Row],[School Code]]","v":"4405"},"Jackson County High School",{"$f":"School_Listing[[#This Row],[School Code]]","v":5}]
[440,"JACKSON COUNTY",{"$f":"School_Listing[[#This Row],[System Code]]","v":440},50,{"$f":"School_Listing[[#This Row],[System Code]]&School_Listing[[#This Row],[School Code]]","v":"44050"},"Jackson County Middle School",{"$f":"School_Listing[[#This Row],[School Code]]","v":50}]
[450,"JEFFERSON COUNTY",{"$f":"School_Listing[[#This Row],[System Code]]","v":450},10,{"$f":"School_Listing[[#This Row],[System Code]]&School_Listing[[#This Row],[School Code]]","v":"45010"},"Dandridge Elementary",{"$f":"School_Listing[[#This Row],[School Code]]","v":10}]
[450,"JEFFERSON COUNTY",{"$f":"School_Listing[[#This Row],[System Code]]","v":450},7001,{"$f":"School_Listing[[#This Row],[System Code]]&School_Listing[[#This Row],[School Code]]","v":"4507001"},"Dandridge Head Start",{"$f":"School_Listing[[#This Row],[School Code]]","v":7001}]
[450,"JEFFERSON COUNTY",{"$f":"School_Listing[[#This Row],[System Code]]","v":450},20,{"$f":"School_Listing[[#This Row],[System Code]]&School_Listing[[#This Row],[School Code]]","v":"45020"},"Jefferson Co High School",{"$f":"School_Listing[[#This Row],[School Code]]","v":20}]
[450,"JEFFERSON COUNTY",{"$f":"School_Listing[[#This Row],[System Code]]","v":450},13,{"$f":"School_Listing[[#This Row],[System Code]]&School_Listing[[#This Row],[School Code]]","v":"45013"},"Jefferson County Adult High School",{"$f":"School_Listing[[#This Row],[School Code]]","v":13}]
[450,"JEFFERSON COUNTY",{"$f":"School_Listing[[#This Row],[System Code]]","v":450},15,{"$f":"School_Listing[[#This Row],[System Code]]&School_Listing[[#This Row],[School Code]]","v":"45015"},"Jefferson Elementary",{"$f":"School_Listing[[#This Row],[School Code]]","v":15}]
[450,"JEFFERSON COUNTY",{"$f":"School_Listing[[#This Row],[System Code]]","v":450},17,{"$f":"School_Listing[[#This Row],[System Code]]&School_Listing[[#This Row],[School Code]]","v":"45017"},"Jefferson Middle School",{"$f":"School_Listing[[#This Row],[School Code]]","v":17}]
[450,"JEFFERSON COUNTY",{"$f":"School_Listing[[#This Row],[System Code]]","v":450},19,{"$f":"School_Listing[[#This Row],[System Code]]&School_Listing[[#This Row],[School Code]]","v":"45019"},"Jefferson Virtual Academy",{"$f":"School_Listing[[#This Row],[School Code]]","v":19}]
[450,"JEFFERSON COUNTY",{"$f":"School_Listing[[#This Row],[System Code]]","v":450},22,{"$f":"School_Listing[[#This Row],[System Code]]&School_Listing[[#This Row],[School Code]]","v":"45022"},"Maury Middle School",{"$f":"School_Listing[[#This Row],[School Code]]","v":22}]
[450,"JEFFERSON COUNTY",{"$f":"School_Listing[[#This Row],[System Code]]","v":450},70,{"$f":"School_Listing[[#This Row],[System Code]]&School_Listing[[#This Row],[School Code]]","v":"45070"},"Mount Horeb Elementary School",{"$f":"School_Listing[[#This Row],[School Code]]","v":70}]
[450,"JEFFERSON COUNTY",{"$f":"School_Listing[[#This Row],[System Code]]","v":450},30,{"$f":"School_Listing[[#This Row],[System Code]]&School_Listing[[#This Row],[School Code]]","v":"45030"},"New Market Elementary",{"$f":"School_Listing[[#This Row],[School Code]]","v":30}]
[450,"JEFFERSON COUNTY",{"$f":"School_Listing[[#This Row],[System Code]]","v":450},35,{"$f":"School_Listing[[#This Row],[System Code]]&School_Listing[[#This Row],[School Code]]","v":"45035"},"Piedmont Elementary",{"$f":"School_Listing[[#This Row],[School Code]]","v":35}]
[450,"JEFFERSON COUNTY",{"$f":"School_Listing[[#This Row],[System Code]]","v":450},40,{"$f":"School_Listing[[#This Row],[System Code]]&School_Listing[[#This Row],[School Code]]","v":"45040"},"Rush Strong Elementary",{"$f":"School_Listing[[#This Row],[School Code]]","v":40}]
[450,"JEFFERSON COUNTY",{"$f":"School_Listing[[#This Row],[System Code]]","v":450},55,{"$f":"School_Listing[[#This Row],[System Code]]&School_Listing[[#This Row],[School Code]]","v":"45055"},"Talbott Elementary",{"$f":"School_Listing[[#This Row],[School Code]]","v":55}]
[450,"JEFFERSON COUNTY",{"$f":"School_Listing[[#This Row],[System Code]]","v":450},60,{"$f":"School_Listing[[#This Row],[System Code]]&School_Listing[[#This Row],[School Code]]","v":"45060"},"White Pine Elementary",{"$f":"School_Listing[[#This Row],[School Code]]","v":60}]
[460,"JOHNSON COUNTY",{"$f":"School_Listing[[#This Row],[System Code]]","v":460},5,{"$f":"School_Listing[[#This Row],[System Code]]&School_Listing[[#This Row],[School Code]]","v":"4605"},"Doe Elementary",{"$f":"School_Listing[[#This Row],[School Code]]","v":5}]
[460,"JOHNSON COUNTY",{"$f":"School_Listing[[#This Row],[System Code]]","v":460},15,{"$f":"School_Listing[[#This Row],[System Code]]&School_Listing[[#This Row],[School Code]]","v":"46015"},"Johnson Co High School",{"$f":"School_Listing[[#This Row],[School Code]]","v":15}]
[460,"JOHNSON COUNTY",{"$f":"School_Listing[[#This Row],[System Code]]","v":460},16,{"$f":"School_Listing[[#This Row],[System Code]]&School_Listing[[#This Row],[School Code]]","v":"46016"},"Johnson Co Middle School",{"$f":"School_Listing[[#This Row],[School Code]]","v":16}]
[460,"JOHNSON COUNTY",{"$f":"School_Listing[[#This Row],[System Code]]","v":460},20,{"$f":"School_Listing[[#This Row],[System Code]]&School_Listing[[#This Row],[School Code]]","v":"46020"},"Laurel Elementary",{"$f":"School_Listing[[#This Row],[School Code]]","v":20}]
[460,"JOHNSON COUNTY",{"$f":"School_Listing[[#This Row],[System Code]]","v":460},25,{"$f":"School_Listing[[#This Row],[System Code]]&School_Listing[[#This Row],[School Code]]","v":"46025"},"Mountain City Elementary",{"$f":"School_Listing[[#This Row],[School Code]]","v":25}]
[460,"JOHNSON COUNTY",{"$f":"School_Listing[[#This Row],[System Code]]","v":460},33,{"$f":"School_Listing[[#This Row],[System Code]]&School_Listing[[#This Row],[School Code]]","v":"46033"},"Roan Creek Elementary",{"$f":"School_Listing[[#This Row],[School Code]]","v":33}]
[460,"JOHNSON COUNTY",{"$f":"School_Listing[[#This Row],[System Code]]","v":460},43,{"$f":"School_Listing[[#This Row],[System Code]]&School_Listing[[#This Row],[School Code]]","v":"46043"},"Tennessee Connections Academy Johnson County 9-12",{"$f":"School_Listing[[#This Row],[School Code]]","v":43}]
[460,"JOHNSON COUNTY",{"$f":"School_Listing[[#This Row],[System Code]]","v":460},42,{"$f":"School_Listing[[#This Row],[System Code]]&School_Listing[[#This Row],[School Code]]","v":"46042"},"Tennessee Connections Academy Johnson County K-8",{"$f":"School_Listing[[#This Row],[School Code]]","v":42}]
[470,"KNOX COUNTY",{"$f":"School_Listing[[#This Row],[System Code]]","v":470},66,{"$f":"School_Listing[[#This Row],[System Code]]&School_Listing[[#This Row],[School Code]]","v":"47066"},"A L Lotts Elementary",{"$f":"School_Listing[[#This Row],[School Code]]","v":66}]
[470,"KNOX COUNTY",{"$f":"School_Listing[[#This Row],[System Code]]","v":470},3,{"$f":"School_Listing[[#This Row],[System Code]]&School_Listing[[#This Row],[School Code]]","v":"4703"},"Adrian Burnett Elementary",{"$f":"School_Listing[[#This Row],[School Code]]","v":3}]
[470,"KNOX COUNTY",{"$f":"School_Listing[[#This Row],[System Code]]","v":470},2,{"$f":"School_Listing[[#This Row],[System Code]]&School_Listing[[#This Row],[School Code]]","v":"4702"},"Amherst Elementary School",{"$f":"School_Listing[[#This Row],[School Code]]","v":2}]
[470,"KNOX COUNTY",{"$f":"School_Listing[[#This Row],[System Code]]","v":470},9,{"$f":"School_Listing[[#This Row],[System Code]]&School_Listing[[#This Row],[School Code]]","v":"4709"},"Austin East High/Magnet",{"$f":"School_Listing[[#This Row],[School Code]]","v":9}]
[470,"KNOX COUNTY",{"$f":"School_Listing[[#This Row],[System Code]]","v":470},10,{"$f":"School_Listing[[#This Row],[System Code]]&School_Listing[[#This Row],[School Code]]","v":"47010"},"Ball Camp Elementary",{"$f":"School_Listing[[#This Row],[School Code]]","v":10}]
[470,"KNOX COUNTY",{"$f":"School_Listing[[#This Row],[System Code]]","v":470},12,{"$f":"School_Listing[[#This Row],[System Code]]&School_Listing[[#This Row],[School Code]]","v":"47012"},"Bearden Elementary",{"$f":"School_Listing[[#This Row],[School Code]]","v":12}]
[470,"KNOX COUNTY",{"$f":"School_Listing[[#This Row],[System Code]]","v":470},17,{"$f":"School_Listing[[#This Row],[System Code]]&School_Listing[[#This Row],[School Code]]","v":"47017"},"Bearden High School",{"$f":"School_Listing[[#This Row],[School Code]]","v":17}]
[470,"KNOX COUNTY",{"$f":"School_Listing[[#This Row],[System Code]]","v":470},14,{"$f":"School_Listing[[#This Row],[System Code]]&School_Listing[[#This Row],[School Code]]","v":"47014"},"Bearden Middle School",{"$f":"School_Listing[[#This Row],[School Code]]","v":14}]
[470,"KNOX COUNTY",{"$f":"School_Listing[[#This Row],[System Code]]","v":470},22,{"$f":"School_Listing[[#This Row],[System Code]]&School_Listing[[#This Row],[School Code]]","v":"47022"},"Beaumont Elementary/Magnet",{"$f":"School_Listing[[#This Row],[School Code]]","v":22}]
[470,"KNOX COUNTY",{"$f":"School_Listing[[#This Row],[System Code]]","v":470},24,{"$f":"School_Listing[[#This Row],[System Code]]&School_Listing[[#This Row],[School Code]]","v":"47024"},"Belle Morris Elementary",{"$f":"School_Listing[[#This Row],[School Code]]","v":24}]
[470,"KNOX COUNTY",{"$f":"School_Listing[[#This Row],[System Code]]","v":470},15,{"$f":"School_Listing[[#This Row],[System Code]]&School_Listing[[#This Row],[School Code]]","v":"47015"},"Blue Grass Elementary",{"$f":"School_Listing[[#This Row],[School Code]]","v":15}]
[470,"KNOX COUNTY",{"$f":"School_Listing[[#This Row],[System Code]]","v":470},20,{"$f":"School_Listing[[#This Row],[System Code]]&School_Listing[[#This Row],[School Code]]","v":"47020"},"Bonny Kate Elementary",{"$f":"School_Listing[[#This Row],[School Code]]","v":20}]
[470,"KNOX COUNTY",{"$f":"School_Listing[[#This Row],[System Code]]","v":470},25,{"$f":"School_Listing[[#This Row],[System Code]]&School_Listing[[#This Row],[School Code]]","v":"47025"},"Brickey McCloud Elementary",{"$f":"School_Listing[[#This Row],[School Code]]","v":25}]
[470,"KNOX COUNTY",{"$f":"School_Listing[[#This Row],[System Code]]","v":470},345,{"$f":"School_Listing[[#This Row],[System Code]]&School_Listing[[#This Row],[School Code]]","v":"470345"},"Career Magnet Academy",{"$f":"School_Listing[[#This Row],[School Code]]","v":345}]
[470,"KNOX COUNTY",{"$f":"School_Listing[[#This Row],[System Code]]","v":470},30,{"$f":"School_Listing[[#This Row],[System Code]]&School_Listing[[#This Row],[School Code]]","v":"47030"},"Carter Elementary",{"$f":"School_Listing[[#This Row],[School Code]]","v":30}]
[470,"KNOX COUNTY",{"$f":"School_Listing[[#This Row],[System Code]]","v":470},35,{"$f":"School_Listing[[#This Row],[System Code]]&School_Listing[[#This Row],[School Code]]","v":"47035"},"Carter High School",{"$f":"School_Listing[[#This Row],[School Code]]","v":35}]
[470,"KNOX COUNTY",{"$f":"School_Listing[[#This Row],[System Code]]","v":470},37,{"$f":"School_Listing[[#This Row],[System Code]]&School_Listing[[#This Row],[School Code]]","v":"47037"},"Carter Middle School",{"$f":"School_Listing[[#This Row],[School Code]]","v":37}]
[470,"KNOX COUNTY",{"$f":"School_Listing[[#This Row],[System Code]]","v":470},40,{"$f":"School_Listing[[#This Row],[System Code]]&School_Listing[[#This Row],[School Code]]","v":"47040"},"Cedar Bluff Elementary",{"$f":"School_Listing[[#This Row],[School Code]]","v":40}]
[470,"KNOX COUNTY",{"$f":"School_Listing[[#This Row],[System Code]]","v":470},45,{"$f":"School_Listing[[#This Row],[System Code]]&School_Listing[[#This Row],[School Code]]","v":"47045"},"Cedar Bluff Middle School",{"$f":"School_Listing[[#This Row],[School Code]]","v":45}]
[470,"KNOX COUNTY",{"$f":"School_Listing[[#This Row],[System Code]]","v":470},47,{"$f":"School_Listing[[#This Row],[System Code]]&School_Listing[[#This Row],[School Code]]","v":"47047"},"Central High School",{"$f":"School_Listing[[#This Row],[School Code]]","v":47}]
[470,"KNOX COUNTY",{"$f":"School_Listing[[#This Row],[System Code]]","v":470},53,{"$f":"School_Listing[[#This Row],[System Code]]&School_Listing[[#This Row],[School Code]]","v":"47053"},"Chilhowee Intermediate",{"$f":"School_Listing[[#This Row],[School Code]]","v":53}]
[470,"KNOX COUNTY",{"$f":"School_Listing[[#This Row],[System Code]]","v":470},61,{"$f":"School_Listing[[#This Row],[System Code]]&School_Listing[[#This Row],[School Code]]","v":"47061"},"Christenberry Elementary",{"$f":"School_Listing[[#This Row],[School Code]]","v":61}]
[470,"KNOX COUNTY",{"$f":"School_Listing[[#This Row],[System Code]]","v":470},51,{"$f":"School_Listing[[#This Row],[System Code]]&School_Listing[[#This Row],[School Code]]","v":"47051"},"Copper Ridge Elementary",{"$f":"School_Listing[[#This Row],[School Code]]","v":51}]
[470,"KNOX COUNTY",{"$f":"School_Listing[[#This Row],[System Code]]","v":470},55,{"$f":"School_Listing[[#This Row],[System Code]]&School_Listing[[#This Row],[School Code]]","v":"47055"},"Corryton Elementary",{"$f":"School_Listing[[#This Row],[School Code]]","v":55}]
[470,"KNOX COUNTY",{"$f":"School_Listing[[#This Row],[System Code]]","v":470},59,{"$f":"School_Listing[[#This Row],[System Code]]&School_Listing[[#This Row],[School Code]]","v":"47059"},"Dogwood Elementary",{"$f":"School_Listing[[#This Row],[School Code]]","v":59}]
[470,"KNOX COUNTY",{"$f":"School_Listing[[#This Row],[System Code]]","v":470},332,{"$f":"School_Listing[[#This Row],[System Code]]&School_Listing[[#This Row],[School Code]]","v":"470332"},"Dr. Paul L. Kelley Volunteer Academy",{"$f":"School_Listing[[#This Row],[School Code]]","v":332}]
[470,"KNOX COUNTY",{"$f":"School_Listing[[#This Row],[System Code]]","v":470},68,{"$f":"School_Listing[[#This Row],[System Code]]&School_Listing[[#This Row],[School Code]]","v":"47068"},"East Knox Elementary",{"$f":"School_Listing[[#This Row],[School Code]]","v":68}]
[470,"KNOX COUNTY",{"$f":"School_Listing[[#This Row],[System Code]]","v":470},8001,{"$f":"School_Listing[[#This Row],[System Code]]&School_Listing[[#This Row],[School Code]]","v":"4708001"},"Emerald Academy",{"$f":"School_Listing[[#This Row],[School Code]]","v":8001}]
[470,"KNOX COUNTY",{"$f":"School_Listing[[#This Row],[System Code]]","v":470},77,{"$f":"School_Listing[[#This Row],[System Code]]&School_Listing[[#This Row],[School Code]]","v":"47077"},"Fair Garden Family/Community Center",{"$f":"School_Listing[[#This Row],[School Code]]","v":77}]
[470,"KNOX COUNTY",{"$f":"School_Listing[[#This Row],[System Code]]","v":470},80,{"$f":"School_Listing[[#This Row],[System Code]]&School_Listing[[#This Row],[School Code]]","v":"47080"},"Farragut High School",{"$f":"School_Listing[[#This Row],[School Code]]","v":80}]
[470,"KNOX COUNTY",{"$f":"School_Listing[[#This Row],[System Code]]","v":470},72,{"$f":"School_Listing[[#This Row],[System Code]]&School_Listing[[#This Row],[School Code]]","v":"47072"},"Farragut Intermediate",{"$f":"School_Listing[[#This Row],[School Code]]","v":72}]
[470,"KNOX COUNTY",{"$f":"School_Listing[[#This Row],[System Code]]","v":470},75,{"$f":"School_Listing[[#This Row],[System Code]]&School_Listing[[#This Row],[School Code]]","v":"47075"},"Farragut Middle School",{"$f":"School_Listing[[#This Row],[School Code]]","v":75}]
[470,"KNOX COUNTY",{"$f":"School_Listing[[#This Row],[System Code]]","v":470},83,{"$f":"School_Listing[[#This Row],[System Code]]&School_Listing[[#This Row],[School Code]]","v":"47083"},"Farragut Primary",{"$f":"School_Listing[[#This Row],[School Code]]","v":83}]
[470,"KNOX COUNTY",{"$f":"School_Listing[[#This Row],[System Code]]","v":470},87,{"$f":"School_Listing[[#This Row],[System Code]]&School_Listing[[#This Row],[School Code]]","v":"47087"},"Fountain City Elementary",{"$f":"School_Listing[[#This Row],[School Code]]","v":87}]
[470,"KNOX COUNTY",{"$f":"School_Listing[[#This Row],[System Code]]","v":470},225,{"$f":"School_Listing[[#This Row],[System Code]]&School_Listing[[#This Row],[School Code]]","v":"470225"},"Ft Sanders Education Development Center",{"$f":"School_Listing[[#This Row],[School Code]]","v":225}]
[470,"KNOX COUNTY",{"$f":"School_Listing[[#This Row],[System Code]]","v":470},90,{"$f":"School_Listing[[#This Row],[System Code]]&School_Listing[[#This Row],[School Code]]","v":"47090"},"Fulton High School",{"$f":"School_Listing[[#This Row],[School Code]]","v":90}]
[470,"KNOX COUNTY",{"$f":"School_Listing[[#This Row],[System Code]]","v":470},85,{"$f":"School_Listing[[#This Row],[System Code]]&School_Listing[[#This Row],[School Code]]","v":"47085"},"Gap Creek Elementary",{"$f":"School_Listing[[#This Row],[School Code]]","v":85}]
[470,"KNOX COUNTY",{"$f":"School_Listing[[#This Row],[System Code]]","v":470},95,{"$f":"School_Listing[[#This Row],[System Code]]&School_Listing[[#This Row],[School Code]]","v":"47095"},"Gibbs Elementary",{"$f":"School_Listing[[#This Row],[School Code]]","v":95}]
[470,"KNOX COUNTY",{"$f":"School_Listing[[#This Row],[System Code]]","v":470},100,{"$f":"School_Listing[[#This Row],[System Code]]&School_Listing[[#This Row],[School Code]]","v":"470100"},"Gibbs High School",{"$f":"School_Listing[[#This Row],[School Code]]","v":100}]
[470,"KNOX COUNTY",{"$f":"School_Listing[[#This Row],[System Code]]","v":470},350,{"$f":"School_Listing[[#This Row],[System Code]]&School_Listing[[#This Row],[School Code]]","v":"470350"},"Gibbs Middle School",{"$f":"School_Listing[[#This Row],[School Code]]","v":350}]
[470,"KNOX COUNTY",{"$f":"School_Listing[[#This Row],[System Code]]","v":470},112,{"$f":"School_Listing[[#This Row],[System Code]]&School_Listing[[#This Row],[School Code]]","v":"470112"},"Green Magnet Math And Science Academy",{"$f":"School_Listing[[#This Row],[School Code]]","v":112}]
[470,"KNOX COUNTY",{"$f":"School_Listing[[#This Row],[System Code]]","v":470},117,{"$f":"School_Listing[[#This Row],[System Code]]&School_Listing[[#This Row],[School Code]]","v":"470117"},"Gresham Middle School",{"$f":"School_Listing[[#This Row],[School Code]]","v":117}]
[470,"KNOX COUNTY",{"$f":"School_Listing[[#This Row],[System Code]]","v":470},110,{"$f":"School_Listing[[#This Row],[System Code]]&School_Listing[[#This Row],[School Code]]","v":"470110"},"Halls Elementary",{"$f":"School_Listing[[#This Row],[School Code]]","v":110}]
[470,"KNOX COUNTY",{"$f":"School_Listing[[#This Row],[System Code]]","v":470},115,{"$f":"School_Listing[[#This Row],[System Code]]&School_Listing[[#This Row],[School Code]]","v":"470115"},"Halls High School",{"$f":"School_Listing[[#This Row],[School Code]]","v":115}]
[470,"KNOX COUNTY",{"$f":"School_Listing[[#This Row],[System Code]]","v":470},120,{"$f":"School_Listing[[#This Row],[System Code]]&School_Listing[[#This Row],[School Code]]","v":"470120"},"Halls Middle School",{"$f":"School_Listing[[#This Row],[School Code]]","v":120}]
[470,"KNOX COUNTY",{"$f":"School_Listing[[#This Row],[System Code]]","v":470},126,{"$f":"School_Listing[[#This Row],[System Code]]&School_Listing[[#This Row],[School Code]]","v":"470126"},"Hardin Valley Academy",{"$f":"School_Listing[[#This Row],[School Code]]","v":126}]
[470,"KNOX COUNTY",{"$f":"School_Listing[[#This Row],[System Code]]","v":470},124,{"$f":"School_Listing[[#This Row],[System Code]]&School_Listing[[#This Row],[School Code]]","v":"470124"},"Hardin Valley Elementary",{"$f":"School_Listing[[#This Row],[School Code]]","v":124}]
[470,"KNOX COUNTY",{"$f":"School_Listing[[#This Row],[System Code]]","v":470},355,{"$f":"School_Listing[[#This Row],[System Code]]&School_Listing[[#This Row],[School Code]]","v":"470355"},"Hardin Valley Middle School",{"$f":"School_Listing[[#This Row],[School Code]]","v":355}]
[470,"KNOX COUNTY",{"$f":"School_Listing[[#This Row],[System Code]]","v":470},122,{"$f":"School_Listing[[#This Row],[System Code]]&School_Listing[[#This Row],[School Code]]","v":"470122"},"Holston Middle School",{"$f":"School_Listing[[#This Row],[School Code]]","v":122}]
[470,"KNOX COUNTY",{"$f":"School_Listing[[#This Row],[System Code]]","v":470},138,{"$f":"School_Listing[[#This Row],[System Code]]&School_Listing[[#This Row],[School Code]]","v":"470138"},"Inskip Elementary",{"$f":"School_Listing[[#This Row],[School Code]]","v":138}]
[470,"KNOX COUNTY",{"$f":"School_Listing[[#This Row],[System Code]]","v":470},145,{"$f":"School_Listing[[#This Row],[System Code]]&School_Listing[[#This Row],[School Code]]","v":"470145"},"Karns Elementary",{"$f":"School_Listing[[#This Row],[School Code]]","v":145}]
[470,"KNOX COUNTY",{"$f":"School_Listing[[#This Row],[System Code]]","v":470},150,{"$f":"School_Listing[[#This Row],[System Code]]&School_Listing[[#This Row],[School Code]]","v":"470150"},"Karns High School",{"$f":"School_Listing[[#This Row],[School Code]]","v":150}]
[470,"KNOX COUNTY",{"$f":"School_Listing[[#This Row],[System Code]]","v":470},147,{"$f":"School_Listing[[#This Row],[System Code]]&School_Listing[[#This Row],[School Code]]","v":"470147"},"Karns Middle School",{"$f":"School_Listing[[#This Row],[School Code]]","v":147}]
[470,"KNOX COUNTY",{"$f":"School_Listing[[#This Row],[System Code]]","v":470},148,{"$f":"School_Listing[[#This Row],[System Code]]&School_Listing[[#This Row],[School Code]]","v":"470148"},"KCS Virtual Elementary School",{"$f":"School_Listing[[#This Row],[School Code]]","v":148}]
[470,"KNOX COUNTY",{"$f":"School_Listing[[#This Row],[System Code]]","v":470},146,{"$f":"School_Listing[[#This Row],[System Code]]&School_Listing[[#This Row],[School Code]]","v":"470146"},"KCS Virtual High School",{"$f":"School_Listing[[#This Row],[School Code]]","v":146}]
[470,"KNOX COUNTY",{"$f":"School_Listing[[#This Row],[System Code]]","v":470},149,{"$f":"School_Listing[[#This Row],[System Code]]&School_Listing[[#This Row],[School Code]]","v":"470149"},"KCS Virtual Middle School",{"$f":"School_Listing[[#This Row],[School Code]]","v":149}]
[470,"KNOX COUNTY",{"$f":"School_Listing[[#This Row],[System Code]]","v":470},158,{"$f":"School_Listing[[#This Row],[System Code]]&School_Listing[[#This Row],[School Code]]","v":"470158"},"Knox Adaptive Education Center",{"$f":"School_Listing[[#This Row],[School Code]]","v":158}]
[470,"KNOX COUNTY",{"$f":"School_Listing[[#This Row],[System Code]]","v":470},334,{"$f":"School_Listing[[#This Row],[System Code]]&School_Listing[[#This Row],[School Code]]","v":"470334"},"L N STEM Academy",{"$f":"School_Listing[[#This Row],[School Code]]","v":334}]
[470,"KNOX COUNTY",{"$f":"School_Listing[[#This Row],[System Code]]","v":470},159,{"$f":"School_Listing[[#This Row],[System Code]]&School_Listing[[#This Row],[School Code]]","v":"470159"},"Lincoln Park Technology and Trade Center",{"$f":"School_Listing[[#This Row],[School Code]]","v":159}]
[470,"KNOX COUNTY",{"$f":"School_Listing[[#This Row],[System Code]]","v":470},165,{"$f":"School_Listing[[#This Row],[System Code]]&School_Listing[[#This Row],[School Code]]","v":"470165"},"Lonsdale Elementary",{"$f":"School_Listing[[#This Row],[School Code]]","v":165}]
[470,"KNOX COUNTY",{"$f":"School_Listing[[#This Row],[System Code]]","v":470},168,{"$f":"School_Listing[[#This Row],[System Code]]&School_Listing[[#This Row],[School Code]]","v":"470168"},"Maynard Elementary",{"$f":"School_Listing[[#This Row],[School Code]]","v":168}]
[470,"KNOX COUNTY",{"$f":"School_Listing[[#This Row],[System Code]]","v":470},7001,{"$f":"School_Listing[[#This Row],[System Code]]&School_Listing[[#This Row],[School Code]]","v":"4707001"},"Montgomery Village Child Development Center, Inc.",{"$f":"School_Listing[[#This Row],[School Code]]","v":7001}]
[470,"KNOX COUNTY",{"$f":"School_Listing[[#This Row],[System Code]]","v":470},172,{"$f":"School_Listing[[#This Row],[System Code]]&School_Listing[[#This Row],[School Code]]","v":"470172"},"Mooreland Heights Elementary",{"$f":"School_Listing[[#This Row],[School Code]]","v":172}]
[470,"KNOX COUNTY",{"$f":"School_Listing[[#This Row],[System Code]]","v":470},170,{"$f":"School_Listing[[#This Row],[System Code]]&School_Listing[[#This Row],[School Code]]","v":"470170"},"Mt Olive Elementary",{"$f":"School_Listing[[#This Row],[School Code]]","v":170}]
[470,"KNOX COUNTY",{"$f":"School_Listing[[#This Row],[System Code]]","v":470},175,{"$f":"School_Listing[[#This Row],[System Code]]&School_Listing[[#This Row],[School Code]]","v":"470175"},"New Hopewell Elementary",{"$f":"School_Listing[[#This Row],[School Code]]","v":175}]
[470,"KNOX COUNTY",{"$f":"School_Listing[[#This Row],[System Code]]","v":470},336,{"$f":"School_Listing[[#This Row],[System Code]]&School_Listing[[#This Row],[School Code]]","v":"470336"},"Northshore Elementary School",{"$f":"School_Listing[[#This Row],[School Code]]","v":336}]
[470,"KNOX COUNTY",{"$f":"School_Listing[[#This Row],[System Code]]","v":470},187,{"$f":"School_Listing[[#This Row],[System Code]]&School_Listing[[#This Row],[School Code]]","v":"470187"},"Northwest Middle School",{"$f":"School_Listing[[#This Row],[School Code]]","v":187}]
[470,"KNOX COUNTY",{"$f":"School_Listing[[#This Row],[System Code]]","v":470},177,{"$f":"School_Listing[[#This Row],[System Code]]&School_Listing[[#This Row],[School Code]]","v":"470177"},"Norwood Elementary",{"$f":"School_Listing[[#This Row],[School Code]]","v":177}]
[470,"KNOX COUNTY",{"$f":"School_Listing[[#This Row],[System Code]]","v":470},202,{"$f":"School_Listing[[#This Row],[System Code]]&School_Listing[[#This Row],[School Code]]","v":"470202"},"Pleasant Ridge Elementary",{"$f":"School_Listing[[#This Row],[School Code]]","v":202}]
[470,"KNOX COUNTY",{"$f":"School_Listing[[#This Row],[System Code]]","v":470},207,{"$f":"School_Listing[[#This Row],[System Code]]&School_Listing[[#This Row],[School Code]]","v":"470207"},"Pond Gap Elementary",{"$f":"School_Listing[[#This Row],[School Code]]","v":207}]
[470,"KNOX COUNTY",{"$f":"School_Listing[[#This Row],[System Code]]","v":470},180,{"$f":"School_Listing[[#This Row],[System Code]]&School_Listing[[#This Row],[School Code]]","v":"470180"},"Powell Elementary",{"$f":"School_Listing[[#This Row],[School Code]]","v":180}]
[470,"KNOX COUNTY",{"$f":"School_Listing[[#This Row],[System Code]]","v":470},185,{"$f":"School_Listing[[#This Row],[System Code]]&School_Listing[[#This Row],[School Code]]","v":"470185"},"Powell High School",{"$f":"School_Listing[[#This Row],[School Code]]","v":185}]
[470,"KNOX COUNTY",{"$f":"School_Listing[[#This Row],[System Code]]","v":470},182,{"$f":"School_Listing[[#This Row],[System Code]]&School_Listing[[#This Row],[School Code]]","v":"470182"},"Powell Middle School",{"$f":"School_Listing[[#This Row],[School Code]]","v":182}]
[470,"KNOX COUNTY",{"$f":"School_Listing[[#This Row],[System Code]]","v":470},8,{"$f":"School_Listing[[#This Row],[System Code]]&School_Listing[[#This Row],[School Code]]","v":"4708"},"Richard Yoakley School",{"$f":"School_Listing[[#This Row],[School Code]]","v":8}]
[470,"KNOX COUNTY",{"$f":"School_Listing[[#This Row],[System Code]]","v":470},212,{"$f":"School_Listing[[#This Row],[System Code]]&School_Listing[[#This Row],[School Code]]","v":"470212"},"Ridgedale Alternative School",{"$f":"School_Listing[[#This Row],[School Code]]","v":212}]
[470,"KNOX COUNTY",{"$f":"School_Listing[[#This Row],[System Code]]","v":470},195,{"$f":"School_Listing[[#This Row],[System Code]]&School_Listing[[#This Row],[School Code]]","v":"470195"},"Ritta Elementary",{"$f":"School_Listing[[#This Row],[School Code]]","v":195}]
[470,"KNOX COUNTY",{"$f":"School_Listing[[#This Row],[System Code]]","v":470},235,{"$f":"School_Listing[[#This Row],[System Code]]&School_Listing[[#This Row],[School Code]]","v":"470235"},"Rocky Hill Elementary",{"$f":"School_Listing[[#This Row],[School Code]]","v":235}]
[470,"KNOX COUNTY",{"$f":"School_Listing[[#This Row],[System Code]]","v":470},245,{"$f":"School_Listing[[#This Row],[System Code]]&School_Listing[[#This Row],[School Code]]","v":"470245"},"Sam E. Hill Primary School",{"$f":"School_Listing[[#This Row],[School Code]]","v":245}]
[470,"KNOX COUNTY",{"$f":"School_Listing[[#This Row],[System Code]]","v":470},250,{"$f":"School_Listing[[#This Row],[System Code]]&School_Listing[[#This Row],[School Code]]","v":"470250"},"Sarah Moore Greene Magnet Technology Academy",{"$f":"School_Listing[[#This Row],[School Code]]","v":250}]
[470,"KNOX COUNTY",{"$f":"School_Listing[[#This Row],[System Code]]","v":470},255,{"$f":"School_Listing[[#This Row],[System Code]]&School_Listing[[#This Row],[School Code]]","v":"470255"},"Sequoyah Elementary",{"$f":"School_Listing[[#This Row],[School Code]]","v":255}]
[470,"KNOX COUNTY",{"$f":"School_Listing[[#This Row],[System Code]]","v":470},260,{"$f":"School_Listing[[#This Row],[System Code]]&School_Listing[[#This Row],[School Code]]","v":"470260"},"Shannondale Elementary",{"$f":"School_Listing[[#This Row],[School Code]]","v":260}]
[470,"KNOX COUNTY",{"$f":"School_Listing[[#This Row],[System Code]]","v":470},65,{"$f":"School_Listing[[#This Row],[System Code]]&School_Listing[[#This Row],[School Code]]","v":"47065"},"South Doyle High School",{"$f":"School_Listing[[#This Row],[School Code]]","v":65}]
[470,"KNOX COUNTY",{"$f":"School_Listing[[#This Row],[System Code]]","v":470},67,{"$f":"School_Listing[[#This Row],[System Code]]&School_Listing[[#This Row],[School Code]]","v":"47067"},"South Doyle Middle School",{"$f":"School_Listing[[#This Row],[School Code]]","v":67}]
[470,"KNOX COUNTY",{"$f":"School_Listing[[#This Row],[System Code]]","v":470},265,{"$f":"School_Listing[[#This Row],[System Code]]&School_Listing[[#This Row],[School Code]]","v":"470265"},"South Knox Elementary",{"$f":"School_Listing[[#This Row],[School Code]]","v":265}]
[470,"KNOX COUNTY",{"$f":"School_Listing[[#This Row],[System Code]]","v":470},280,{"$f":"School_Listing[[#This Row],[System Code]]&School_Listing[[#This Row],[School Code]]","v":"470280"},"Spring Hill Elementary",{"$f":"School_Listing[[#This Row],[School Code]]","v":280}]
[470,"KNOX COUNTY",{"$f":"School_Listing[[#This Row],[System Code]]","v":470},285,{"$f":"School_Listing[[#This Row],[System Code]]&School_Listing[[#This Row],[School Code]]","v":"470285"},"Sterchi Elementary",{"$f":"School_Listing[[#This Row],[School Code]]","v":285}]
[470,"KNOX COUNTY",{"$f":"School_Listing[[#This Row],[System Code]]","v":470},210,{"$f":"School_Listing[[#This Row],[System Code]]&School_Listing[[#This Row],[School Code]]","v":"470210"},"Sunnyview Primary",{"$f":"School_Listing[[#This Row],[School Code]]","v":210}]
[470,"KNOX COUNTY",{"$f":"School_Listing[[#This Row],[System Code]]","v":470},295,{"$f":"School_Listing[[#This Row],[System Code]]&School_Listing[[#This Row],[School Code]]","v":"470295"},"Vine Middle/Magnet",{"$f":"School_Listing[[#This Row],[School Code]]","v":295}]
[470,"KNOX COUNTY",{"$f":"School_Listing[[#This Row],[System Code]]","v":470},300,{"$f":"School_Listing[[#This Row],[System Code]]&School_Listing[[#This Row],[School Code]]","v":"470300"},"West Haven Elementary",{"$f":"School_Listing[[#This Row],[School Code]]","v":300}]
[470,"KNOX COUNTY",{"$f":"School_Listing[[#This Row],[System Code]]","v":470},305,{"$f":"School_Listing[[#This Row],[System Code]]&School_Listing[[#This Row],[School Code]]","v":"470305"},"West High School",{"$f":"School_Listing[[#This Row],[School Code]]","v":305}]
[470,"KNOX COUNTY",{"$f":"School_Listing[[#This Row],[System Code]]","v":470},310,{"$f":"School_Listing[[#This Row],[System Code]]&School_Listing[[#This Row],[School Code]]","v":"470310"},"West Hills Elementary",{"$f":"School_Listing[[#This Row],[School Code]]","v":310}]
[470,"KNOX COUNTY",{"$f":"School_Listing[[#This Row],[System Code]]","v":470},313,{"$f":"School_Listing[[#This Row],[System Code]]&School_Listing[[#This Row],[School Code]]","v":"470313"},"West Valley Middle School",{"$f":"School_Listing[[#This Row],[School Code]]","v":313}]
[470,"KNOX COUNTY",{"$f":"School_Listing[[#This Row],[System Code]]","v":470},315,{"$f":"School_Listing[[#This Row],[System Code]]&School_Listing[[#This Row],[School Code]]","v":"470315"},"West View Elementary",{"$f":"School_Listing[[#This Row],[School Code]]","v":315}]
[470,"KNOX COUNTY",{"$f":"School_Listing[[#This Row],[System Code]]","v":470},320,{"$f":"School_Listing[[#This Row],[System Code]]&School_Listing[[#This Row],[School Code]]","v":"470320"},"Whittle Springs Middle School",{"$f":"School_Listing[[#This Row],[School Code]]","v":320}]
[480,"LAKE COUNTY",{"$f":"School_Listing[[#This Row],[System Code]]","v":480},5,{"$f":"School_Listing[[#This Row],[System Code]]&School_Listing[[#This Row],[School Code]]","v":"4805"},"Lake Co High School",{"$f":"School_Listing[[#This Row],[School Code]]","v":5}]
[480,"LAKE COUNTY",{"$f":"School_Listing[[#This Row],[System Code]]","v":480},10,{"$f":"School_Listing[[#This Row],[System Code]]&School_Listing[[#This Row],[School Code]]","v":"48010"},"Lara Kendall Elementary",{"$f":"School_Listing[[#This Row],[School Code]]","v":10}]
[480,"LAKE COUNTY",{"$f":"School_Listing[[#This Row],[System Code]]","v":480},15,{"$f":"School_Listing[[#This Row],[System Code]]&School_Listing[[#This Row],[School Code]]","v":"48015"},"Margaret Newton Elementary",{"$f":"School_Listing[[#This Row],[School Code]]","v":15}]
[490,"LAUDERDALE COUNTY",{"$f":"School_Listing[[#This Row],[System Code]]","v":490},20,{"$f":"School_Listing[[#This Row],[System Code]]&School_Listing[[#This Row],[School Code]]","v":"49020"},"Halls Elementary School",{"$f":"School_Listing[[#This Row],[School Code]]","v":20}]
[490,"LAUDERDALE COUNTY",{"$f":"School_Listing[[#This Row],[System Code]]","v":490},23,{"$f":"School_Listing[[#This Row],[System Code]]&School_Listing[[#This Row],[School Code]]","v":"49023"},"Halls High School",{"$f":"School_Listing[[#This Row],[School Code]]","v":23}]
[490,"LAUDERDALE COUNTY",{"$f":"School_Listing[[#This Row],[System Code]]","v":490},24,{"$f":"School_Listing[[#This Row],[System Code]]&School_Listing[[#This Row],[School Code]]","v":"49024"},"Halls Junior High School",{"$f":"School_Listing[[#This Row],[School Code]]","v":24}]
[490,"LAUDERDALE COUNTY",{"$f":"School_Listing[[#This Row],[System Code]]","v":490},55,{"$f":"School_Listing[[#This Row],[System Code]]&School_Listing[[#This Row],[School Code]]","v":"49055"},"Ripley Elementary",{"$f":"School_Listing[[#This Row],[School Code]]","v":55}]
[490,"LAUDERDALE COUNTY",{"$f":"School_Listing[[#This Row],[System Code]]","v":490},40,{"$f":"School_Listing[[#This Row],[System Code]]&School_Listing[[#This Row],[School Code]]","v":"49040"},"Ripley High School",{"$f":"School_Listing[[#This Row],[School Code]]","v":40}]
[490,"LAUDERDALE COUNTY",{"$f":"School_Listing[[#This Row],[System Code]]","v":490},25,{"$f":"School_Listing[[#This Row],[System Code]]&School_Listing[[#This Row],[School Code]]","v":"49025"},"Ripley Middle School",{"$f":"School_Listing[[#This Row],[School Code]]","v":25}]
[490,"LAUDERDALE COUNTY",{"$f":"School_Listing[[#This Row],[System Code]]","v":490},50,{"$f":"School_Listing[[#This Row],[System Code]]&School_Listing[[#This Row],[School Code]]","v":"49050"},"Ripley Primary",{"$f":"School_Listing[[#This Row],[School Code]]","v":50}]
[500,"LAWRENCE COUNTY",{"$f":"School_Listing[[#This Row],[System Code]]","v":500},15,{"$f":"School_Listing[[#This Row],[System Code]]&School_Listing[[#This Row],[School Code]]","v":"50015"},"David Crockett Elementary",{"$f":"School_Listing[[#This Row],[School Code]]","v":15}]
[500,"LAWRENCE COUNTY",{"$f":"School_Listing[[#This Row],[System Code]]","v":500},13,{"$f":"School_Listing[[#This Row],[System Code]]&School_Listing[[#This Row],[School Code]]","v":"50013"},"E O Coffman Middle School",{"$f":"School_Listing[[#This Row],[School Code]]","v":13}]
[500,"LAWRENCE COUNTY",{"$f":"School_Listing[[#This Row],[System Code]]","v":500},20,{"$f":"School_Listing[[#This Row],[System Code]]&School_Listing[[#This Row],[School Code]]","v":"50020"},"Ethridge Elementary",{"$f":"School_Listing[[#This Row],[School Code]]","v":20}]
[500,"LAWRENCE COUNTY",{"$f":"School_Listing[[#This Row],[System Code]]","v":500},30,{"$f":"School_Listing[[#This Row],[System Code]]&School_Listing[[#This Row],[School Code]]","v":"50030"},"Ingram Sowell Elementary",{"$f":"School_Listing[[#This Row],[School Code]]","v":30}]
[500,"LAWRENCE COUNTY",{"$f":"School_Listing[[#This Row],[System Code]]","v":500},40,{"$f":"School_Listing[[#This Row],[System Code]]&School_Listing[[#This Row],[School Code]]","v":"50040"},"Lawrence Co High School",{"$f":"School_Listing[[#This Row],[School Code]]","v":40}]
[500,"LAWRENCE COUNTY",{"$f":"School_Listing[[#This Row],[System Code]]","v":500},36,{"$f":"School_Listing[[#This Row],[System Code]]&School_Listing[[#This Row],[School Code]]","v":"50036"},"Lawrence County Adult High School",{"$f":"School_Listing[[#This Row],[School Code]]","v":36}]
[500,"LAWRENCE COUNTY",{"$f":"School_Listing[[#This Row],[System Code]]","v":500},45,{"$f":"School_Listing[[#This Row],[System Code]]&School_Listing[[#This Row],[School Code]]","v":"50045"},"Lawrenceburg Public",{"$f":"School_Listing[[#This Row],[School Code]]","v":45}]
[500,"LAWRENCE COUNTY",{"$f":"School_Listing[[#This Row],[System Code]]","v":500},50,{"$f":"School_Listing[[#This Row],[System Code]]&School_Listing[[#This Row],[School Code]]","v":"50050"},"Leoma Elementary",{"$f":"School_Listing[[#This Row],[School Code]]","v":50}]
[500,"LAWRENCE COUNTY",{"$f":"School_Listing[[#This Row],[System Code]]","v":500},65,{"$f":"School_Listing[[#This Row],[System Code]]&School_Listing[[#This Row],[School Code]]","v":"50065"},"Loretto High School",{"$f":"School_Listing[[#This Row],[School Code]]","v":65}]
[500,"LAWRENCE COUNTY",{"$f":"School_Listing[[#This Row],[System Code]]","v":500},70,{"$f":"School_Listing[[#This Row],[System Code]]&School_Listing[[#This Row],[School Code]]","v":"50070"},"New Prospect Elementary",{"$f":"School_Listing[[#This Row],[School Code]]","v":70}]
[500,"LAWRENCE COUNTY",{"$f":"School_Listing[[#This Row],[System Code]]","v":500},77,{"$f":"School_Listing[[#This Row],[System Code]]&School_Listing[[#This Row],[School Code]]","v":"50077"},"Pioneer Virtual Academy",{"$f":"School_Listing[[#This Row],[School Code]]","v":77}]
[500,"LAWRENCE COUNTY",{"$f":"School_Listing[[#This Row],[System Code]]","v":500},60,{"$f":"School_Listing[[#This Row],[System Code]]&School_Listing[[#This Row],[School Code]]","v":"50060"},"South Lawrence Elementary",{"$f":"School_Listing[[#This Row],[School Code]]","v":60}]
[500,"LAWRENCE COUNTY",{"$f":"School_Listing[[#This Row],[System Code]]","v":500},90,{"$f":"School_Listing[[#This Row],[System Code]]&School_Listing[[#This Row],[School Code]]","v":"50090"},"Summertown Elementary",{"$f":"School_Listing[[#This Row],[School Code]]","v":90}]
[500,"LAWRENCE COUNTY",{"$f":"School_Listing[[#This Row],[System Code]]","v":500},95,{"$f":"School_Listing[[#This Row],[System Code]]&School_Listing[[#This Row],[School Code]]","v":"50095"},"Summertown High School",{"$f":"School_Listing[[#This Row],[School Code]]","v":95}]
[510,"LEWIS COUNTY",{"$f":"School_Listing[[#This Row],[System Code]]","v":510},10,{"$f":"School_Listing[[#This Row],[System Code]]&School_Listing[[#This Row],[School Code]]","v":"51010"},"Lewis Co High School",{"$f":"School_Listing[[#This Row],[School Code]]","v":10}]
[510,"LEWIS COUNTY",{"$f":"School_Listing[[#This Row],[System Code]]","v":510},7,{"$f":"School_Listing[[#This Row],[System Code]]&School_Listing[[#This Row],[School Code]]","v":"5107"},"Lewis County Elementary",{"$f":"School_Listing[[#This Row],[School Code]]","v":7}]
[510,"LEWIS COUNTY",{"$f":"School_Listing[[#This Row],[System Code]]","v":510},20,{"$f":"School_Listing[[#This Row],[System Code]]&School_Listing[[#This Row],[School Code]]","v":"51020"},"Lewis County Intermediate School",{"$f":"School_Listing[[#This Row],[School Code]]","v":20}]
[510,"LEWIS COUNTY",{"$f":"School_Listing[[#This Row],[System Code]]","v":510},3,{"$f":"School_Listing[[#This Row],[System Code]]&School_Listing[[#This Row],[School Code]]","v":"5103"},"Lewis County Middle School",{"$f":"School_Listing[[#This Row],[School Code]]","v":3}]
[520,"LINCOLN COUNTY",{"$f":"School_Listing[[#This Row],[System Code]]","v":520},12,{"$f":"School_Listing[[#This Row],[System Code]]&School_Listing[[#This Row],[School Code]]","v":"52012"},"Blanche School",{"$f":"School_Listing[[#This Row],[School Code]]","v":12}]
[520,"LINCOLN COUNTY",{"$f":"School_Listing[[#This Row],[System Code]]","v":520},45,{"$f":"School_Listing[[#This Row],[System Code]]&School_Listing[[#This Row],[School Code]]","v":"52045"},"Flintville School",{"$f":"School_Listing[[#This Row],[School Code]]","v":45}]
[520,"LINCOLN COUNTY",{"$f":"School_Listing[[#This Row],[System Code]]","v":520},50,{"$f":"School_Listing[[#This Row],[System Code]]&School_Listing[[#This Row],[School Code]]","v":"52050"},"Highland Rim School",{"$f":"School_Listing[[#This Row],[School Code]]","v":50}]
[520,"LINCOLN COUNTY",{"$f":"School_Listing[[#This Row],[System Code]]","v":520},95,{"$f":"School_Listing[[#This Row],[System Code]]&School_Listing[[#This Row],[School Code]]","v":"52095"},"Lincoln Central Academy",{"$f":"School_Listing[[#This Row],[School Code]]","v":95}]
[520,"LINCOLN COUNTY",{"$f":"School_Listing[[#This Row],[System Code]]","v":520},97,{"$f":"School_Listing[[#This Row],[System Code]]&School_Listing[[#This Row],[School Code]]","v":"52097"},"Lincoln Central Virtual Academy",{"$f":"School_Listing[[#This Row],[School Code]]","v":97}]
[520,"LINCOLN COUNTY",{"$f":"School_Listing[[#This Row],[System Code]]","v":520},56,{"$f":"School_Listing[[#This Row],[System Code]]&School_Listing[[#This Row],[School Code]]","v":"52056"},"Lincoln County High School",{"$f":"School_Listing[[#This Row],[School Code]]","v":56}]
[520,"LINCOLN COUNTY",{"$f":"School_Listing[[#This Row],[System Code]]","v":520},82,{"$f":"School_Listing[[#This Row],[System Code]]&School_Listing[[#This Row],[School Code]]","v":"52082"},"South Lincoln School",{"$f":"School_Listing[[#This Row],[School Code]]","v":82}]
[520,"LINCOLN COUNTY",{"$f":"School_Listing[[#This Row],[System Code]]","v":520},90,{"$f":"School_Listing[[#This Row],[System Code]]&School_Listing[[#This Row],[School Code]]","v":"52090"},"Unity School",{"$f":"School_Listing[[#This Row],[School Code]]","v":90}]
[521,"FAYETTEVILLE",{"$f":"School_Listing[[#This Row],[System Code]]","v":521},10,{"$f":"School_Listing[[#This Row],[System Code]]&School_Listing[[#This Row],[School Code]]","v":"52110"},"Fayetteville High School",{"$f":"School_Listing[[#This Row],[School Code]]","v":10}]
[521,"FAYETTEVILLE",{"$f":"School_Listing[[#This Row],[System Code]]","v":521},7,{"$f":"School_Listing[[#This Row],[System Code]]&School_Listing[[#This Row],[School Code]]","v":"5217"},"Fayetteville Middle School",{"$f":"School_Listing[[#This Row],[School Code]]","v":7}]
[521,"FAYETTEVILLE",{"$f":"School_Listing[[#This Row],[System Code]]","v":521},20,{"$f":"School_Listing[[#This Row],[System Code]]&School_Listing[[#This Row],[School Code]]","v":"52120"},"Ralph Askins School",{"$f":"School_Listing[[#This Row],[School Code]]","v":20}]
[530,"LOUDON COUNTY",{"$f":"School_Listing[[#This Row],[System Code]]","v":530},15,{"$f":"School_Listing[[#This Row],[System Code]]&School_Listing[[#This Row],[School Code]]","v":"53015"},"Eaton Elementary",{"$f":"School_Listing[[#This Row],[School Code]]","v":15}]
[530,"LOUDON COUNTY",{"$f":"School_Listing[[#This Row],[System Code]]","v":530},18,{"$f":"School_Listing[[#This Row],[System Code]]&School_Listing[[#This Row],[School Code]]","v":"53018"},"Ft Loudoun Middle School",{"$f":"School_Listing[[#This Row],[School Code]]","v":18}]
[530,"LOUDON COUNTY",{"$f":"School_Listing[[#This Row],[System Code]]","v":530},25,{"$f":"School_Listing[[#This Row],[System Code]]&School_Listing[[#This Row],[School Code]]","v":"53025"},"Greenback School",{"$f":"School_Listing[[#This Row],[School Code]]","v":25}]
[530,"LOUDON COUNTY",{"$f":"School_Listing[[#This Row],[System Code]]","v":530},30,{"$f":"School_Listing[[#This Row],[System Code]]&School_Listing[[#This Row],[School Code]]","v":"53030"},"Highland Park Elementary",{"$f":"School_Listing[[#This Row],[School Code]]","v":30}]
[530,"LOUDON COUNTY",{"$f":"School_Listing[[#This Row],[System Code]]","v":530},35,{"$f":"School_Listing[[#This Row],[System Code]]&School_Listing[[#This Row],[School Code]]","v":"53035"},"Loudon Elementary",{"$f":"School_Listing[[#This Row],[School Code]]","v":35}]
[530,"LOUDON COUNTY",{"$f":"School_Listing[[#This Row],[System Code]]","v":530},40,{"$f":"School_Listing[[#This Row],[System Code]]&School_Listing[[#This Row],[School Code]]","v":"53040"},"Loudon High School",{"$f":"School_Listing[[#This Row],[School Code]]","v":40}]
[530,"LOUDON COUNTY",{"$f":"School_Listing[[#This Row],[System Code]]","v":530},48,{"$f":"School_Listing[[#This Row],[System Code]]&School_Listing[[#This Row],[School Code]]","v":"53048"},"North Middle School",{"$f":"School_Listing[[#This Row],[School Code]]","v":48}]
[530,"LOUDON COUNTY",{"$f":"School_Listing[[#This Row],[System Code]]","v":530},50,{"$f":"School_Listing[[#This Row],[System Code]]&School_Listing[[#This Row],[School Code]]","v":"53050"},"Philadelphia Elementary",{"$f":"School_Listing[[#This Row],[School Code]]","v":50}]
[530,"LOUDON COUNTY",{"$f":"School_Listing[[#This Row],[System Code]]","v":530},55,{"$f":"School_Listing[[#This Row],[System Code]]&School_Listing[[#This Row],[School Code]]","v":"53055"},"Steekee Elementary",{"$f":"School_Listing[[#This Row],[School Code]]","v":55}]
[531,"LENOIR CITY",{"$f":"School_Listing[[#This Row],[System Code]]","v":531},30,{"$f":"School_Listing[[#This Row],[System Code]]&School_Listing[[#This Row],[School Code]]","v":"53130"},"Lenoir City Elementary",{"$f":"School_Listing[[#This Row],[School Code]]","v":30}]
[531,"LENOIR CITY",{"$f":"School_Listing[[#This Row],[System Code]]","v":531},5,{"$f":"School_Listing[[#This Row],[System Code]]&School_Listing[[#This Row],[School Code]]","v":"5315"},"Lenoir City High School",{"$f":"School_Listing[[#This Row],[School Code]]","v":5}]
[531,"LENOIR CITY",{"$f":"School_Listing[[#This Row],[System Code]]","v":531},10,{"$f":"School_Listing[[#This Row],[System Code]]&School_Listing[[#This Row],[School Code]]","v":"53110"},"Lenoir City Intermediate/Middle School",{"$f":"School_Listing[[#This Row],[School Code]]","v":10}]
[531,"LENOIR CITY",{"$f":"School_Listing[[#This Row],[System Code]]","v":531},35,{"$f":"School_Listing[[#This Row],[System Code]]&School_Listing[[#This Row],[School Code]]","v":"53135"},"The iLearn Institute at Lenoir City Schools",{"$f":"School_Listing[[#This Row],[School Code]]","v":35}]
[540,"MCMINN COUNTY",{"$f":"School_Listing[[#This Row],[System Code]]","v":540},10,{"$f":"School_Listing[[#This Row],[System Code]]&School_Listing[[#This Row],[School Code]]","v":"54010"},"Calhoun Elementary",{"$f":"School_Listing[[#This Row],[School Code]]","v":10}]
[540,"MCMINN COUNTY",{"$f":"School_Listing[[#This Row],[System Code]]","v":540},15,{"$f":"School_Listing[[#This Row],[System Code]]&School_Listing[[#This Row],[School Code]]","v":"54015"},"Central High School",{"$f":"School_Listing[[#This Row],[School Code]]","v":15}]
[540,"MCMINN COUNTY",{"$f":"School_Listing[[#This Row],[System Code]]","v":540},25,{"$f":"School_Listing[[#This Row],[System Code]]&School_Listing[[#This Row],[School Code]]","v":"54025"},"E K Baker Elementary",{"$f":"School_Listing[[#This Row],[School Code]]","v":25}]
[540,"MCMINN COUNTY",{"$f":"School_Listing[[#This Row],[System Code]]","v":540},30,{"$f":"School_Listing[[#This Row],[System Code]]&School_Listing[[#This Row],[School Code]]","v":"54030"},"Englewood Elementary",{"$f":"School_Listing[[#This Row],[School Code]]","v":30}]
[540,"MCMINN COUNTY",{"$f":"School_Listing[[#This Row],[System Code]]","v":540},45,{"$f":"School_Listing[[#This Row],[System Code]]&School_Listing[[#This Row],[School Code]]","v":"54045"},"McMinn High School",{"$f":"School_Listing[[#This Row],[School Code]]","v":45}]
[540,"MCMINN COUNTY",{"$f":"School_Listing[[#This Row],[System Code]]","v":540},50,{"$f":"School_Listing[[#This Row],[System Code]]&School_Listing[[#This Row],[School Code]]","v":"54050"},"Mountain View Elementary",{"$f":"School_Listing[[#This Row],[School Code]]","v":50}]
[540,"MCMINN COUNTY",{"$f":"School_Listing[[#This Row],[System Code]]","v":540},55,{"$f":"School_Listing[[#This Row],[System Code]]&School_Listing[[#This Row],[School Code]]","v":"54055"},"Niota Elementary",{"$f":"School_Listing[[#This Row],[School Code]]","v":55}]
[540,"MCMINN COUNTY",{"$f":"School_Listing[[#This Row],[System Code]]","v":540},60,{"$f":"School_Listing[[#This Row],[System Code]]&School_Listing[[#This Row],[School Code]]","v":"54060"},"Riceville Elementary",{"$f":"School_Listing[[#This Row],[School Code]]","v":60}]
[540,"MCMINN COUNTY",{"$f":"School_Listing[[#This Row],[System Code]]","v":540},65,{"$f":"School_Listing[[#This Row],[System Code]]&School_Listing[[#This Row],[School Code]]","v":"54065"},"Rogers Creek Elementary",{"$f":"School_Listing[[#This Row],[School Code]]","v":65}]
[541,"ATHENS",{"$f":"School_Listing[[#This Row],[System Code]]","v":541},5,{"$f":"School_Listing[[#This Row],[System Code]]&School_Listing[[#This Row],[School Code]]","v":"5415"},"Athens City Middle School",{"$f":"School_Listing[[#This Row],[School Code]]","v":5}]
[541,"ATHENS",{"$f":"School_Listing[[#This Row],[System Code]]","v":541},10,{"$f":"School_Listing[[#This Row],[System Code]]&School_Listing[[#This Row],[School Code]]","v":"54110"},"City Park Elementary",{"$f":"School_Listing[[#This Row],[School Code]]","v":10}]
[541,"ATHENS",{"$f":"School_Listing[[#This Row],[System Code]]","v":541},20,{"$f":"School_Listing[[#This Row],[System Code]]&School_Listing[[#This Row],[School Code]]","v":"54120"},"Ingleside Elementary",{"$f":"School_Listing[[#This Row],[School Code]]","v":20}]
[541,"ATHENS",{"$f":"School_Listing[[#This Row],[System Code]]","v":541},25,{"$f":"School_Listing[[#This Row],[System Code]]&School_Listing[[#This Row],[School Code]]","v":"54125"},"North City Elementary",{"$f":"School_Listing[[#This Row],[School Code]]","v":25}]
[541,"ATHENS",{"$f":"School_Listing[[#This Row],[System Code]]","v":541},30,{"$f":"School_Listing[[#This Row],[System Code]]&School_Listing[[#This Row],[School Code]]","v":"54130"},"Westside Elementary",{"$f":"School_Listing[[#This Row],[School Code]]","v":30}]
[542,"ETOWAH",{"$f":"School_Listing[[#This Row],[System Code]]","v":542},7,{"$f":"School_Listing[[#This Row],[System Code]]&School_Listing[[#This Row],[School Code]]","v":"5427"},"Etowah Elementary",{"$f":"School_Listing[[#This Row],[School Code]]","v":7}]
[550,"MCNAIRY COUNTY",{"$f":"School_Listing[[#This Row],[System Code]]","v":550},5,{"$f":"School_Listing[[#This Row],[System Code]]&School_Listing[[#This Row],[School Code]]","v":"5505"},"Adamsville Elementary",{"$f":"School_Listing[[#This Row],[School Code]]","v":5}]
[550,"MCNAIRY COUNTY",{"$f":"School_Listing[[#This Row],[System Code]]","v":550},10,{"$f":"School_Listing[[#This Row],[System Code]]&School_Listing[[#This Row],[School Code]]","v":"55010"},"Adamsville High School",{"$f":"School_Listing[[#This Row],[School Code]]","v":10}]
[550,"MCNAIRY COUNTY",{"$f":"School_Listing[[#This Row],[System Code]]","v":550},15,{"$f":"School_Listing[[#This Row],[System Code]]&School_Listing[[#This Row],[School Code]]","v":"55015"},"Bethel Springs Elementary",{"$f":"School_Listing[[#This Row],[School Code]]","v":15}]
[550,"MCNAIRY COUNTY",{"$f":"School_Listing[[#This Row],[System Code]]","v":550},20,{"$f":"School_Listing[[#This Row],[System Code]]&School_Listing[[#This Row],[School Code]]","v":"55020"},"McNairy Central High School",{"$f":"School_Listing[[#This Row],[School Code]]","v":20}]
[550,"MCNAIRY COUNTY",{"$f":"School_Listing[[#This Row],[System Code]]","v":550},7001,{"$f":"School_Listing[[#This Row],[System Code]]&School_Listing[[#This Row],[School Code]]","v":"5507001"},"McNairy County Adult Learning Center",{"$f":"School_Listing[[#This Row],[School Code]]","v":7001}]
[550,"MCNAIRY COUNTY",{"$f":"School_Listing[[#This Row],[System Code]]","v":550},23,{"$f":"School_Listing[[#This Row],[System Code]]&School_Listing[[#This Row],[School Code]]","v":"55023"},"McNairy County Virtual School K-12",{"$f":"School_Listing[[#This Row],[School Code]]","v":23}]
[550,"MCNAIRY COUNTY",{"$f":"School_Listing[[#This Row],[System Code]]","v":550},25,{"$f":"School_Listing[[#This Row],[System Code]]&School_Listing[[#This Row],[School Code]]","v":"55025"},"Michie Elementary",{"$f":"School_Listing[[#This Row],[School Code]]","v":25}]
[550,"MCNAIRY COUNTY",{"$f":"School_Listing[[#This Row],[System Code]]","v":550},30,{"$f":"School_Listing[[#This Row],[System Code]]&School_Listing[[#This Row],[School Code]]","v":"55030"},"Ramer Elementary",{"$f":"School_Listing[[#This Row],[School Code]]","v":30}]
[550,"MCNAIRY COUNTY",{"$f":"School_Listing[[#This Row],[System Code]]","v":550},40,{"$f":"School_Listing[[#This Row],[System Code]]&School_Listing[[#This Row],[School Code]]","v":"55040"},"Selmer Elementary",{"$f":"School_Listing[[#This Row],[School Code]]","v":40}]
[550,"MCNAIRY COUNTY",{"$f":"School_Listing[[#This Row],[System Code]]","v":550},45,{"$f":"School_Listing[[#This Row],[System Code]]&School_Listing[[#This Row],[School Code]]","v":"55045"},"Selmer Middle School",{"$f":"School_Listing[[#This Row],[School Code]]","v":45}]
[560,"MACON COUNTY",{"$f":"School_Listing[[#This Row],[System Code]]","v":560},5,{"$f":"School_Listing[[#This Row],[System Code]]&School_Listing[[#This Row],[School Code]]","v":"5605"},"Central Elementary",{"$f":"School_Listing[[#This Row],[School Code]]","v":5}]
[560,"MACON COUNTY",{"$f":"School_Listing[[#This Row],[System Code]]","v":560},15,{"$f":"School_Listing[[#This Row],[System Code]]&School_Listing[[#This Row],[School Code]]","v":"56015"},"Fairlane Elementary",{"$f":"School_Listing[[#This Row],[School Code]]","v":15}]
[560,"MACON COUNTY",{"$f":"School_Listing[[#This Row],[System Code]]","v":560},22,{"$f":"School_Listing[[#This Row],[System Code]]&School_Listing[[#This Row],[School Code]]","v":"56022"},"Lafayette Elementary School",{"$f":"School_Listing[[#This Row],[School Code]]","v":22}]
[560,"MACON COUNTY",{"$f":"School_Listing[[#This Row],[System Code]]","v":560},21,{"$f":"School_Listing[[#This Row],[System Code]]&School_Listing[[#This Row],[School Code]]","v":"56021"},"Macon County High School",{"$f":"School_Listing[[#This Row],[School Code]]","v":21}]
[560,"MACON COUNTY",{"$f":"School_Listing[[#This Row],[System Code]]","v":560},20,{"$f":"School_Listing[[#This Row],[System Code]]&School_Listing[[#This Row],[School Code]]","v":"56020"},"Macon County Junior High School",{"$f":"School_Listing[[#This Row],[School Code]]","v":20}]
[560,"MACON COUNTY",{"$f":"School_Listing[[#This Row],[System Code]]","v":560},25,{"$f":"School_Listing[[#This Row],[System Code]]&School_Listing[[#This Row],[School Code]]","v":"56025"},"Red Boiling Springs Elementary",{"$f":"School_Listing[[#This Row],[School Code]]","v":25}]
[560,"MACON COUNTY",{"$f":"School_Listing[[#This Row],[System Code]]","v":560},30,{"$f":"School_Listing[[#This Row],[System Code]]&School_Listing[[#This Row],[School Code]]","v":"56030"},"Red Boiling Springs School",{"$f":"School_Listing[[#This Row],[School Code]]","v":30}]
[560,"MACON COUNTY",{"$f":"School_Listing[[#This Row],[System Code]]","v":560},35,{"$f":"School_Listing[[#This Row],[System Code]]&School_Listing[[#This Row],[School Code]]","v":"56035"},"Westside Elementary",{"$f":"School_Listing[[#This Row],[School Code]]","v":35}]
[570,"MADISON COUNTY",{"$f":"School_Listing[[#This Row],[System Code]]","v":570},6,{"$f":"School_Listing[[#This Row],[System Code]]&School_Listing[[#This Row],[School Code]]","v":"5706"},"Alexander Elementary School",{"$f":"School_Listing[[#This Row],[School Code]]","v":6}]
[570,"MADISON COUNTY",{"$f":"School_Listing[[#This Row],[System Code]]","v":570},146,{"$f":"School_Listing[[#This Row],[System Code]]&School_Listing[[#This Row],[School Code]]","v":"570146"},"Andrew Jackson Elementary School",{"$f":"School_Listing[[#This Row],[School Code]]","v":146}]
[570,"MADISON COUNTY",{"$f":"School_Listing[[#This Row],[System Code]]","v":570},14,{"$f":"School_Listing[[#This Row],[System Code]]&School_Listing[[#This Row],[School Code]]","v":"57014"},"Arlington Elementary School",{"$f":"School_Listing[[#This Row],[School Code]]","v":14}]
[570,"MADISON COUNTY",{"$f":"School_Listing[[#This Row],[System Code]]","v":570},86,{"$f":"School_Listing[[#This Row],[System Code]]&School_Listing[[#This Row],[School Code]]","v":"57086"},"Community Montessori School",{"$f":"School_Listing[[#This Row],[School Code]]","v":86}]
[570,"MADISON COUNTY",{"$f":"School_Listing[[#This Row],[System Code]]","v":570},21,{"$f":"School_Listing[[#This Row],[System Code]]&School_Listing[[#This Row],[School Code]]","v":"57021"},"Denmark Elementary",{"$f":"School_Listing[[#This Row],[School Code]]","v":21}]
[570,"MADISON COUNTY",{"$f":"School_Listing[[#This Row],[System Code]]","v":570},140,{"$f":"School_Listing[[#This Row],[System Code]]&School_Listing[[#This Row],[School Code]]","v":"570140"},"East Elementary School",{"$f":"School_Listing[[#This Row],[School Code]]","v":140}]
[570,"MADISON COUNTY",{"$f":"School_Listing[[#This Row],[System Code]]","v":570},38,{"$f":"School_Listing[[#This Row],[System Code]]&School_Listing[[#This Row],[School Code]]","v":"57038"},"Isaac Lane Technology Magnet Elementary",{"$f":"School_Listing[[#This Row],[School Code]]","v":38}]
[570,"MADISON COUNTY",{"$f":"School_Listing[[#This Row],[System Code]]","v":570},150,{"$f":"School_Listing[[#This Row],[System Code]]&School_Listing[[#This Row],[School Code]]","v":"570150"},"Jackson Academic STEAM Academy",{"$f":"School_Listing[[#This Row],[School Code]]","v":150}]
[570,"MADISON COUNTY",{"$f":"School_Listing[[#This Row],[System Code]]","v":570},144,{"$f":"School_Listing[[#This Row],[System Code]]&School_Listing[[#This Row],[School Code]]","v":"570144"},"Jackson Career Technology Magnet Elementary",{"$f":"School_Listing[[#This Row],[School Code]]","v":144}]
[570,"MADISON COUNTY",{"$f":"School_Listing[[#This Row],[System Code]]","v":570},26,{"$f":"School_Listing[[#This Row],[System Code]]&School_Listing[[#This Row],[School Code]]","v":"57026"},"Jackson Central Merry High School",{"$f":"School_Listing[[#This Row],[School Code]]","v":26}]
[570,"MADISON COUNTY",{"$f":"School_Listing[[#This Row],[System Code]]","v":570},28,{"$f":"School_Listing[[#This Row],[System Code]]&School_Listing[[#This Row],[School Code]]","v":"57028"},"Jackson Central Merry Middle School",{"$f":"School_Listing[[#This Row],[School Code]]","v":28}]
[570,"MADISON COUNTY",{"$f":"School_Listing[[#This Row],[System Code]]","v":570},22,{"$f":"School_Listing[[#This Row],[System Code]]&School_Listing[[#This Row],[School Code]]","v":"57022"},"Jackson Central-Merry Early College High",{"$f":"School_Listing[[#This Row],[School Code]]","v":22}]
[570,"MADISON COUNTY",{"$f":"School_Listing[[#This Row],[System Code]]","v":570},53,{"$f":"School_Listing[[#This Row],[System Code]]&School_Listing[[#This Row],[School Code]]","v":"57053"},"Liberty Technology Magnet High School",{"$f":"School_Listing[[#This Row],[School Code]]","v":53}]
[570,"MADISON COUNTY",{"$f":"School_Listing[[#This Row],[System Code]]","v":570},56,{"$f":"School_Listing[[#This Row],[System Code]]&School_Listing[[#This Row],[School Code]]","v":"57056"},"Lincoln Elementary School",{"$f":"School_Listing[[#This Row],[School Code]]","v":56}]
[570,"MADISON COUNTY",{"$f":"School_Listing[[#This Row],[System Code]]","v":570},63,{"$f":"School_Listing[[#This Row],[System Code]]&School_Listing[[#This Row],[School Code]]","v":"57063"},"Madison Academic Magnet High School",{"$f":"School_Listing[[#This Row],[School Code]]","v":63}]
[570,"MADISON COUNTY",{"$f":"School_Listing[[#This Row],[System Code]]","v":570},142,{"$f":"School_Listing[[#This Row],[System Code]]&School_Listing[[#This Row],[School Code]]","v":"570142"},"North Parkway Middle School",{"$f":"School_Listing[[#This Row],[School Code]]","v":142}]
[570,"MADISON COUNTY",{"$f":"School_Listing[[#This Row],[System Code]]","v":570},71,{"$f":"School_Listing[[#This Row],[System Code]]&School_Listing[[#This Row],[School Code]]","v":"57071"},"North Side High School",{"$f":"School_Listing[[#This Row],[School Code]]","v":71}]
[570,"MADISON COUNTY",{"$f":"School_Listing[[#This Row],[System Code]]","v":570},76,{"$f":"School_Listing[[#This Row],[System Code]]&School_Listing[[#This Row],[School Code]]","v":"57076"},"Northeast Middle School",{"$f":"School_Listing[[#This Row],[School Code]]","v":76}]
[570,"MADISON COUNTY",{"$f":"School_Listing[[#This Row],[System Code]]","v":570},135,{"$f":"School_Listing[[#This Row],[System Code]]&School_Listing[[#This Row],[School Code]]","v":"570135"},"Nova Early Learning Center",{"$f":"School_Listing[[#This Row],[School Code]]","v":135}]
[570,"MADISON COUNTY",{"$f":"School_Listing[[#This Row],[System Code]]","v":570},125,{"$f":"School_Listing[[#This Row],[System Code]]&School_Listing[[#This Row],[School Code]]","v":"570125"},"Parkview Prep Academy",{"$f":"School_Listing[[#This Row],[School Code]]","v":125}]
[570,"MADISON COUNTY",{"$f":"School_Listing[[#This Row],[System Code]]","v":570},100,{"$f":"School_Listing[[#This Row],[System Code]]&School_Listing[[#This Row],[School Code]]","v":"570100"},"Pope School",{"$f":"School_Listing[[#This Row],[School Code]]","v":100}]
[570,"MADISON COUNTY",{"$f":"School_Listing[[#This Row],[System Code]]","v":570},24,{"$f":"School_Listing[[#This Row],[System Code]]&School_Listing[[#This Row],[School Code]]","v":"57024"},"Rose Hill School",{"$f":"School_Listing[[#This Row],[School Code]]","v":24}]
[570,"MADISON COUNTY",{"$f":"School_Listing[[#This Row],[System Code]]","v":570},102,{"$f":"School_Listing[[#This Row],[System Code]]&School_Listing[[#This Row],[School Code]]","v":"570102"},"South Elementary",{"$f":"School_Listing[[#This Row],[School Code]]","v":102}]
[570,"MADISON COUNTY",{"$f":"School_Listing[[#This Row],[System Code]]","v":570},105,{"$f":"School_Listing[[#This Row],[System Code]]&School_Listing[[#This Row],[School Code]]","v":"570105"},"South Side High School",{"$f":"School_Listing[[#This Row],[School Code]]","v":105}]
[570,"MADISON COUNTY",{"$f":"School_Listing[[#This Row],[System Code]]","v":570},111,{"$f":"School_Listing[[#This Row],[System Code]]&School_Listing[[#This Row],[School Code]]","v":"570111"},"Thelma Barker Elementary",{"$f":"School_Listing[[#This Row],[School Code]]","v":111}]
[570,"MADISON COUNTY",{"$f":"School_Listing[[#This Row],[System Code]]","v":570},130,{"$f":"School_Listing[[#This Row],[System Code]]&School_Listing[[#This Row],[School Code]]","v":"570130"},"West-Bemis Middle School",{"$f":"School_Listing[[#This Row],[School Code]]","v":130}]
[580,"MARION COUNTY",{"$f":"School_Listing[[#This Row],[System Code]]","v":580},75,{"$f":"School_Listing[[#This Row],[System Code]]&School_Listing[[#This Row],[School Code]]","v":"58075"},"Central Prep Academy",{"$f":"School_Listing[[#This Row],[School Code]]","v":75}]
[580,"MARION COUNTY",{"$f":"School_Listing[[#This Row],[System Code]]","v":580},21,{"$f":"School_Listing[[#This Row],[System Code]]&School_Listing[[#This Row],[School Code]]","v":"58021"},"Jasper Elementary School",{"$f":"School_Listing[[#This Row],[School Code]]","v":21}]
[580,"MARION COUNTY",{"$f":"School_Listing[[#This Row],[System Code]]","v":580},23,{"$f":"School_Listing[[#This Row],[System Code]]&School_Listing[[#This Row],[School Code]]","v":"58023"},"Jasper Middle School",{"$f":"School_Listing[[#This Row],[School Code]]","v":23}]
[580,"MARION COUNTY",{"$f":"School_Listing[[#This Row],[System Code]]","v":580},25,{"$f":"School_Listing[[#This Row],[System Code]]&School_Listing[[#This Row],[School Code]]","v":"58025"},"Marion Co High School",{"$f":"School_Listing[[#This Row],[School Code]]","v":25}]
[580,"MARION COUNTY",{"$f":"School_Listing[[#This Row],[System Code]]","v":580},77,{"$f":"School_Listing[[#This Row],[System Code]]&School_Listing[[#This Row],[School Code]]","v":"58077"},"Marion Virtual Elementary School",{"$f":"School_Listing[[#This Row],[School Code]]","v":77}]
[580,"MARION COUNTY",{"$f":"School_Listing[[#This Row],[System Code]]","v":580},80,{"$f":"School_Listing[[#This Row],[System Code]]&School_Listing[[#This Row],[School Code]]","v":"58080"},"Marion Virtual High School",{"$f":"School_Listing[[#This Row],[School Code]]","v":80}]
[580,"MARION COUNTY",{"$f":"School_Listing[[#This Row],[System Code]]","v":580},30,{"$f":"School_Listing[[#This Row],[System Code]]&School_Listing[[#This Row],[School Code]]","v":"58030"},"Monteagle Elementary",{"$f":"School_Listing[[#This Row],[School Code]]","v":30}]
[580,"MARION COUNTY",{"$f":"School_Listing[[#This Row],[System Code]]","v":580},50,{"$f":"School_Listing[[#This Row],[System Code]]&School_Listing[[#This Row],[School Code]]","v":"58050"},"South Pittsburg Elementary",{"$f":"School_Listing[[#This Row],[School Code]]","v":50}]
[580,"MARION COUNTY",{"$f":"School_Listing[[#This Row],[System Code]]","v":580},55,{"$f":"School_Listing[[#This Row],[System Code]]&School_Listing[[#This Row],[School Code]]","v":"58055"},"South Pittsburg High School",{"$f":"School_Listing[[#This Row],[School Code]]","v":55}]
[580,"MARION COUNTY",{"$f":"School_Listing[[#This Row],[System Code]]","v":580},63,{"$f":"School_Listing[[#This Row],[System Code]]&School_Listing[[#This Row],[School Code]]","v":"58063"},"Whitwell Elementary",{"$f":"School_Listing[[#This Row],[School Code]]","v":63}]
[580,"MARION COUNTY",{"$f":"School_Listing[[#This Row],[System Code]]","v":580},70,{"$f":"School_Listing[[#This Row],[System Code]]&School_Listing[[#This Row],[School Code]]","v":"58070"},"Whitwell High School",{"$f":"School_Listing[[#This Row],[School Code]]","v":70}]
[580,"MARION COUNTY",{"$f":"School_Listing[[#This Row],[System Code]]","v":580},65,{"$f":"School_Listing[[#This Row],[System Code]]&School_Listing[[#This Row],[School Code]]","v":"58065"},"Whitwell Middle School",{"$f":"School_Listing[[#This Row],[School Code]]","v":65}]
[581,"RICHARD CITY",{"$f":"School_Listing[[#This Row],[System Code]]","v":581},5,{"$f":"School_Listing[[#This Row],[System Code]]&School_Listing[[#This Row],[School Code]]","v":"5815"},"Richard Hardy Memorial School",{"$f":"School_Listing[[#This Row],[School Code]]","v":5}]
[590,"MARSHALL COUNTY",{"$f":"School_Listing[[#This Row],[System Code]]","v":590},7,{"$f":"School_Listing[[#This Row],[System Code]]&School_Listing[[#This Row],[School Code]]","v":"5907"},"Chapel Hill Elementary",{"$f":"School_Listing[[#This Row],[School Code]]","v":7}]
[590,"MARSHALL COUNTY",{"$f":"School_Listing[[#This Row],[System Code]]","v":590},18,{"$f":"School_Listing[[#This Row],[System Code]]&School_Listing[[#This Row],[School Code]]","v":"59018"},"Cornersville Elementary",{"$f":"School_Listing[[#This Row],[School Code]]","v":18}]
[590,"MARSHALL COUNTY",{"$f":"School_Listing[[#This Row],[System Code]]","v":590},20,{"$f":"School_Listing[[#This Row],[System Code]]&School_Listing[[#This Row],[School Code]]","v":"59020"},"Cornersville School",{"$f":"School_Listing[[#This Row],[School Code]]","v":20}]
[590,"MARSHALL COUNTY",{"$f":"School_Listing[[#This Row],[System Code]]","v":590},65,{"$f":"School_Listing[[#This Row],[System Code]]&School_Listing[[#This Row],[School Code]]","v":"59065"},"Delk-Henson Intermediate School",{"$f":"School_Listing[[#This Row],[School Code]]","v":65}]
[590,"MARSHALL COUNTY",{"$f":"School_Listing[[#This Row],[System Code]]","v":590},30,{"$f":"School_Listing[[#This Row],[System Code]]&School_Listing[[#This Row],[School Code]]","v":"59030"},"Forrest School",{"$f":"School_Listing[[#This Row],[School Code]]","v":30}]
[590,"MARSHALL COUNTY",{"$f":"School_Listing[[#This Row],[System Code]]","v":590},41,{"$f":"School_Listing[[#This Row],[System Code]]&School_Listing[[#This Row],[School Code]]","v":"59041"},"Lewisburg Middle School",{"$f":"School_Listing[[#This Row],[School Code]]","v":41}]
[590,"MARSHALL COUNTY",{"$f":"School_Listing[[#This Row],[System Code]]","v":590},47,{"$f":"School_Listing[[#This Row],[System Code]]&School_Listing[[#This Row],[School Code]]","v":"59047"},"Marshall Co High School",{"$f":"School_Listing[[#This Row],[School Code]]","v":47}]
[590,"MARSHALL COUNTY",{"$f":"School_Listing[[#This Row],[System Code]]","v":590},43,{"$f":"School_Listing[[#This Row],[System Code]]&School_Listing[[#This Row],[School Code]]","v":"59043"},"Marshall Elementary",{"$f":"School_Listing[[#This Row],[School Code]]","v":43}]
[590,"MARSHALL COUNTY",{"$f":"School_Listing[[#This Row],[System Code]]","v":590},51,{"$f":"School_Listing[[#This Row],[System Code]]&School_Listing[[#This Row],[School Code]]","v":"59051"},"Oak Grove Elementary",{"$f":"School_Listing[[#This Row],[School Code]]","v":51}]
[590,"MARSHALL COUNTY",{"$f":"School_Listing[[#This Row],[System Code]]","v":590},60,{"$f":"School_Listing[[#This Row],[System Code]]&School_Listing[[#This Row],[School Code]]","v":"59060"},"Westhills Elementary",{"$f":"School_Listing[[#This Row],[School Code]]","v":60}]
[600,"MAURY COUNTY",{"$f":"School_Listing[[#This Row],[System Code]]","v":600},115,{"$f":"School_Listing[[#This Row],[System Code]]&School_Listing[[#This Row],[School Code]]","v":"600115"},"Battle Creek Elementary School",{"$f":"School_Listing[[#This Row],[School Code]]","v":115}]
[600,"MAURY COUNTY",{"$f":"School_Listing[[#This Row],[System Code]]","v":600},120,{"$f":"School_Listing[[#This Row],[System Code]]&School_Listing[[#This Row],[School Code]]","v":"600120"},"Battle Creek Middle School",{"$f":"School_Listing[[#This Row],[School Code]]","v":120}]
[600,"MAURY COUNTY",{"$f":"School_Listing[[#This Row],[System Code]]","v":600},15,{"$f":"School_Listing[[#This Row],[System Code]]&School_Listing[[#This Row],[School Code]]","v":"60015"},"Columbia Central High School",{"$f":"School_Listing[[#This Row],[School Code]]","v":15}]
[600,"MAURY COUNTY",{"$f":"School_Listing[[#This Row],[System Code]]","v":600},30,{"$f":"School_Listing[[#This Row],[System Code]]&School_Listing[[#This Row],[School Code]]","v":"60030"},"Culleoka Unit School",{"$f":"School_Listing[[#This Row],[School Code]]","v":30}]
[600,"MAURY COUNTY",{"$f":"School_Listing[[#This Row],[System Code]]","v":600},33,{"$f":"School_Listing[[#This Row],[System Code]]&School_Listing[[#This Row],[School Code]]","v":"60033"},"E. A. Cox Middle School",{"$f":"School_Listing[[#This Row],[School Code]]","v":33}]
[600,"MAURY COUNTY",{"$f":"School_Listing[[#This Row],[System Code]]","v":600},40,{"$f":"School_Listing[[#This Row],[System Code]]&School_Listing[[#This Row],[School Code]]","v":"60040"},"Hampshire Unit School",{"$f":"School_Listing[[#This Row],[School Code]]","v":40}]
[600,"MAURY COUNTY",{"$f":"School_Listing[[#This Row],[System Code]]","v":600},45,{"$f":"School_Listing[[#This Row],[System Code]]&School_Listing[[#This Row],[School Code]]","v":"60045"},"Highland Park Elementary",{"$f":"School_Listing[[#This Row],[School Code]]","v":45}]
[600,"MAURY COUNTY",{"$f":"School_Listing[[#This Row],[System Code]]","v":600},50,{"$f":"School_Listing[[#This Row],[System Code]]&School_Listing[[#This Row],[School Code]]","v":"60050"},"J E Woodard Elementary",{"$f":"School_Listing[[#This Row],[School Code]]","v":50}]
[600,"MAURY COUNTY",{"$f":"School_Listing[[#This Row],[System Code]]","v":600},59,{"$f":"School_Listing[[#This Row],[System Code]]&School_Listing[[#This Row],[School Code]]","v":"60059"},"J E Woody Elementary",{"$f":"School_Listing[[#This Row],[School Code]]","v":59}]
[600,"MAURY COUNTY",{"$f":"School_Listing[[#This Row],[System Code]]","v":600},10,{"$f":"School_Listing[[#This Row],[System Code]]&School_Listing[[#This Row],[School Code]]","v":"60010"},"J. Brown Elementary",{"$f":"School_Listing[[#This Row],[School Code]]","v":10}]
[600,"MAURY COUNTY",{"$f":"School_Listing[[#This Row],[System Code]]","v":600},5,{"$f":"School_Listing[[#This Row],[System Code]]&School_Listing[[#This Row],[School Code]]","v":"6005"},"J. R. Baker Elementary",{"$f":"School_Listing[[#This Row],[School Code]]","v":5}]
[600,"MAURY COUNTY",{"$f":"School_Listing[[#This Row],[System Code]]","v":600},53,{"$f":"School_Listing[[#This Row],[System Code]]&School_Listing[[#This Row],[School Code]]","v":"60053"},"Marvin Wright Elementary School",{"$f":"School_Listing[[#This Row],[School Code]]","v":53}]
[600,"MAURY COUNTY",{"$f":"School_Listing[[#This Row],[System Code]]","v":600},65,{"$f":"School_Listing[[#This Row],[System Code]]&School_Listing[[#This Row],[School Code]]","v":"60065"},"Mt Pleasant High School",{"$f":"School_Listing[[#This Row],[School Code]]","v":65}]
[600,"MAURY COUNTY",{"$f":"School_Listing[[#This Row],[System Code]]","v":600},61,{"$f":"School_Listing[[#This Row],[System Code]]&School_Listing[[#This Row],[School Code]]","v":"60061"},"Mt. Pleasant Middle Visual Perform. Arts",{"$f":"School_Listing[[#This Row],[School Code]]","v":61}]
[600,"MAURY COUNTY",{"$f":"School_Listing[[#This Row],[System Code]]","v":600},110,{"$f":"School_Listing[[#This Row],[System Code]]&School_Listing[[#This Row],[School Code]]","v":"600110"},"Northfield Academy",{"$f":"School_Listing[[#This Row],[School Code]]","v":110}]
[600,"MAURY COUNTY",{"$f":"School_Listing[[#This Row],[System Code]]","v":600},68,{"$f":"School_Listing[[#This Row],[System Code]]&School_Listing[[#This Row],[School Code]]","v":"60068"},"R Howell Elementary",{"$f":"School_Listing[[#This Row],[School Code]]","v":68}]
[600,"MAURY COUNTY",{"$f":"School_Listing[[#This Row],[System Code]]","v":600},70,{"$f":"School_Listing[[#This Row],[System Code]]&School_Listing[[#This Row],[School Code]]","v":"60070"},"Riverside Elementary",{"$f":"School_Listing[[#This Row],[School Code]]","v":70}]
[600,"MAURY COUNTY",{"$f":"School_Listing[[#This Row],[System Code]]","v":600},85,{"$f":"School_Listing[[#This Row],[System Code]]&School_Listing[[#This Row],[School Code]]","v":"60085"},"Santa Fe Unit School",{"$f":"School_Listing[[#This Row],[School Code]]","v":85}]
[600,"MAURY COUNTY",{"$f":"School_Listing[[#This Row],[System Code]]","v":600},90,{"$f":"School_Listing[[#This Row],[System Code]]&School_Listing[[#This Row],[School Code]]","v":"60090"},"Spring Hill Elementary",{"$f":"School_Listing[[#This Row],[School Code]]","v":90}]
[600,"MAURY COUNTY",{"$f":"School_Listing[[#This Row],[System Code]]","v":600},95,{"$f":"School_Listing[[#This Row],[System Code]]&School_Listing[[#This Row],[School Code]]","v":"60095"},"Spring Hill High School",{"$f":"School_Listing[[#This Row],[School Code]]","v":95}]
[600,"MAURY COUNTY",{"$f":"School_Listing[[#This Row],[System Code]]","v":600},105,{"$f":"School_Listing[[#This Row],[System Code]]&School_Listing[[#This Row],[School Code]]","v":"600105"},"Spring Hill Middle School",{"$f":"School_Listing[[#This Row],[School Code]]","v":105}]
[600,"MAURY COUNTY",{"$f":"School_Listing[[#This Row],[System Code]]","v":600},102,{"$f":"School_Listing[[#This Row],[System Code]]&School_Listing[[#This Row],[School Code]]","v":"600102"},"Virtual Academy of Maury County",{"$f":"School_Listing[[#This Row],[School Code]]","v":102}]
[600,"MAURY COUNTY",{"$f":"School_Listing[[#This Row],[System Code]]","v":600},100,{"$f":"School_Listing[[#This Row],[System Code]]&School_Listing[[#This Row],[School Code]]","v":"600100"},"Whitthorne Middle School",{"$f":"School_Listing[[#This Row],[School Code]]","v":100}]
[610,"MEIGS COUNTY",{"$f":"School_Listing[[#This Row],[System Code]]","v":610},25,{"$f":"School_Listing[[#This Row],[System Code]]&School_Listing[[#This Row],[School Code]]","v":"61025"},"Meigs County High School",{"$f":"School_Listing[[#This Row],[School Code]]","v":25}]
[610,"MEIGS COUNTY",{"$f":"School_Listing[[#This Row],[System Code]]","v":610},8,{"$f":"School_Listing[[#This Row],[System Code]]&School_Listing[[#This Row],[School Code]]","v":"6108"},"Meigs Middle School",{"$f":"School_Listing[[#This Row],[School Code]]","v":8}]
[610,"MEIGS COUNTY",{"$f":"School_Listing[[#This Row],[System Code]]","v":610},15,{"$f":"School_Listing[[#This Row],[System Code]]&School_Listing[[#This Row],[School Code]]","v":"61015"},"Meigs North Elementary",{"$f":"School_Listing[[#This Row],[School Code]]","v":15}]
[610,"MEIGS COUNTY",{"$f":"School_Listing[[#This Row],[System Code]]","v":610},5,{"$f":"School_Listing[[#This Row],[System Code]]&School_Listing[[#This Row],[School Code]]","v":"6105"},"Meigs South Elementary",{"$f":"School_Listing[[#This Row],[School Code]]","v":5}]
[620,"MONROE COUNTY",{"$f":"School_Listing[[#This Row],[System Code]]","v":620},10,{"$f":"School_Listing[[#This Row],[System Code]]&School_Listing[[#This Row],[School Code]]","v":"62010"},"Coker Creek Elementary",{"$f":"School_Listing[[#This Row],[School Code]]","v":10}]
[620,"MONROE COUNTY",{"$f":"School_Listing[[#This Row],[System Code]]","v":620},18,{"$f":"School_Listing[[#This Row],[System Code]]&School_Listing[[#This Row],[School Code]]","v":"62018"},"Madisonville Intermediate School",{"$f":"School_Listing[[#This Row],[School Code]]","v":18}]
[620,"MONROE COUNTY",{"$f":"School_Listing[[#This Row],[System Code]]","v":620},20,{"$f":"School_Listing[[#This Row],[System Code]]&School_Listing[[#This Row],[School Code]]","v":"62020"},"Madisonville Middle School",{"$f":"School_Listing[[#This Row],[School Code]]","v":20}]
[620,"MONROE COUNTY",{"$f":"School_Listing[[#This Row],[System Code]]","v":620},25,{"$f":"School_Listing[[#This Row],[System Code]]&School_Listing[[#This Row],[School Code]]","v":"62025"},"Madisonville Primary",{"$f":"School_Listing[[#This Row],[School Code]]","v":25}]
[620,"MONROE COUNTY",{"$f":"School_Listing[[#This Row],[System Code]]","v":620},32,{"$f":"School_Listing[[#This Row],[System Code]]&School_Listing[[#This Row],[School Code]]","v":"62032"},"Monroe County Virtual School",{"$f":"School_Listing[[#This Row],[School Code]]","v":32}]
[620,"MONROE COUNTY",{"$f":"School_Listing[[#This Row],[System Code]]","v":620},35,{"$f":"School_Listing[[#This Row],[System Code]]&School_Listing[[#This Row],[School Code]]","v":"62035"},"Rural Vale Elementary",{"$f":"School_Listing[[#This Row],[School Code]]","v":35}]
[620,"MONROE COUNTY",{"$f":"School_Listing[[#This Row],[System Code]]","v":620},37,{"$f":"School_Listing[[#This Row],[System Code]]&School_Listing[[#This Row],[School Code]]","v":"62037"},"Sequoyah High School",{"$f":"School_Listing[[#This Row],[School Code]]","v":37}]
[620,"MONROE COUNTY",{"$f":"School_Listing[[#This Row],[System Code]]","v":620},40,{"$f":"School_Listing[[#This Row],[System Code]]&School_Listing[[#This Row],[School Code]]","v":"62040"},"Sweetwater High School",{"$f":"School_Listing[[#This Row],[School Code]]","v":40}]
[620,"MONROE COUNTY",{"$f":"School_Listing[[#This Row],[System Code]]","v":620},45,{"$f":"School_Listing[[#This Row],[System Code]]&School_Listing[[#This Row],[School Code]]","v":"62045"},"Tellico Plains Elementary",{"$f":"School_Listing[[#This Row],[School Code]]","v":45}]
[620,"MONROE COUNTY",{"$f":"School_Listing[[#This Row],[System Code]]","v":620},50,{"$f":"School_Listing[[#This Row],[System Code]]&School_Listing[[#This Row],[School Code]]","v":"62050"},"Tellico Plains High School",{"$f":"School_Listing[[#This Row],[School Code]]","v":50}]
[620,"MONROE COUNTY",{"$f":"School_Listing[[#This Row],[System Code]]","v":620},53,{"$f":"School_Listing[[#This Row],[System Code]]&School_Listing[[#This Row],[School Code]]","v":"62053"},"Tellico Plains Junior High School",{"$f":"School_Listing[[#This Row],[School Code]]","v":53}]
[620,"MONROE COUNTY",{"$f":"School_Listing[[#This Row],[System Code]]","v":620},55,{"$f":"School_Listing[[#This Row],[System Code]]&School_Listing[[#This Row],[School Code]]","v":"62055"},"Vonore Elementary",{"$f":"School_Listing[[#This Row],[School Code]]","v":55}]
[620,"MONROE COUNTY",{"$f":"School_Listing[[#This Row],[System Code]]","v":620},58,{"$f":"School_Listing[[#This Row],[System Code]]&School_Listing[[#This Row],[School Code]]","v":"62058"},"Vonore Middle School",{"$f":"School_Listing[[#This Row],[School Code]]","v":58}]
[621,"SWEETWATER",{"$f":"School_Listing[[#This Row],[System Code]]","v":621},5,{"$f":"School_Listing[[#This Row],[System Code]]&School_Listing[[#This Row],[School Code]]","v":"6215"},"Brown Intermediate School",{"$f":"School_Listing[[#This Row],[School Code]]","v":5}]
[621,"SWEETWATER",{"$f":"School_Listing[[#This Row],[System Code]]","v":621},10,{"$f":"School_Listing[[#This Row],[System Code]]&School_Listing[[#This Row],[School Code]]","v":"62110"},"Sweetwater Elementary",{"$f":"School_Listing[[#This Row],[School Code]]","v":10}]
[621,"SWEETWATER",{"$f":"School_Listing[[#This Row],[System Code]]","v":621},15,{"$f":"School_Listing[[#This Row],[System Code]]&School_Listing[[#This Row],[School Code]]","v":"62115"},"Sweetwater Jr High School",{"$f":"School_Listing[[#This Row],[School Code]]","v":15}]
[621,"SWEETWATER",{"$f":"School_Listing[[#This Row],[System Code]]","v":621},30,{"$f":"School_Listing[[#This Row],[System Code]]&School_Listing[[#This Row],[School Code]]","v":"62130"},"Sweetwater Primary School",{"$f":"School_Listing[[#This Row],[School Code]]","v":30}]
[630,"MONTGOMERY COUNTY",{"$f":"School_Listing[[#This Row],[System Code]]","v":630},3,{"$f":"School_Listing[[#This Row],[System Code]]&School_Listing[[#This Row],[School Code]]","v":"6303"},"Barkers Mill Elementary",{"$f":"School_Listing[[#This Row],[School Code]]","v":3}]
[630,"MONTGOMERY COUNTY",{"$f":"School_Listing[[#This Row],[System Code]]","v":630},5,{"$f":"School_Listing[[#This Row],[System Code]]&School_Listing[[#This Row],[School Code]]","v":"6305"},"Barksdale Elementary",{"$f":"School_Listing[[#This Row],[School Code]]","v":5}]
[630,"MONTGOMERY COUNTY",{"$f":"School_Listing[[#This Row],[System Code]]","v":630},10,{"$f":"School_Listing[[#This Row],[System Code]]&School_Listing[[#This Row],[School Code]]","v":"63010"},"Burt Elementary",{"$f":"School_Listing[[#This Row],[School Code]]","v":10}]
[630,"MONTGOMERY COUNTY",{"$f":"School_Listing[[#This Row],[System Code]]","v":630},15,{"$f":"School_Listing[[#This Row],[System Code]]&School_Listing[[#This Row],[School Code]]","v":"63015"},"Byrns Darden Elementary",{"$f":"School_Listing[[#This Row],[School Code]]","v":15}]
[630,"MONTGOMERY COUNTY",{"$f":"School_Listing[[#This Row],[System Code]]","v":630},95,{"$f":"School_Listing[[#This Row],[System Code]]&School_Listing[[#This Row],[School Code]]","v":"63095"},"Carmel Elementary",{"$f":"School_Listing[[#This Row],[School Code]]","v":95}]
[630,"MONTGOMERY COUNTY",{"$f":"School_Listing[[#This Row],[System Code]]","v":630},30,{"$f":"School_Listing[[#This Row],[System Code]]&School_Listing[[#This Row],[School Code]]","v":"63030"},"Clarksville High",{"$f":"School_Listing[[#This Row],[School Code]]","v":30}]
[630,"MONTGOMERY COUNTY",{"$f":"School_Listing[[#This Row],[System Code]]","v":630},32,{"$f":"School_Listing[[#This Row],[System Code]]&School_Listing[[#This Row],[School Code]]","v":"63032"},"CMCSS Adult High School",{"$f":"School_Listing[[#This Row],[School Code]]","v":32}]
[630,"MONTGOMERY COUNTY",{"$f":"School_Listing[[#This Row],[System Code]]","v":630},33,{"$f":"School_Listing[[#This Row],[System Code]]&School_Listing[[#This Row],[School Code]]","v":"63033"},"CMCSS K-12 Virtual School",{"$f":"School_Listing[[#This Row],[School Code]]","v":33}]
[630,"MONTGOMERY COUNTY",{"$f":"School_Listing[[#This Row],[System Code]]","v":630},40,{"$f":"School_Listing[[#This Row],[System Code]]&School_Listing[[#This Row],[School Code]]","v":"63040"},"Cumberland Heights Elementary",{"$f":"School_Listing[[#This Row],[School Code]]","v":40}]
[630,"MONTGOMERY COUNTY",{"$f":"School_Listing[[#This Row],[System Code]]","v":630},45,{"$f":"School_Listing[[#This Row],[System Code]]&School_Listing[[#This Row],[School Code]]","v":"63045"},"East Montgomery Elementary",{"$f":"School_Listing[[#This Row],[School Code]]","v":45}]
[630,"MONTGOMERY COUNTY",{"$f":"School_Listing[[#This Row],[System Code]]","v":630},35,{"$f":"School_Listing[[#This Row],[System Code]]&School_Listing[[#This Row],[School Code]]","v":"63035"},"Glenellen Elementary",{"$f":"School_Listing[[#This Row],[School Code]]","v":35}]
[630,"MONTGOMERY COUNTY",{"$f":"School_Listing[[#This Row],[System Code]]","v":630},27,{"$f":"School_Listing[[#This Row],[System Code]]&School_Listing[[#This Row],[School Code]]","v":"63027"},"Hazelwood Elementary",{"$f":"School_Listing[[#This Row],[School Code]]","v":27}]
[630,"MONTGOMERY COUNTY",{"$f":"School_Listing[[#This Row],[System Code]]","v":630},17,{"$f":"School_Listing[[#This Row],[System Code]]&School_Listing[[#This Row],[School Code]]","v":"63017"},"Kenwood Elementary",{"$f":"School_Listing[[#This Row],[School Code]]","v":17}]
[630,"MONTGOMERY COUNTY",{"$f":"School_Listing[[#This Row],[System Code]]","v":630},19,{"$f":"School_Listing[[#This Row],[System Code]]&School_Listing[[#This Row],[School Code]]","v":"63019"},"Kenwood High",{"$f":"School_Listing[[#This Row],[School Code]]","v":19}]
[630,"MONTGOMERY COUNTY",{"$f":"School_Listing[[#This Row],[System Code]]","v":630},18,{"$f":"School_Listing[[#This Row],[System Code]]&School_Listing[[#This Row],[School Code]]","v":"63018"},"Kenwood Middle",{"$f":"School_Listing[[#This Row],[School Code]]","v":18}]
[630,"MONTGOMERY COUNTY",{"$f":"School_Listing[[#This Row],[System Code]]","v":630},21,{"$f":"School_Listing[[#This Row],[System Code]]&School_Listing[[#This Row],[School Code]]","v":"63021"},"Kirkwood Middle",{"$f":"School_Listing[[#This Row],[School Code]]","v":21}]
[630,"MONTGOMERY COUNTY",{"$f":"School_Listing[[#This Row],[System Code]]","v":630},49,{"$f":"School_Listing[[#This Row],[System Code]]&School_Listing[[#This Row],[School Code]]","v":"63049"},"Liberty Elementary",{"$f":"School_Listing[[#This Row],[School Code]]","v":49}]
[630,"MONTGOMERY COUNTY",{"$f":"School_Listing[[#This Row],[System Code]]","v":630},88,{"$f":"School_Listing[[#This Row],[System Code]]&School_Listing[[#This Row],[School Code]]","v":"63088"},"Middle College @ Austin Peay State University",{"$f":"School_Listing[[#This Row],[School Code]]","v":88}]
[630,"MONTGOMERY COUNTY",{"$f":"School_Listing[[#This Row],[System Code]]","v":630},51,{"$f":"School_Listing[[#This Row],[System Code]]&School_Listing[[#This Row],[School Code]]","v":"63051"},"Minglewood Elementary",{"$f":"School_Listing[[#This Row],[School Code]]","v":51}]
[630,"MONTGOMERY COUNTY",{"$f":"School_Listing[[#This Row],[System Code]]","v":630},20,{"$f":"School_Listing[[#This Row],[System Code]]&School_Listing[[#This Row],[School Code]]","v":"63020"},"Montgomery Central Elementary",{"$f":"School_Listing[[#This Row],[School Code]]","v":20}]
[630,"MONTGOMERY COUNTY",{"$f":"School_Listing[[#This Row],[System Code]]","v":630},25,{"$f":"School_Listing[[#This Row],[System Code]]&School_Listing[[#This Row],[School Code]]","v":"63025"},"Montgomery Central High",{"$f":"School_Listing[[#This Row],[School Code]]","v":25}]
[630,"MONTGOMERY COUNTY",{"$f":"School_Listing[[#This Row],[System Code]]","v":630},52,{"$f":"School_Listing[[#This Row],[System Code]]&School_Listing[[#This Row],[School Code]]","v":"63052"},"Montgomery Central Middle",{"$f":"School_Listing[[#This Row],[School Code]]","v":52}]
[630,"MONTGOMERY COUNTY",{"$f":"School_Listing[[#This Row],[System Code]]","v":630},55,{"$f":"School_Listing[[#This Row],[System Code]]&School_Listing[[#This Row],[School Code]]","v":"63055"},"Moore Magnet Elementary",{"$f":"School_Listing[[#This Row],[School Code]]","v":55}]
[630,"MONTGOMERY COUNTY",{"$f":"School_Listing[[#This Row],[System Code]]","v":630},65,{"$f":"School_Listing[[#This Row],[System Code]]&School_Listing[[#This Row],[School Code]]","v":"63065"},"New Providence Middle",{"$f":"School_Listing[[#This Row],[School Code]]","v":65}]
[630,"MONTGOMERY COUNTY",{"$f":"School_Listing[[#This Row],[System Code]]","v":630},60,{"$f":"School_Listing[[#This Row],[System Code]]&School_Listing[[#This Row],[School Code]]","v":"63060"},"Norman Smith Elementary",{"$f":"School_Listing[[#This Row],[School Code]]","v":60}]
[630,"MONTGOMERY COUNTY",{"$f":"School_Listing[[#This Row],[System Code]]","v":630},66,{"$f":"School_Listing[[#This Row],[System Code]]&School_Listing[[#This Row],[School Code]]","v":"63066"},"Northeast Elementary",{"$f":"School_Listing[[#This Row],[School Code]]","v":66}]
[630,"MONTGOMERY COUNTY",{"$f":"School_Listing[[#This Row],[System Code]]","v":630},68,{"$f":"School_Listing[[#This Row],[System Code]]&School_Listing[[#This Row],[School Code]]","v":"63068"},"Northeast High",{"$f":"School_Listing[[#This Row],[School Code]]","v":68}]
[630,"MONTGOMERY COUNTY",{"$f":"School_Listing[[#This Row],[System Code]]","v":630},67,{"$f":"School_Listing[[#This Row],[System Code]]&School_Listing[[#This Row],[School Code]]","v":"63067"},"Northeast Middle",{"$f":"School_Listing[[#This Row],[School Code]]","v":67}]
[630,"MONTGOMERY COUNTY",{"$f":"School_Listing[[#This Row],[System Code]]","v":630},70,{"$f":"School_Listing[[#This Row],[System Code]]&School_Listing[[#This Row],[School Code]]","v":"63070"},"Northwest High",{"$f":"School_Listing[[#This Row],[School Code]]","v":70}]
[630,"MONTGOMERY COUNTY",{"$f":"School_Listing[[#This Row],[System Code]]","v":630},115,{"$f":"School_Listing[[#This Row],[System Code]]&School_Listing[[#This Row],[School Code]]","v":"630115"},"Oakland Elementary",{"$f":"School_Listing[[#This Row],[School Code]]","v":115}]
[630,"MONTGOMERY COUNTY",{"$f":"School_Listing[[#This Row],[System Code]]","v":630},110,{"$f":"School_Listing[[#This Row],[System Code]]&School_Listing[[#This Row],[School Code]]","v":"630110"},"Pisgah Elementary",{"$f":"School_Listing[[#This Row],[School Code]]","v":110}]
[630,"MONTGOMERY COUNTY",{"$f":"School_Listing[[#This Row],[System Code]]","v":630},73,{"$f":"School_Listing[[#This Row],[System Code]]&School_Listing[[#This Row],[School Code]]","v":"63073"},"Richview Middle",{"$f":"School_Listing[[#This Row],[School Code]]","v":73}]
[630,"MONTGOMERY COUNTY",{"$f":"School_Listing[[#This Row],[System Code]]","v":630},75,{"$f":"School_Listing[[#This Row],[System Code]]&School_Listing[[#This Row],[School Code]]","v":"63075"},"Ringgold Elementary",{"$f":"School_Listing[[#This Row],[School Code]]","v":75}]
[630,"MONTGOMERY COUNTY",{"$f":"School_Listing[[#This Row],[System Code]]","v":630},105,{"$f":"School_Listing[[#This Row],[System Code]]&School_Listing[[#This Row],[School Code]]","v":"630105"},"Rossview Elementary",{"$f":"School_Listing[[#This Row],[School Code]]","v":105}]
[630,"MONTGOMERY COUNTY",{"$f":"School_Listing[[#This Row],[System Code]]","v":630},78,{"$f":"School_Listing[[#This Row],[System Code]]&School_Listing[[#This Row],[School Code]]","v":"63078"},"Rossview High",{"$f":"School_Listing[[#This Row],[School Code]]","v":78}]
[630,"MONTGOMERY COUNTY",{"$f":"School_Listing[[#This Row],[System Code]]","v":630},77,{"$f":"School_Listing[[#This Row],[System Code]]&School_Listing[[#This Row],[School Code]]","v":"63077"},"Rossview Middle",{"$f":"School_Listing[[#This Row],[School Code]]","v":77}]
[630,"MONTGOMERY COUNTY",{"$f":"School_Listing[[#This Row],[System Code]]","v":630},83,{"$f":"School_Listing[[#This Row],[System Code]]&School_Listing[[#This Row],[School Code]]","v":"63083"},"Sango Elementary",{"$f":"School_Listing[[#This Row],[School Code]]","v":83}]
[630,"MONTGOMERY COUNTY",{"$f":"School_Listing[[#This Row],[System Code]]","v":630},82,{"$f":"School_Listing[[#This Row],[System Code]]&School_Listing[[#This Row],[School Code]]","v":"63082"},"Spanish Immersion @ Barksdale",{"$f":"School_Listing[[#This Row],[School Code]]","v":82}]
[630,"MONTGOMERY COUNTY",{"$f":"School_Listing[[#This Row],[System Code]]","v":630},80,{"$f":"School_Listing[[#This Row],[System Code]]&School_Listing[[#This Row],[School Code]]","v":"63080"},"St. Bethlehem Elementary",{"$f":"School_Listing[[#This Row],[School Code]]","v":80}]
[630,"MONTGOMERY COUNTY",{"$f":"School_Listing[[#This Row],[System Code]]","v":630},90,{"$f":"School_Listing[[#This Row],[System Code]]&School_Listing[[#This Row],[School Code]]","v":"63090"},"West Creek Elementary",{"$f":"School_Listing[[#This Row],[School Code]]","v":90}]
[630,"MONTGOMERY COUNTY",{"$f":"School_Listing[[#This Row],[System Code]]","v":630},100,{"$f":"School_Listing[[#This Row],[System Code]]&School_Listing[[#This Row],[School Code]]","v":"630100"},"West Creek High",{"$f":"School_Listing[[#This Row],[School Code]]","v":100}]
[630,"MONTGOMERY COUNTY",{"$f":"School_Listing[[#This Row],[System Code]]","v":630},84,{"$f":"School_Listing[[#This Row],[System Code]]&School_Listing[[#This Row],[School Code]]","v":"63084"},"West Creek Middle",{"$f":"School_Listing[[#This Row],[School Code]]","v":84}]
[630,"MONTGOMERY COUNTY",{"$f":"School_Listing[[#This Row],[System Code]]","v":630},85,{"$f":"School_Listing[[#This Row],[System Code]]&School_Listing[[#This Row],[School Code]]","v":"63085"},"Woodlawn Elementary",{"$f":"School_Listing[[#This Row],[School Code]]","v":85}]
[640,"MOORE COUNTY",{"$f":"School_Listing[[#This Row],[System Code]]","v":640},10,{"$f":"School_Listing[[#This Row],[System Code]]&School_Listing[[#This Row],[School Code]]","v":"64010"},"Lynchburg Elementary",{"$f":"School_Listing[[#This Row],[School Code]]","v":10}]
[640,"MOORE COUNTY",{"$f":"School_Listing[[#This Row],[System Code]]","v":640},15,{"$f":"School_Listing[[#This Row],[System Code]]&School_Listing[[#This Row],[School Code]]","v":"64015"},"Moore County High School",{"$f":"School_Listing[[#This Row],[School Code]]","v":15}]
[650,"MORGAN COUNTY",{"$f":"School_Listing[[#This Row],[System Code]]","v":650},10,{"$f":"School_Listing[[#This Row],[System Code]]&School_Listing[[#This Row],[School Code]]","v":"65010"},"Central Elementary",{"$f":"School_Listing[[#This Row],[School Code]]","v":10}]
[650,"MORGAN COUNTY",{"$f":"School_Listing[[#This Row],[System Code]]","v":650},15,{"$f":"School_Listing[[#This Row],[System Code]]&School_Listing[[#This Row],[School Code]]","v":"65015"},"Central High School",{"$f":"School_Listing[[#This Row],[School Code]]","v":15}]
[650,"MORGAN COUNTY",{"$f":"School_Listing[[#This Row],[System Code]]","v":650},13,{"$f":"School_Listing[[#This Row],[System Code]]&School_Listing[[#This Row],[School Code]]","v":"65013"},"Central Middle School",{"$f":"School_Listing[[#This Row],[School Code]]","v":13}]
[650,"MORGAN COUNTY",{"$f":"School_Listing[[#This Row],[System Code]]","v":650},30,{"$f":"School_Listing[[#This Row],[System Code]]&School_Listing[[#This Row],[School Code]]","v":"65030"},"Coalfield School",{"$f":"School_Listing[[#This Row],[School Code]]","v":30}]
[650,"MORGAN COUNTY",{"$f":"School_Listing[[#This Row],[System Code]]","v":650},46,{"$f":"School_Listing[[#This Row],[System Code]]&School_Listing[[#This Row],[School Code]]","v":"65046"},"Morgan County Career and Technical Center",{"$f":"School_Listing[[#This Row],[School Code]]","v":46}]
[650,"MORGAN COUNTY",{"$f":"School_Listing[[#This Row],[System Code]]","v":650},55,{"$f":"School_Listing[[#This Row],[System Code]]&School_Listing[[#This Row],[School Code]]","v":"65055"},"Oakdale School",{"$f":"School_Listing[[#This Row],[School Code]]","v":55}]
[650,"MORGAN COUNTY",{"$f":"School_Listing[[#This Row],[System Code]]","v":650},60,{"$f":"School_Listing[[#This Row],[System Code]]&School_Listing[[#This Row],[School Code]]","v":"65060"},"Petros Joyner Elementary",{"$f":"School_Listing[[#This Row],[School Code]]","v":60}]
[650,"MORGAN COUNTY",{"$f":"School_Listing[[#This Row],[System Code]]","v":650},70,{"$f":"School_Listing[[#This Row],[System Code]]&School_Listing[[#This Row],[School Code]]","v":"65070"},"Sunbright School",{"$f":"School_Listing[[#This Row],[School Code]]","v":70}]
[660,"OBION COUNTY",{"$f":"School_Listing[[#This Row],[System Code]]","v":660},7,{"$f":"School_Listing[[#This Row],[System Code]]&School_Listing[[#This Row],[School Code]]","v":"6607"},"Black Oak Elementary",{"$f":"School_Listing[[#This Row],[School Code]]","v":7}]
[660,"OBION COUNTY",{"$f":"School_Listing[[#This Row],[System Code]]","v":660},12,{"$f":"School_Listing[[#This Row],[System Code]]&School_Listing[[#This Row],[School Code]]","v":"66012"},"Hillcrest Elementary",{"$f":"School_Listing[[#This Row],[School Code]]","v":12}]
[660,"OBION COUNTY",{"$f":"School_Listing[[#This Row],[System Code]]","v":660},26,{"$f":"School_Listing[[#This Row],[System Code]]&School_Listing[[#This Row],[School Code]]","v":"66026"},"Lake Road Elementary",{"$f":"School_Listing[[#This Row],[School Code]]","v":26}]
[660,"OBION COUNTY",{"$f":"School_Listing[[#This Row],[System Code]]","v":660},35,{"$f":"School_Listing[[#This Row],[System Code]]&School_Listing[[#This Row],[School Code]]","v":"66035"},"Obion County Central High School",{"$f":"School_Listing[[#This Row],[School Code]]","v":35}]
[660,"OBION COUNTY",{"$f":"School_Listing[[#This Row],[System Code]]","v":660},38,{"$f":"School_Listing[[#This Row],[System Code]]&School_Listing[[#This Row],[School Code]]","v":"66038"},"Ridgemont Elementary",{"$f":"School_Listing[[#This Row],[School Code]]","v":38}]
[660,"OBION COUNTY",{"$f":"School_Listing[[#This Row],[System Code]]","v":660},45,{"$f":"School_Listing[[#This Row],[System Code]]&School_Listing[[#This Row],[School Code]]","v":"66045"},"South Fulton Elementary",{"$f":"School_Listing[[#This Row],[School Code]]","v":45}]
[660,"OBION COUNTY",{"$f":"School_Listing[[#This Row],[System Code]]","v":660},50,{"$f":"School_Listing[[#This Row],[System Code]]&School_Listing[[#This Row],[School Code]]","v":"66050"},"South Fulton Middle / High School",{"$f":"School_Listing[[#This Row],[School Code]]","v":50}]
[661,"UNION CITY",{"$f":"School_Listing[[#This Row],[System Code]]","v":661},10,{"$f":"School_Listing[[#This Row],[System Code]]&School_Listing[[#This Row],[School Code]]","v":"66110"},"Union City Elementary School",{"$f":"School_Listing[[#This Row],[School Code]]","v":10}]
[661,"UNION CITY",{"$f":"School_Listing[[#This Row],[System Code]]","v":661},15,{"$f":"School_Listing[[#This Row],[System Code]]&School_Listing[[#This Row],[School Code]]","v":"66115"},"Union City High School",{"$f":"School_Listing[[#This Row],[School Code]]","v":15}]
[661,"UNION CITY",{"$f":"School_Listing[[#This Row],[System Code]]","v":661},12,{"$f":"School_Listing[[#This Row],[System Code]]&School_Listing[[#This Row],[School Code]]","v":"66112"},"Union City Middle School",{"$f":"School_Listing[[#This Row],[School Code]]","v":12}]
[670,"OVERTON COUNTY",{"$f":"School_Listing[[#This Row],[System Code]]","v":670},65,{"$f":"School_Listing[[#This Row],[System Code]]&School_Listing[[#This Row],[School Code]]","v":"67065"},"A H Roberts Elementary",{"$f":"School_Listing[[#This Row],[School Code]]","v":65}]
[670,"OVERTON COUNTY",{"$f":"School_Listing[[#This Row],[System Code]]","v":670},5,{"$f":"School_Listing[[#This Row],[System Code]]&School_Listing[[#This Row],[School Code]]","v":"6705"},"Allons Elementary",{"$f":"School_Listing[[#This Row],[School Code]]","v":5}]
[670,"OVERTON COUNTY",{"$f":"School_Listing[[#This Row],[System Code]]","v":670},20,{"$f":"School_Listing[[#This Row],[System Code]]&School_Listing[[#This Row],[School Code]]","v":"67020"},"Hilham Elementary",{"$f":"School_Listing[[#This Row],[School Code]]","v":20}]
[670,"OVERTON COUNTY",{"$f":"School_Listing[[#This Row],[System Code]]","v":670},30,{"$f":"School_Listing[[#This Row],[System Code]]&School_Listing[[#This Row],[School Code]]","v":"67030"},"Livingston Academy",{"$f":"School_Listing[[#This Row],[School Code]]","v":30}]
[670,"OVERTON COUNTY",{"$f":"School_Listing[[#This Row],[System Code]]","v":670},35,{"$f":"School_Listing[[#This Row],[System Code]]&School_Listing[[#This Row],[School Code]]","v":"67035"},"Livingston Middle School",{"$f":"School_Listing[[#This Row],[School Code]]","v":35}]
[670,"OVERTON COUNTY",{"$f":"School_Listing[[#This Row],[System Code]]","v":670},39,{"$f":"School_Listing[[#This Row],[System Code]]&School_Listing[[#This Row],[School Code]]","v":"67039"},"Overton County Virtual School",{"$f":"School_Listing[[#This Row],[School Code]]","v":39}]
[670,"OVERTON COUNTY",{"$f":"School_Listing[[#This Row],[System Code]]","v":670},47,{"$f":"School_Listing[[#This Row],[System Code]]&School_Listing[[#This Row],[School Code]]","v":"67047"},"R.E.A.C.H. Academy",{"$f":"School_Listing[[#This Row],[School Code]]","v":47}]
[670,"OVERTON COUNTY",{"$f":"School_Listing[[#This Row],[System Code]]","v":670},50,{"$f":"School_Listing[[#This Row],[System Code]]&School_Listing[[#This Row],[School Code]]","v":"67050"},"Rickman Elementary",{"$f":"School_Listing[[#This Row],[School Code]]","v":50}]
[670,"OVERTON COUNTY",{"$f":"School_Listing[[#This Row],[System Code]]","v":670},60,{"$f":"School_Listing[[#This Row],[System Code]]&School_Listing[[#This Row],[School Code]]","v":"67060"},"Wilson Elementary",{"$f":"School_Listing[[#This Row],[School Code]]","v":60}]
[680,"PERRY COUNTY",{"$f":"School_Listing[[#This Row],[System Code]]","v":680},15,{"$f":"School_Listing[[#This Row],[System Code]]&School_Listing[[#This Row],[School Code]]","v":"68015"},"Linden Elementary",{"$f":"School_Listing[[#This Row],[School Code]]","v":15}]
[680,"PERRY COUNTY",{"$f":"School_Listing[[#This Row],[System Code]]","v":680},25,{"$f":"School_Listing[[#This Row],[System Code]]&School_Listing[[#This Row],[School Code]]","v":"68025"},"Linden Middle School",{"$f":"School_Listing[[#This Row],[School Code]]","v":25}]
[680,"PERRY COUNTY",{"$f":"School_Listing[[#This Row],[System Code]]","v":680},20,{"$f":"School_Listing[[#This Row],[System Code]]&School_Listing[[#This Row],[School Code]]","v":"68020"},"Lobelville Elementary",{"$f":"School_Listing[[#This Row],[School Code]]","v":20}]
[680,"PERRY COUNTY",{"$f":"School_Listing[[#This Row],[System Code]]","v":680},27,{"$f":"School_Listing[[#This Row],[System Code]]&School_Listing[[#This Row],[School Code]]","v":"68027"},"Perry County High School",{"$f":"School_Listing[[#This Row],[School Code]]","v":27}]
[680,"PERRY COUNTY",{"$f":"School_Listing[[#This Row],[System Code]]","v":680},40,{"$f":"School_Listing[[#This Row],[System Code]]&School_Listing[[#This Row],[School Code]]","v":"68040"},"Perry County Virtual School",{"$f":"School_Listing[[#This Row],[School Code]]","v":40}]
[690,"PICKETT COUNTY",{"$f":"School_Listing[[#This Row],[System Code]]","v":690},5,{"$f":"School_Listing[[#This Row],[System Code]]&School_Listing[[#This Row],[School Code]]","v":"6905"},"Pickett Co High School",{"$f":"School_Listing[[#This Row],[School Code]]","v":5}]
[690,"PICKETT COUNTY",{"$f":"School_Listing[[#This Row],[System Code]]","v":690},10,{"$f":"School_Listing[[#This Row],[System Code]]&School_Listing[[#This Row],[School Code]]","v":"69010"},"Pickett County Elementary",{"$f":"School_Listing[[#This Row],[School Code]]","v":10}]
[700,"POLK COUNTY",{"$f":"School_Listing[[#This Row],[System Code]]","v":700},5,{"$f":"School_Listing[[#This Row],[System Code]]&School_Listing[[#This Row],[School Code]]","v":"7005"},"Benton Elementary",{"$f":"School_Listing[[#This Row],[School Code]]","v":5}]
[700,"POLK COUNTY",{"$f":"School_Listing[[#This Row],[System Code]]","v":700},50,{"$f":"School_Listing[[#This Row],[System Code]]&School_Listing[[#This Row],[School Code]]","v":"70050"},"Chilhowee Middle School",{"$f":"School_Listing[[#This Row],[School Code]]","v":50}]
[700,"POLK COUNTY",{"$f":"School_Listing[[#This Row],[System Code]]","v":700},10,{"$f":"School_Listing[[#This Row],[System Code]]&School_Listing[[#This Row],[School Code]]","v":"70010"},"Copper Basin Elementary School",{"$f":"School_Listing[[#This Row],[School Code]]","v":10}]
[700,"POLK COUNTY",{"$f":"School_Listing[[#This Row],[System Code]]","v":700},15,{"$f":"School_Listing[[#This Row],[System Code]]&School_Listing[[#This Row],[School Code]]","v":"70015"},"Copper Basin High School",{"$f":"School_Listing[[#This Row],[School Code]]","v":15}]
[700,"POLK COUNTY",{"$f":"School_Listing[[#This Row],[System Code]]","v":700},53,{"$f":"School_Listing[[#This Row],[System Code]]&School_Listing[[#This Row],[School Code]]","v":"70053"},"Polk County High School",{"$f":"School_Listing[[#This Row],[School Code]]","v":53}]
[700,"POLK COUNTY",{"$f":"School_Listing[[#This Row],[System Code]]","v":700},70,{"$f":"School_Listing[[#This Row],[System Code]]&School_Listing[[#This Row],[School Code]]","v":"70070"},"Polk Innovative Learning Academy",{"$f":"School_Listing[[#This Row],[School Code]]","v":70}]
[700,"POLK COUNTY",{"$f":"School_Listing[[#This Row],[System Code]]","v":700},57,{"$f":"School_Listing[[#This Row],[System Code]]&School_Listing[[#This Row],[School Code]]","v":"70057"},"South Polk Elementary",{"$f":"School_Listing[[#This Row],[School Code]]","v":57}]
[710,"PUTNAM COUNTY",{"$f":"School_Listing[[#This Row],[System Code]]","v":710},5,{"$f":"School_Listing[[#This Row],[System Code]]&School_Listing[[#This Row],[School Code]]","v":"7105"},"Algood Elementary",{"$f":"School_Listing[[#This Row],[School Code]]","v":5}]
[710,"PUTNAM COUNTY",{"$f":"School_Listing[[#This Row],[System Code]]","v":710},8,{"$f":"School_Listing[[#This Row],[System Code]]&School_Listing[[#This Row],[School Code]]","v":"7108"},"Algood Middle School",{"$f":"School_Listing[[#This Row],[School Code]]","v":8}]
[710,"PUTNAM COUNTY",{"$f":"School_Listing[[#This Row],[System Code]]","v":710},65,{"$f":"School_Listing[[#This Row],[System Code]]&School_Listing[[#This Row],[School Code]]","v":"71065"},"Avery Trace Middle School",{"$f":"School_Listing[[#This Row],[School Code]]","v":65}]
[710,"PUTNAM COUNTY",{"$f":"School_Listing[[#This Row],[System Code]]","v":710},17,{"$f":"School_Listing[[#This Row],[System Code]]&School_Listing[[#This Row],[School Code]]","v":"71017"},"Baxter Primary",{"$f":"School_Listing[[#This Row],[School Code]]","v":17}]
[710,"PUTNAM COUNTY",{"$f":"School_Listing[[#This Row],[System Code]]","v":710},25,{"$f":"School_Listing[[#This Row],[System Code]]&School_Listing[[#This Row],[School Code]]","v":"71025"},"Burks Elementary",{"$f":"School_Listing[[#This Row],[School Code]]","v":25}]
[710,"PUTNAM COUNTY",{"$f":"School_Listing[[#This Row],[System Code]]","v":710},30,{"$f":"School_Listing[[#This Row],[System Code]]&School_Listing[[#This Row],[School Code]]","v":"71030"},"Cane Creek Elementary",{"$f":"School_Listing[[#This Row],[School Code]]","v":30}]
[710,"PUTNAM COUNTY",{"$f":"School_Listing[[#This Row],[System Code]]","v":710},35,{"$f":"School_Listing[[#This Row],[System Code]]&School_Listing[[#This Row],[School Code]]","v":"71035"},"Capshaw Elementary",{"$f":"School_Listing[[#This Row],[School Code]]","v":35}]
[710,"PUTNAM COUNTY",{"$f":"School_Listing[[#This Row],[System Code]]","v":710},37,{"$f":"School_Listing[[#This Row],[System Code]]&School_Listing[[#This Row],[School Code]]","v":"71037"},"Cookeville High School",{"$f":"School_Listing[[#This Row],[School Code]]","v":37}]
[710,"PUTNAM COUNTY",{"$f":"School_Listing[[#This Row],[System Code]]","v":710},15,{"$f":"School_Listing[[#This Row],[System Code]]&School_Listing[[#This Row],[School Code]]","v":"71015"},"Cornerstone Elementary",{"$f":"School_Listing[[#This Row],[School Code]]","v":15}]
[710,"PUTNAM COUNTY",{"$f":"School_Listing[[#This Row],[System Code]]","v":710},50,{"$f":"School_Listing[[#This Row],[System Code]]&School_Listing[[#This Row],[School Code]]","v":"71050"},"Jere Whitson Elementary",{"$f":"School_Listing[[#This Row],[School Code]]","v":50}]
[710,"PUTNAM COUNTY",{"$f":"School_Listing[[#This Row],[System Code]]","v":710},55,{"$f":"School_Listing[[#This Row],[System Code]]&School_Listing[[#This Row],[School Code]]","v":"71055"},"Monterey High School",{"$f":"School_Listing[[#This Row],[School Code]]","v":55}]
[710,"PUTNAM COUNTY",{"$f":"School_Listing[[#This Row],[System Code]]","v":710},57,{"$f":"School_Listing[[#This Row],[System Code]]&School_Listing[[#This Row],[School Code]]","v":"71057"},"Northeast Elementary",{"$f":"School_Listing[[#This Row],[School Code]]","v":57}]
[710,"PUTNAM COUNTY",{"$f":"School_Listing[[#This Row],[System Code]]","v":710},60,{"$f":"School_Listing[[#This Row],[System Code]]&School_Listing[[#This Row],[School Code]]","v":"71060"},"Park View Elementary",{"$f":"School_Listing[[#This Row],[School Code]]","v":60}]
[710,"PUTNAM COUNTY",{"$f":"School_Listing[[#This Row],[System Code]]","v":710},95,{"$f":"School_Listing[[#This Row],[System Code]]&School_Listing[[#This Row],[School Code]]","v":"71095"},"Prescott South Elementary",{"$f":"School_Listing[[#This Row],[School Code]]","v":95}]
[710,"PUTNAM COUNTY",{"$f":"School_Listing[[#This Row],[System Code]]","v":710},100,{"$f":"School_Listing[[#This Row],[System Code]]&School_Listing[[#This Row],[School Code]]","v":"710100"},"Prescott South Middle School",{"$f":"School_Listing[[#This Row],[School Code]]","v":100}]
[710,"PUTNAM COUNTY",{"$f":"School_Listing[[#This Row],[System Code]]","v":710},63,{"$f":"School_Listing[[#This Row],[System Code]]&School_Listing[[#This Row],[School Code]]","v":"71063"},"Putnam Co Adult High School",{"$f":"School_Listing[[#This Row],[School Code]]","v":63}]
[710,"PUTNAM COUNTY",{"$f":"School_Listing[[#This Row],[System Code]]","v":710},6,{"$f":"School_Listing[[#This Row],[System Code]]&School_Listing[[#This Row],[School Code]]","v":"7106"},"Putnam County VITAL",{"$f":"School_Listing[[#This Row],[School Code]]","v":6}]
[710,"PUTNAM COUNTY",{"$f":"School_Listing[[#This Row],[System Code]]","v":710},70,{"$f":"School_Listing[[#This Row],[System Code]]&School_Listing[[#This Row],[School Code]]","v":"71070"},"Sycamore Elementary",{"$f":"School_Listing[[#This Row],[School Code]]","v":70}]
[710,"PUTNAM COUNTY",{"$f":"School_Listing[[#This Row],[System Code]]","v":710},7001,{"$f":"School_Listing[[#This Row],[System Code]]&School_Listing[[#This Row],[School Code]]","v":"7107001"},"T T U Child Development Lab",{"$f":"School_Listing[[#This Row],[School Code]]","v":7001}]
[710,"PUTNAM COUNTY",{"$f":"School_Listing[[#This Row],[System Code]]","v":710},90,{"$f":"School_Listing[[#This Row],[System Code]]&School_Listing[[#This Row],[School Code]]","v":"71090"},"Upperman High School",{"$f":"School_Listing[[#This Row],[School Code]]","v":90}]
[710,"PUTNAM COUNTY",{"$f":"School_Listing[[#This Row],[System Code]]","v":710},110,{"$f":"School_Listing[[#This Row],[System Code]]&School_Listing[[#This Row],[School Code]]","v":"710110"},"Upperman Middle School",{"$f":"School_Listing[[#This Row],[School Code]]","v":110}]
[710,"PUTNAM COUNTY",{"$f":"School_Listing[[#This Row],[System Code]]","v":710},105,{"$f":"School_Listing[[#This Row],[System Code]]&School_Listing[[#This Row],[School Code]]","v":"710105"},"White Plains Academy",{"$f":"School_Listing[[#This Row],[School Code]]","v":105}]
[720,"RHEA COUNTY",{"$f":"School_Listing[[#This Row],[System Code]]","v":720},10,{"$f":"School_Listing[[#This Row],[System Code]]&School_Listing[[#This Row],[School Code]]","v":"72010"},"Frazier Elementary",{"$f":"School_Listing[[#This Row],[School Code]]","v":10}]
[720,"RHEA COUNTY",{"$f":"School_Listing[[#This Row],[System Code]]","v":720},20,{"$f":"School_Listing[[#This Row],[System Code]]&School_Listing[[#This Row],[School Code]]","v":"72020"},"Graysville Elementary School",{"$f":"School_Listing[[#This Row],[School Code]]","v":20}]
[720,"RHEA COUNTY",{"$f":"School_Listing[[#This Row],[System Code]]","v":720},65,{"$f":"School_Listing[[#This Row],[System Code]]&School_Listing[[#This Row],[School Code]]","v":"72065"},"Rhea Central Elementary",{"$f":"School_Listing[[#This Row],[School Code]]","v":65}]
[720,"RHEA COUNTY",{"$f":"School_Listing[[#This Row],[System Code]]","v":720},32,{"$f":"School_Listing[[#This Row],[System Code]]&School_Listing[[#This Row],[School Code]]","v":"72032"},"Rhea County High School",{"$f":"School_Listing[[#This Row],[School Code]]","v":32}]
[720,"RHEA COUNTY",{"$f":"School_Listing[[#This Row],[System Code]]","v":720},70,{"$f":"School_Listing[[#This Row],[System Code]]&School_Listing[[#This Row],[School Code]]","v":"72070"},"Rhea Middle School",{"$f":"School_Listing[[#This Row],[School Code]]","v":70}]
[720,"RHEA COUNTY",{"$f":"School_Listing[[#This Row],[System Code]]","v":720},40,{"$f":"School_Listing[[#This Row],[System Code]]&School_Listing[[#This Row],[School Code]]","v":"72040"},"Spring City Elementary",{"$f":"School_Listing[[#This Row],[School Code]]","v":40}]
[720,"RHEA COUNTY",{"$f":"School_Listing[[#This Row],[System Code]]","v":720},50,{"$f":"School_Listing[[#This Row],[System Code]]&School_Listing[[#This Row],[School Code]]","v":"72050"},"Spring City Middle School",{"$f":"School_Listing[[#This Row],[School Code]]","v":50}]
[721,"DAYTON",{"$f":"School_Listing[[#This Row],[System Code]]","v":721},5,{"$f":"School_Listing[[#This Row],[System Code]]&School_Listing[[#This Row],[School Code]]","v":"7215"},"Dayton City Elementary",{"$f":"School_Listing[[#This Row],[School Code]]","v":5}]
[730,"ROANE COUNTY",{"$f":"School_Listing[[#This Row],[System Code]]","v":730},28,{"$f":"School_Listing[[#This Row],[System Code]]&School_Listing[[#This Row],[School Code]]","v":"73028"},"Bowers Elementary",{"$f":"School_Listing[[#This Row],[School Code]]","v":28}]
[730,"ROANE COUNTY",{"$f":"School_Listing[[#This Row],[System Code]]","v":730},5,{"$f":"School_Listing[[#This Row],[System Code]]&School_Listing[[#This Row],[School Code]]","v":"7305"},"Cherokee Middle School",{"$f":"School_Listing[[#This Row],[School Code]]","v":5}]
[730,"ROANE COUNTY",{"$f":"School_Listing[[#This Row],[System Code]]","v":730},95,{"$f":"School_Listing[[#This Row],[System Code]]&School_Listing[[#This Row],[School Code]]","v":"73095"},"Dyllis Springs Elementary",{"$f":"School_Listing[[#This Row],[School Code]]","v":95}]
[730,"ROANE COUNTY",{"$f":"School_Listing[[#This Row],[System Code]]","v":730},15,{"$f":"School_Listing[[#This Row],[System Code]]&School_Listing[[#This Row],[School Code]]","v":"73015"},"Harriman High School",{"$f":"School_Listing[[#This Row],[School Code]]","v":15}]
[730,"ROANE COUNTY",{"$f":"School_Listing[[#This Row],[System Code]]","v":730},14,{"$f":"School_Listing[[#This Row],[System Code]]&School_Listing[[#This Row],[School Code]]","v":"73014"},"Harriman Middle School",{"$f":"School_Listing[[#This Row],[School Code]]","v":14}]
[730,"ROANE COUNTY",{"$f":"School_Listing[[#This Row],[System Code]]","v":730},35,{"$f":"School_Listing[[#This Row],[System Code]]&School_Listing[[#This Row],[School Code]]","v":"73035"},"Kingston Elementary",{"$f":"School_Listing[[#This Row],[School Code]]","v":35}]
[730,"ROANE COUNTY",{"$f":"School_Listing[[#This Row],[System Code]]","v":730},81,{"$f":"School_Listing[[#This Row],[System Code]]&School_Listing[[#This Row],[School Code]]","v":"73081"},"Midtown Educational Center",{"$f":"School_Listing[[#This Row],[School Code]]","v":81}]
[730,"ROANE COUNTY",{"$f":"School_Listing[[#This Row],[System Code]]","v":730},45,{"$f":"School_Listing[[#This Row],[System Code]]&School_Listing[[#This Row],[School Code]]","v":"73045"},"Midtown Elementary",{"$f":"School_Listing[[#This Row],[School Code]]","v":45}]
[730,"ROANE COUNTY",{"$f":"School_Listing[[#This Row],[System Code]]","v":730},47,{"$f":"School_Listing[[#This Row],[System Code]]&School_Listing[[#This Row],[School Code]]","v":"73047"},"Midway Elementary",{"$f":"School_Listing[[#This Row],[School Code]]","v":47}]
[730,"ROANE COUNTY",{"$f":"School_Listing[[#This Row],[System Code]]","v":730},50,{"$f":"School_Listing[[#This Row],[System Code]]&School_Listing[[#This Row],[School Code]]","v":"73050"},"Midway High School",{"$f":"School_Listing[[#This Row],[School Code]]","v":50}]
[730,"ROANE COUNTY",{"$f":"School_Listing[[#This Row],[System Code]]","v":730},48,{"$f":"School_Listing[[#This Row],[System Code]]&School_Listing[[#This Row],[School Code]]","v":"73048"},"Midway Middle School",{"$f":"School_Listing[[#This Row],[School Code]]","v":48}]
[730,"ROANE COUNTY",{"$f":"School_Listing[[#This Row],[System Code]]","v":730},65,{"$f":"School_Listing[[#This Row],[System Code]]&School_Listing[[#This Row],[School Code]]","v":"73065"},"Oliver Springs High School",{"$f":"School_Listing[[#This Row],[School Code]]","v":65}]
[730,"ROANE COUNTY",{"$f":"School_Listing[[#This Row],[System Code]]","v":730},60,{"$f":"School_Listing[[#This Row],[System Code]]&School_Listing[[#This Row],[School Code]]","v":"73060"},"Oliver Springs Middle",{"$f":"School_Listing[[#This Row],[School Code]]","v":60}]
[730,"ROANE COUNTY",{"$f":"School_Listing[[#This Row],[System Code]]","v":730},77,{"$f":"School_Listing[[#This Row],[System Code]]&School_Listing[[#This Row],[School Code]]","v":"73077"},"Ridge View Elementary",{"$f":"School_Listing[[#This Row],[School Code]]","v":77}]
[730,"ROANE COUNTY",{"$f":"School_Listing[[#This Row],[System Code]]","v":730},80,{"$f":"School_Listing[[#This Row],[System Code]]&School_Listing[[#This Row],[School Code]]","v":"73080"},"Roane County High School",{"$f":"School_Listing[[#This Row],[School Code]]","v":80}]
[730,"ROANE COUNTY",{"$f":"School_Listing[[#This Row],[System Code]]","v":730},84,{"$f":"School_Listing[[#This Row],[System Code]]&School_Listing[[#This Row],[School Code]]","v":"73084"},"Roane County Virtual Academy",{"$f":"School_Listing[[#This Row],[School Code]]","v":84}]
[730,"ROANE COUNTY",{"$f":"School_Listing[[#This Row],[System Code]]","v":730},85,{"$f":"School_Listing[[#This Row],[System Code]]&School_Listing[[#This Row],[School Code]]","v":"73085"},"Rockwood High School",{"$f":"School_Listing[[#This Row],[School Code]]","v":85}]
[730,"ROANE COUNTY",{"$f":"School_Listing[[#This Row],[System Code]]","v":730},90,{"$f":"School_Listing[[#This Row],[System Code]]&School_Listing[[#This Row],[School Code]]","v":"73090"},"Rockwood Middle School",{"$f":"School_Listing[[#This Row],[School Code]]","v":90}]
[740,"ROBERTSON COUNTY",{"$f":"School_Listing[[#This Row],[System Code]]","v":740},10,{"$f":"School_Listing[[#This Row],[System Code]]&School_Listing[[#This Row],[School Code]]","v":"74010"},"Bransford Elementary",{"$f":"School_Listing[[#This Row],[School Code]]","v":10}]
[740,"ROBERTSON COUNTY",{"$f":"School_Listing[[#This Row],[System Code]]","v":740},20,{"$f":"School_Listing[[#This Row],[System Code]]&School_Listing[[#This Row],[School Code]]","v":"74020"},"Cheatham Park Elementary",{"$f":"School_Listing[[#This Row],[School Code]]","v":20}]
[740,"ROBERTSON COUNTY",{"$f":"School_Listing[[#This Row],[System Code]]","v":740},25,{"$f":"School_Listing[[#This Row],[System Code]]&School_Listing[[#This Row],[School Code]]","v":"74025"},"Coopertown Elementary",{"$f":"School_Listing[[#This Row],[School Code]]","v":25}]
[740,"ROBERTSON COUNTY",{"$f":"School_Listing[[#This Row],[System Code]]","v":740},26,{"$f":"School_Listing[[#This Row],[System Code]]&School_Listing[[#This Row],[School Code]]","v":"74026"},"Coopertown Middle School",{"$f":"School_Listing[[#This Row],[School Code]]","v":26}]
[740,"ROBERTSON COUNTY",{"$f":"School_Listing[[#This Row],[System Code]]","v":740},15,{"$f":"School_Listing[[#This Row],[System Code]]&School_Listing[[#This Row],[School Code]]","v":"74015"},"Crestview Elementary School",{"$f":"School_Listing[[#This Row],[School Code]]","v":15}]
[740,"ROBERTSON COUNTY",{"$f":"School_Listing[[#This Row],[System Code]]","v":740},28,{"$f":"School_Listing[[#This Row],[System Code]]&School_Listing[[#This Row],[School Code]]","v":"74028"},"East Robertson Elementary",{"$f":"School_Listing[[#This Row],[School Code]]","v":28}]
[740,"ROBERTSON COUNTY",{"$f":"School_Listing[[#This Row],[System Code]]","v":740},32,{"$f":"School_Listing[[#This Row],[System Code]]&School_Listing[[#This Row],[School Code]]","v":"74032"},"East Robertson High School",{"$f":"School_Listing[[#This Row],[School Code]]","v":32}]
[740,"ROBERTSON COUNTY",{"$f":"School_Listing[[#This Row],[System Code]]","v":740},35,{"$f":"School_Listing[[#This Row],[System Code]]&School_Listing[[#This Row],[School Code]]","v":"74035"},"Greenbrier Elementary",{"$f":"School_Listing[[#This Row],[School Code]]","v":35}]
[740,"ROBERTSON COUNTY",{"$f":"School_Listing[[#This Row],[System Code]]","v":740},40,{"$f":"School_Listing[[#This Row],[System Code]]&School_Listing[[#This Row],[School Code]]","v":"74040"},"Greenbrier High School",{"$f":"School_Listing[[#This Row],[School Code]]","v":40}]
[740,"ROBERTSON COUNTY",{"$f":"School_Listing[[#This Row],[System Code]]","v":740},38,{"$f":"School_Listing[[#This Row],[System Code]]&School_Listing[[#This Row],[School Code]]","v":"74038"},"Greenbrier Middle School",{"$f":"School_Listing[[#This Row],[School Code]]","v":38}]
[740,"ROBERTSON COUNTY",{"$f":"School_Listing[[#This Row],[System Code]]","v":740},75,{"$f":"School_Listing[[#This Row],[System Code]]&School_Listing[[#This Row],[School Code]]","v":"74075"},"Innovation Academy of Robertson County",{"$f":"School_Listing[[#This Row],[School Code]]","v":75}]
[740,"ROBERTSON COUNTY",{"$f":"School_Listing[[#This Row],[System Code]]","v":740},48,{"$f":"School_Listing[[#This Row],[System Code]]&School_Listing[[#This Row],[School Code]]","v":"74048"},"Jo Byrns Elementary School",{"$f":"School_Listing[[#This Row],[School Code]]","v":48}]
[740,"ROBERTSON COUNTY",{"$f":"School_Listing[[#This Row],[System Code]]","v":740},45,{"$f":"School_Listing[[#This Row],[System Code]]&School_Listing[[#This Row],[School Code]]","v":"74045"},"Jo Byrns High School",{"$f":"School_Listing[[#This Row],[School Code]]","v":45}]
[740,"ROBERTSON COUNTY",{"$f":"School_Listing[[#This Row],[System Code]]","v":740},50,{"$f":"School_Listing[[#This Row],[System Code]]&School_Listing[[#This Row],[School Code]]","v":"74050"},"Krisle Elementary",{"$f":"School_Listing[[#This Row],[School Code]]","v":50}]
[740,"ROBERTSON COUNTY",{"$f":"School_Listing[[#This Row],[System Code]]","v":740},55,{"$f":"School_Listing[[#This Row],[System Code]]&School_Listing[[#This Row],[School Code]]","v":"74055"},"Robert F. Woodall Elementary",{"$f":"School_Listing[[#This Row],[School Code]]","v":55}]
[740,"ROBERTSON COUNTY",{"$f":"School_Listing[[#This Row],[System Code]]","v":740},95,{"$f":"School_Listing[[#This Row],[System Code]]&School_Listing[[#This Row],[School Code]]","v":"74095"},"Robertson Co. Virtual School",{"$f":"School_Listing[[#This Row],[School Code]]","v":95}]
[740,"ROBERTSON COUNTY",{"$f":"School_Listing[[#This Row],[System Code]]","v":740},98,{"$f":"School_Listing[[#This Row],[System Code]]&School_Listing[[#This Row],[School Code]]","v":"74098"},"Robertson County Adult High School",{"$f":"School_Listing[[#This Row],[School Code]]","v":98}]
[740,"ROBERTSON COUNTY",{"$f":"School_Listing[[#This Row],[System Code]]","v":740},100,{"$f":"School_Listing[[#This Row],[System Code]]&School_Listing[[#This Row],[School Code]]","v":"740100"},"Robertson County Phoenix Academy",{"$f":"School_Listing[[#This Row],[School Code]]","v":100}]
[740,"ROBERTSON COUNTY",{"$f":"School_Listing[[#This Row],[System Code]]","v":740},70,{"$f":"School_Listing[[#This Row],[System Code]]&School_Listing[[#This Row],[School Code]]","v":"74070"},"Springfield High School",{"$f":"School_Listing[[#This Row],[School Code]]","v":70}]
[740,"ROBERTSON COUNTY",{"$f":"School_Listing[[#This Row],[System Code]]","v":740},80,{"$f":"School_Listing[[#This Row],[System Code]]&School_Listing[[#This Row],[School Code]]","v":"74080"},"Watauga Elementary",{"$f":"School_Listing[[#This Row],[School Code]]","v":80}]
[740,"ROBERTSON COUNTY",{"$f":"School_Listing[[#This Row],[System Code]]","v":740},85,{"$f":"School_Listing[[#This Row],[System Code]]&School_Listing[[#This Row],[School Code]]","v":"74085"},"Westside Elementary",{"$f":"School_Listing[[#This Row],[School Code]]","v":85}]
[740,"ROBERTSON COUNTY",{"$f":"School_Listing[[#This Row],[System Code]]","v":740},88,{"$f":"School_Listing[[#This Row],[System Code]]&School_Listing[[#This Row],[School Code]]","v":"74088"},"White House Heritage Elementary School",{"$f":"School_Listing[[#This Row],[School Code]]","v":88}]
[740,"ROBERTSON COUNTY",{"$f":"School_Listing[[#This Row],[System Code]]","v":740},90,{"$f":"School_Listing[[#This Row],[System Code]]&School_Listing[[#This Row],[School Code]]","v":"74090"},"White House Heritage High School",{"$f":"School_Listing[[#This Row],[School Code]]","v":90}]
[750,"RUTHERFORD COUNTY",{"$f":"School_Listing[[#This Row],[System Code]]","v":750},3,{"$f":"School_Listing[[#This Row],[System Code]]&School_Listing[[#This Row],[School Code]]","v":"7503"},"Barfield Elementary",{"$f":"School_Listing[[#This Row],[School Code]]","v":3}]
[750,"RUTHERFORD COUNTY",{"$f":"School_Listing[[#This Row],[System Code]]","v":750},1,{"$f":"School_Listing[[#This Row],[System Code]]&School_Listing[[#This Row],[School Code]]","v":"7501"},"Blackman Elementary School",{"$f":"School_Listing[[#This Row],[School Code]]","v":1}]
[750,"RUTHERFORD COUNTY",{"$f":"School_Listing[[#This Row],[System Code]]","v":750},4,{"$f":"School_Listing[[#This Row],[System Code]]&School_Listing[[#This Row],[School Code]]","v":"7504"},"Blackman High School",{"$f":"School_Listing[[#This Row],[School Code]]","v":4}]
[750,"RUTHERFORD COUNTY",{"$f":"School_Listing[[#This Row],[System Code]]","v":750},2,{"$f":"School_Listing[[#This Row],[System Code]]&School_Listing[[#This Row],[School Code]]","v":"7502"},"Blackman Middle School",{"$f":"School_Listing[[#This Row],[School Code]]","v":2}]
[750,"RUTHERFORD COUNTY",{"$f":"School_Listing[[#This Row],[System Code]]","v":750},39,{"$f":"School_Listing[[#This Row],[System Code]]&School_Listing[[#This Row],[School Code]]","v":"75039"},"Brown's Chapel Elementary School",{"$f":"School_Listing[[#This Row],[School Code]]","v":39}]
[750,"RUTHERFORD COUNTY",{"$f":"School_Listing[[#This Row],[System Code]]","v":750},5,{"$f":"School_Listing[[#This Row],[System Code]]&School_Listing[[#This Row],[School Code]]","v":"7505"},"Buchanan Elementary",{"$f":"School_Listing[[#This Row],[School Code]]","v":5}]
[750,"RUTHERFORD COUNTY",{"$f":"School_Listing[[#This Row],[System Code]]","v":750},8,{"$f":"School_Listing[[#This Row],[System Code]]&School_Listing[[#This Row],[School Code]]","v":"7508"},"Cedar Grove Elementary",{"$f":"School_Listing[[#This Row],[School Code]]","v":8}]
[750,"RUTHERFORD COUNTY",{"$f":"School_Listing[[#This Row],[System Code]]","v":750},15,{"$f":"School_Listing[[#This Row],[System Code]]&School_Listing[[#This Row],[School Code]]","v":"75015"},"Central Magnet School",{"$f":"School_Listing[[#This Row],[School Code]]","v":15}]
[750,"RUTHERFORD COUNTY",{"$f":"School_Listing[[#This Row],[System Code]]","v":750},20,{"$f":"School_Listing[[#This Row],[System Code]]&School_Listing[[#This Row],[School Code]]","v":"75020"},"Christiana Elementary",{"$f":"School_Listing[[#This Row],[School Code]]","v":20}]
[750,"RUTHERFORD COUNTY",{"$f":"School_Listing[[#This Row],[System Code]]","v":750},23,{"$f":"School_Listing[[#This Row],[System Code]]&School_Listing[[#This Row],[School Code]]","v":"75023"},"Christiana Middle School",{"$f":"School_Listing[[#This Row],[School Code]]","v":23}]
[750,"RUTHERFORD COUNTY",{"$f":"School_Listing[[#This Row],[System Code]]","v":750},27,{"$f":"School_Listing[[#This Row],[System Code]]&School_Listing[[#This Row],[School Code]]","v":"75027"},"Daniel McKee Alternative School",{"$f":"School_Listing[[#This Row],[School Code]]","v":27}]
[750,"RUTHERFORD COUNTY",{"$f":"School_Listing[[#This Row],[System Code]]","v":750},28,{"$f":"School_Listing[[#This Row],[System Code]]&School_Listing[[#This Row],[School Code]]","v":"75028"},"David Youree Elementary",{"$f":"School_Listing[[#This Row],[School Code]]","v":28}]
[750,"RUTHERFORD COUNTY",{"$f":"School_Listing[[#This Row],[System Code]]","v":750},35,{"$f":"School_Listing[[#This Row],[System Code]]&School_Listing[[#This Row],[School Code]]","v":"75035"},"Eagleville School",{"$f":"School_Listing[[#This Row],[School Code]]","v":35}]
[750,"RUTHERFORD COUNTY",{"$f":"School_Listing[[#This Row],[System Code]]","v":750},37,{"$f":"School_Listing[[#This Row],[System Code]]&School_Listing[[#This Row],[School Code]]","v":"75037"},"Holloway High School",{"$f":"School_Listing[[#This Row],[School Code]]","v":37}]
[750,"RUTHERFORD COUNTY",{"$f":"School_Listing[[#This Row],[System Code]]","v":750},65,{"$f":"School_Listing[[#This Row],[System Code]]&School_Listing[[#This Row],[School Code]]","v":"75065"},"Homer Pittard Campus School",{"$f":"School_Listing[[#This Row],[School Code]]","v":65}]
[750,"RUTHERFORD COUNTY",{"$f":"School_Listing[[#This Row],[System Code]]","v":750},25,{"$f":"School_Listing[[#This Row],[System Code]]&School_Listing[[#This Row],[School Code]]","v":"75025"},"John Colemon Elementary",{"$f":"School_Listing[[#This Row],[School Code]]","v":25}]
[750,"RUTHERFORD COUNTY",{"$f":"School_Listing[[#This Row],[System Code]]","v":750},40,{"$f":"School_Listing[[#This Row],[System Code]]&School_Listing[[#This Row],[School Code]]","v":"75040"},"Kittrell Elementary",{"$f":"School_Listing[[#This Row],[School Code]]","v":40}]
[750,"RUTHERFORD COUNTY",{"$f":"School_Listing[[#This Row],[System Code]]","v":750},50,{"$f":"School_Listing[[#This Row],[System Code]]&School_Listing[[#This Row],[School Code]]","v":"75050"},"Lascassas Elementary",{"$f":"School_Listing[[#This Row],[School Code]]","v":50}]
[750,"RUTHERFORD COUNTY",{"$f":"School_Listing[[#This Row],[System Code]]","v":750},63,{"$f":"School_Listing[[#This Row],[System Code]]&School_Listing[[#This Row],[School Code]]","v":"75063"},"Lavergne High School",{"$f":"School_Listing[[#This Row],[School Code]]","v":63}]
[750,"RUTHERFORD COUNTY",{"$f":"School_Listing[[#This Row],[System Code]]","v":750},59,{"$f":"School_Listing[[#This Row],[System Code]]&School_Listing[[#This Row],[School Code]]","v":"75059"},"LaVergne Lake Elementary School",{"$f":"School_Listing[[#This Row],[School Code]]","v":59}]
[750,"RUTHERFORD COUNTY",{"$f":"School_Listing[[#This Row],[System Code]]","v":750},62,{"$f":"School_Listing[[#This Row],[System Code]]&School_Listing[[#This Row],[School Code]]","v":"75062"},"LaVergne Middle School",{"$f":"School_Listing[[#This Row],[School Code]]","v":62}]
[750,"RUTHERFORD COUNTY",{"$f":"School_Listing[[#This Row],[System Code]]","v":750},70,{"$f":"School_Listing[[#This Row],[System Code]]&School_Listing[[#This Row],[School Code]]","v":"75070"},"McFadden School Of Excellence",{"$f":"School_Listing[[#This Row],[School Code]]","v":70}]
[750,"RUTHERFORD COUNTY",{"$f":"School_Listing[[#This Row],[System Code]]","v":750},72,{"$f":"School_Listing[[#This Row],[System Code]]&School_Listing[[#This Row],[School Code]]","v":"75072"},"Oakland High School",{"$f":"School_Listing[[#This Row],[School Code]]","v":72}]
[750,"RUTHERFORD COUNTY",{"$f":"School_Listing[[#This Row],[System Code]]","v":750},17,{"$f":"School_Listing[[#This Row],[System Code]]&School_Listing[[#This Row],[School Code]]","v":"75017"},"Oakland Middle School",{"$f":"School_Listing[[#This Row],[School Code]]","v":17}]
[750,"RUTHERFORD COUNTY",{"$f":"School_Listing[[#This Row],[System Code]]","v":750},73,{"$f":"School_Listing[[#This Row],[System Code]]&School_Listing[[#This Row],[School Code]]","v":"75073"},"Plainview Elementary School",{"$f":"School_Listing[[#This Row],[School Code]]","v":73}]
[750,"RUTHERFORD COUNTY",{"$f":"School_Listing[[#This Row],[System Code]]","v":750},74,{"$f":"School_Listing[[#This Row],[System Code]]&School_Listing[[#This Row],[School Code]]","v":"75074"},"Riverdale High School",{"$f":"School_Listing[[#This Row],[School Code]]","v":74}]
[750,"RUTHERFORD COUNTY",{"$f":"School_Listing[[#This Row],[System Code]]","v":750},55,{"$f":"School_Listing[[#This Row],[System Code]]&School_Listing[[#This Row],[School Code]]","v":"75055"},"Rock Springs Elementary",{"$f":"School_Listing[[#This Row],[School Code]]","v":55}]
[750,"RUTHERFORD COUNTY",{"$f":"School_Listing[[#This Row],[System Code]]","v":750},58,{"$f":"School_Listing[[#This Row],[System Code]]&School_Listing[[#This Row],[School Code]]","v":"75058"},"Rock Springs Middle School",{"$f":"School_Listing[[#This Row],[School Code]]","v":58}]
[750,"RUTHERFORD COUNTY",{"$f":"School_Listing[[#This Row],[System Code]]","v":750},75,{"$f":"School_Listing[[#This Row],[System Code]]&School_Listing[[#This Row],[School Code]]","v":"75075"},"Rockvale Elementary",{"$f":"School_Listing[[#This Row],[School Code]]","v":75}]
[750,"RUTHERFORD COUNTY",{"$f":"School_Listing[[#This Row],[System Code]]","v":750},85,{"$f":"School_Listing[[#This Row],[System Code]]&School_Listing[[#This Row],[School Code]]","v":"75085"},"Rockvale High School",{"$f":"School_Listing[[#This Row],[School Code]]","v":85}]
[750,"RUTHERFORD COUNTY",{"$f":"School_Listing[[#This Row],[System Code]]","v":750},78,{"$f":"School_Listing[[#This Row],[System Code]]&School_Listing[[#This Row],[School Code]]","v":"75078"},"Rockvale Middle School",{"$f":"School_Listing[[#This Row],[School Code]]","v":78}]
[750,"RUTHERFORD COUNTY",{"$f":"School_Listing[[#This Row],[System Code]]","v":750},86,{"$f":"School_Listing[[#This Row],[System Code]]&School_Listing[[#This Row],[School Code]]","v":"75086"},"Rocky Fork Elementary School",{"$f":"School_Listing[[#This Row],[School Code]]","v":86}]
[750,"RUTHERFORD COUNTY",{"$f":"School_Listing[[#This Row],[System Code]]","v":750},230,{"$f":"School_Listing[[#This Row],[System Code]]&School_Listing[[#This Row],[School Code]]","v":"750230"},"Rocky Fork Middle School",{"$f":"School_Listing[[#This Row],[School Code]]","v":230}]
[750,"RUTHERFORD COUNTY",{"$f":"School_Listing[[#This Row],[System Code]]","v":750},77,{"$f":"School_Listing[[#This Row],[System Code]]&School_Listing[[#This Row],[School Code]]","v":"75077"},"Roy L Waldron Elementary",{"$f":"School_Listing[[#This Row],[School Code]]","v":77}]
[750,"RUTHERFORD COUNTY",{"$f":"School_Listing[[#This Row],[System Code]]","v":750},80,{"$f":"School_Listing[[#This Row],[System Code]]&School_Listing[[#This Row],[School Code]]","v":"75080"},"Rutherford County Adult High School",{"$f":"School_Listing[[#This Row],[School Code]]","v":80}]
[750,"RUTHERFORD COUNTY",{"$f":"School_Listing[[#This Row],[System Code]]","v":750},89,{"$f":"School_Listing[[#This Row],[System Code]]&School_Listing[[#This Row],[School Code]]","v":"75089"},"Rutherford County Virtual School",{"$f":"School_Listing[[#This Row],[School Code]]","v":89}]
[750,"RUTHERFORD COUNTY",{"$f":"School_Listing[[#This Row],[System Code]]","v":750},104,{"$f":"School_Listing[[#This Row],[System Code]]&School_Listing[[#This Row],[School Code]]","v":"750104"},"Siegel High School",{"$f":"School_Listing[[#This Row],[School Code]]","v":104}]
[750,"RUTHERFORD COUNTY",{"$f":"School_Listing[[#This Row],[System Code]]","v":750},103,{"$f":"School_Listing[[#This Row],[System Code]]&School_Listing[[#This Row],[School Code]]","v":"750103"},"Siegel Middle School",{"$f":"School_Listing[[#This Row],[School Code]]","v":103}]
[750,"RUTHERFORD COUNTY",{"$f":"School_Listing[[#This Row],[System Code]]","v":750},90,{"$f":"School_Listing[[#This Row],[System Code]]&School_Listing[[#This Row],[School Code]]","v":"75090"},"Smyrna Elementary",{"$f":"School_Listing[[#This Row],[School Code]]","v":90}]
[750,"RUTHERFORD COUNTY",{"$f":"School_Listing[[#This Row],[System Code]]","v":750},98,{"$f":"School_Listing[[#This Row],[System Code]]&School_Listing[[#This Row],[School Code]]","v":"75098"},"Smyrna High School",{"$f":"School_Listing[[#This Row],[School Code]]","v":98}]
[750,"RUTHERFORD COUNTY",{"$f":"School_Listing[[#This Row],[System Code]]","v":750},95,{"$f":"School_Listing[[#This Row],[System Code]]&School_Listing[[#This Row],[School Code]]","v":"75095"},"Smyrna Middle School",{"$f":"School_Listing[[#This Row],[School Code]]","v":95}]
[750,"RUTHERFORD COUNTY",{"$f":"School_Listing[[#This Row],[System Code]]","v":750},100,{"$f":"School_Listing[[#This Row],[System Code]]&School_Listing[[#This Row],[School Code]]","v":"750100"},"Smyrna Primary",{"$f":"School_Listing[[#This Row],[School Code]]","v":100}]
[750,"RUTHERFORD COUNTY",{"$f":"School_Listing[[#This Row],[System Code]]","v":750},92,{"$f":"School_Listing[[#This Row],[System Code]]&School_Listing[[#This Row],[School Code]]","v":"75092"},"Smyrna West Alternative School",{"$f":"School_Listing[[#This Row],[School Code]]","v":92}]
[750,"RUTHERFORD COUNTY",{"$f":"School_Listing[[#This Row],[System Code]]","v":750},210,{"$f":"School_Listing[[#This Row],[System Code]]&School_Listing[[#This Row],[School Code]]","v":"750210"},"Stewarts Creek Elementary School",{"$f":"School_Listing[[#This Row],[School Code]]","v":210}]
[750,"RUTHERFORD COUNTY",{"$f":"School_Listing[[#This Row],[System Code]]","v":750},225,{"$f":"School_Listing[[#This Row],[System Code]]&School_Listing[[#This Row],[School Code]]","v":"750225"},"Stewarts Creek High School",{"$f":"School_Listing[[#This Row],[School Code]]","v":225}]
[750,"RUTHERFORD COUNTY",{"$f":"School_Listing[[#This Row],[System Code]]","v":750},220,{"$f":"School_Listing[[#This Row],[System Code]]&School_Listing[[#This Row],[School Code]]","v":"750220"},"Stewarts Creek Middle School",{"$f":"School_Listing[[#This Row],[School Code]]","v":220}]
[750,"RUTHERFORD COUNTY",{"$f":"School_Listing[[#This Row],[System Code]]","v":750},200,{"$f":"School_Listing[[#This Row],[System Code]]&School_Listing[[#This Row],[School Code]]","v":"750200"},"Stewartsboro Elementary",{"$f":"School_Listing[[#This Row],[School Code]]","v":200}]
[750,"RUTHERFORD COUNTY",{"$f":"School_Listing[[#This Row],[System Code]]","v":750},105,{"$f":"School_Listing[[#This Row],[System Code]]&School_Listing[[#This Row],[School Code]]","v":"750105"},"Thurman Francis Arts Academy/Magnet School for the Arts",{"$f":"School_Listing[[#This Row],[School Code]]","v":105}]
[750,"RUTHERFORD COUNTY",{"$f":"School_Listing[[#This Row],[System Code]]","v":750},110,{"$f":"School_Listing[[#This Row],[System Code]]&School_Listing[[#This Row],[School Code]]","v":"750110"},"Walter Hill Elementary",{"$f":"School_Listing[[#This Row],[School Code]]","v":110}]
[750,"RUTHERFORD COUNTY",{"$f":"School_Listing[[#This Row],[System Code]]","v":750},21,{"$f":"School_Listing[[#This Row],[System Code]]&School_Listing[[#This Row],[School Code]]","v":"75021"},"Whitworth-Buchanan Middle School",{"$f":"School_Listing[[#This Row],[School Code]]","v":21}]
[750,"RUTHERFORD COUNTY",{"$f":"School_Listing[[#This Row],[System Code]]","v":750},150,{"$f":"School_Listing[[#This Row],[System Code]]&School_Listing[[#This Row],[School Code]]","v":"750150"},"Wilson Elementary School",{"$f":"School_Listing[[#This Row],[School Code]]","v":150}]
[751,"MURFREESBORO",{"$f":"School_Listing[[#This Row],[System Code]]","v":751},7,{"$f":"School_Listing[[#This Row],[System Code]]&School_Listing[[#This Row],[School Code]]","v":"7517"},"Black Fox Elementary",{"$f":"School_Listing[[#This Row],[School Code]]","v":7}]
[751,"MURFREESBORO",{"$f":"School_Listing[[#This Row],[System Code]]","v":751},10,{"$f":"School_Listing[[#This Row],[System Code]]&School_Listing[[#This Row],[School Code]]","v":"75110"},"Bradley Academy - An Arts Integrated School",{"$f":"School_Listing[[#This Row],[School Code]]","v":10}]
[751,"MURFREESBORO",{"$f":"School_Listing[[#This Row],[System Code]]","v":751},15,{"$f":"School_Listing[[#This Row],[System Code]]&School_Listing[[#This Row],[School Code]]","v":"75115"},"Cason Lane Academy",{"$f":"School_Listing[[#This Row],[School Code]]","v":15}]
[751,"MURFREESBORO",{"$f":"School_Listing[[#This Row],[System Code]]","v":751},5,{"$f":"School_Listing[[#This Row],[System Code]]&School_Listing[[#This Row],[School Code]]","v":"7515"},"Discovery School",{"$f":"School_Listing[[#This Row],[School Code]]","v":5}]
[751,"MURFREESBORO",{"$f":"School_Listing[[#This Row],[System Code]]","v":751},18,{"$f":"School_Listing[[#This Row],[System Code]]&School_Listing[[#This Row],[School Code]]","v":"75118"},"Erma Siegel Elementary",{"$f":"School_Listing[[#This Row],[School Code]]","v":18}]
[751,"MURFREESBORO",{"$f":"School_Listing[[#This Row],[System Code]]","v":751},20,{"$f":"School_Listing[[#This Row],[System Code]]&School_Listing[[#This Row],[School Code]]","v":"75120"},"Hobgood Elementary",{"$f":"School_Listing[[#This Row],[School Code]]","v":20}]
[751,"MURFREESBORO",{"$f":"School_Listing[[#This Row],[System Code]]","v":751},35,{"$f":"School_Listing[[#This Row],[System Code]]&School_Listing[[#This Row],[School Code]]","v":"75135"},"John Pittard Elementary",{"$f":"School_Listing[[#This Row],[School Code]]","v":35}]
[751,"MURFREESBORO",{"$f":"School_Listing[[#This Row],[System Code]]","v":751},25,{"$f":"School_Listing[[#This Row],[System Code]]&School_Listing[[#This Row],[School Code]]","v":"75125"},"Mitchell-Neilson Elementary",{"$f":"School_Listing[[#This Row],[School Code]]","v":25}]
[751,"MURFREESBORO",{"$f":"School_Listing[[#This Row],[System Code]]","v":751},32,{"$f":"School_Listing[[#This Row],[System Code]]&School_Listing[[#This Row],[School Code]]","v":"75132"},"Northfield Elementary",{"$f":"School_Listing[[#This Row],[School Code]]","v":32}]
[751,"MURFREESBORO",{"$f":"School_Listing[[#This Row],[System Code]]","v":751},40,{"$f":"School_Listing[[#This Row],[System Code]]&School_Listing[[#This Row],[School Code]]","v":"75140"},"Overall Creek Elementary",{"$f":"School_Listing[[#This Row],[School Code]]","v":40}]
[751,"MURFREESBORO",{"$f":"School_Listing[[#This Row],[System Code]]","v":751},45,{"$f":"School_Listing[[#This Row],[System Code]]&School_Listing[[#This Row],[School Code]]","v":"75145"},"Reeves-Rogers Elementary",{"$f":"School_Listing[[#This Row],[School Code]]","v":45}]
[751,"MURFREESBORO",{"$f":"School_Listing[[#This Row],[System Code]]","v":751},155,{"$f":"School_Listing[[#This Row],[System Code]]&School_Listing[[#This Row],[School Code]]","v":"751155"},"Salem Elementary School",{"$f":"School_Listing[[#This Row],[School Code]]","v":155}]
[751,"MURFREESBORO",{"$f":"School_Listing[[#This Row],[System Code]]","v":751},150,{"$f":"School_Listing[[#This Row],[System Code]]&School_Listing[[#This Row],[School Code]]","v":"751150"},"Scales Elementary School",{"$f":"School_Listing[[#This Row],[School Code]]","v":150}]
[760,"SCOTT COUNTY",{"$f":"School_Listing[[#This Row],[System Code]]","v":760},5,{"$f":"School_Listing[[#This Row],[System Code]]&School_Listing[[#This Row],[School Code]]","v":"7605"},"Burchfield Elementary",{"$f":"School_Listing[[#This Row],[School Code]]","v":5}]
[760,"SCOTT COUNTY",{"$f":"School_Listing[[#This Row],[System Code]]","v":760},8,{"$f":"School_Listing[[#This Row],[System Code]]&School_Listing[[#This Row],[School Code]]","v":"7608"},"Fairview Elementary",{"$f":"School_Listing[[#This Row],[School Code]]","v":8}]
[760,"SCOTT COUNTY",{"$f":"School_Listing[[#This Row],[System Code]]","v":760},20,{"$f":"School_Listing[[#This Row],[System Code]]&School_Listing[[#This Row],[School Code]]","v":"76020"},"Huntsville Elementary",{"$f":"School_Listing[[#This Row],[School Code]]","v":20}]
[760,"SCOTT COUNTY",{"$f":"School_Listing[[#This Row],[System Code]]","v":760},25,{"$f":"School_Listing[[#This Row],[System Code]]&School_Listing[[#This Row],[School Code]]","v":"76025"},"Huntsville Middle School",{"$f":"School_Listing[[#This Row],[School Code]]","v":25}]
[760,"SCOTT COUNTY",{"$f":"School_Listing[[#This Row],[System Code]]","v":760},40,{"$f":"School_Listing[[#This Row],[System Code]]&School_Listing[[#This Row],[School Code]]","v":"76040"},"Robbins Elementary",{"$f":"School_Listing[[#This Row],[School Code]]","v":40}]
[760,"SCOTT COUNTY",{"$f":"School_Listing[[#This Row],[System Code]]","v":760},48,{"$f":"School_Listing[[#This Row],[System Code]]&School_Listing[[#This Row],[School Code]]","v":"76048"},"Scott High School",{"$f":"School_Listing[[#This Row],[School Code]]","v":48}]
[760,"SCOTT COUNTY",{"$f":"School_Listing[[#This Row],[System Code]]","v":760},55,{"$f":"School_Listing[[#This Row],[System Code]]&School_Listing[[#This Row],[School Code]]","v":"76055"},"Winfield Elementary",{"$f":"School_Listing[[#This Row],[School Code]]","v":55}]
[761,"ONEIDA",{"$f":"School_Listing[[#This Row],[System Code]]","v":761},5,{"$f":"School_Listing[[#This Row],[System Code]]&School_Listing[[#This Row],[School Code]]","v":"7615"},"Oneida Elementary",{"$f":"School_Listing[[#This Row],[School Code]]","v":5}]
[761,"ONEIDA",{"$f":"School_Listing[[#This Row],[System Code]]","v":761},10,{"$f":"School_Listing[[#This Row],[System Code]]&School_Listing[[#This Row],[School Code]]","v":"76110"},"Oneida High School",{"$f":"School_Listing[[#This Row],[School Code]]","v":10}]
[761,"ONEIDA",{"$f":"School_Listing[[#This Row],[System Code]]","v":761},8,{"$f":"School_Listing[[#This Row],[System Code]]&School_Listing[[#This Row],[School Code]]","v":"7618"},"Oneida Middle School",{"$f":"School_Listing[[#This Row],[School Code]]","v":8}]
[770,"SEQUATCHIE COUNTY",{"$f":"School_Listing[[#This Row],[System Code]]","v":770},10,{"$f":"School_Listing[[#This Row],[System Code]]&School_Listing[[#This Row],[School Code]]","v":"77010"},"Griffith Elementary",{"$f":"School_Listing[[#This Row],[School Code]]","v":10}]
[770,"SEQUATCHIE COUNTY",{"$f":"School_Listing[[#This Row],[System Code]]","v":770},20,{"$f":"School_Listing[[#This Row],[System Code]]&School_Listing[[#This Row],[School Code]]","v":"77020"},"Sequatchie Co High School",{"$f":"School_Listing[[#This Row],[School Code]]","v":20}]
[770,"SEQUATCHIE COUNTY",{"$f":"School_Listing[[#This Row],[System Code]]","v":770},5,{"$f":"School_Listing[[#This Row],[System Code]]&School_Listing[[#This Row],[School Code]]","v":"7705"},"Sequatchie Co Middle School",{"$f":"School_Listing[[#This Row],[School Code]]","v":5}]
[780,"SEVIER COUNTY",{"$f":"School_Listing[[#This Row],[System Code]]","v":780},12,{"$f":"School_Listing[[#This Row],[System Code]]&School_Listing[[#This Row],[School Code]]","v":"78012"},"Boyds Creek Elementary School",{"$f":"School_Listing[[#This Row],[School Code]]","v":12}]
[780,"SEVIER COUNTY",{"$f":"School_Listing[[#This Row],[System Code]]","v":780},13,{"$f":"School_Listing[[#This Row],[System Code]]&School_Listing[[#This Row],[School Code]]","v":"78013"},"Catlettsburg Elementary School",{"$f":"School_Listing[[#This Row],[School Code]]","v":13}]
[780,"SEVIER COUNTY",{"$f":"School_Listing[[#This Row],[System Code]]","v":780},15,{"$f":"School_Listing[[#This Row],[System Code]]&School_Listing[[#This Row],[School Code]]","v":"78015"},"Catons Chapel Elementary",{"$f":"School_Listing[[#This Row],[School Code]]","v":15}]
[780,"SEVIER COUNTY",{"$f":"School_Listing[[#This Row],[System Code]]","v":780},7001,{"$f":"School_Listing[[#This Row],[System Code]]&School_Listing[[#This Row],[School Code]]","v":"7807001"},"Douglas Dam Head Start",{"$f":"School_Listing[[#This Row],[School Code]]","v":7001}]
[780,"SEVIER COUNTY",{"$f":"School_Listing[[#This Row],[System Code]]","v":780},52,{"$f":"School_Listing[[#This Row],[System Code]]&School_Listing[[#This Row],[School Code]]","v":"78052"},"Gary Hardin Academy",{"$f":"School_Listing[[#This Row],[School Code]]","v":52}]
[780,"SEVIER COUNTY",{"$f":"School_Listing[[#This Row],[System Code]]","v":780},20,{"$f":"School_Listing[[#This Row],[System Code]]&School_Listing[[#This Row],[School Code]]","v":"78020"},"Gatlinburg Pittman High",{"$f":"School_Listing[[#This Row],[School Code]]","v":20}]
[780,"SEVIER COUNTY",{"$f":"School_Listing[[#This Row],[System Code]]","v":780},19,{"$f":"School_Listing[[#This Row],[System Code]]&School_Listing[[#This Row],[School Code]]","v":"78019"},"Gatlinburg Pittman Junior High",{"$f":"School_Listing[[#This Row],[School Code]]","v":19}]
[780,"SEVIER COUNTY",{"$f":"School_Listing[[#This Row],[System Code]]","v":780},3,{"$f":"School_Listing[[#This Row],[System Code]]&School_Listing[[#This Row],[School Code]]","v":"7803"},"Greenbrier Alternative Learning Center",{"$f":"School_Listing[[#This Row],[School Code]]","v":3}]
[780,"SEVIER COUNTY",{"$f":"School_Listing[[#This Row],[System Code]]","v":780},25,{"$f":"School_Listing[[#This Row],[System Code]]&School_Listing[[#This Row],[School Code]]","v":"78025"},"Jones Cove Elementary",{"$f":"School_Listing[[#This Row],[School Code]]","v":25}]
[780,"SEVIER COUNTY",{"$f":"School_Listing[[#This Row],[System Code]]","v":780},35,{"$f":"School_Listing[[#This Row],[System Code]]&School_Listing[[#This Row],[School Code]]","v":"78035"},"New Center Elementary",{"$f":"School_Listing[[#This Row],[School Code]]","v":35}]
[780,"SEVIER COUNTY",{"$f":"School_Listing[[#This Row],[System Code]]","v":780},32,{"$f":"School_Listing[[#This Row],[System Code]]&School_Listing[[#This Row],[School Code]]","v":"78032"},"Northview Elementary",{"$f":"School_Listing[[#This Row],[School Code]]","v":32}]
[780,"SEVIER COUNTY",{"$f":"School_Listing[[#This Row],[System Code]]","v":780},34,{"$f":"School_Listing[[#This Row],[System Code]]&School_Listing[[#This Row],[School Code]]","v":"78034"},"Northview Intermediate School",{"$f":"School_Listing[[#This Row],[School Code]]","v":34}]
[780,"SEVIER COUNTY",{"$f":"School_Listing[[#This Row],[System Code]]","v":780},31,{"$f":"School_Listing[[#This Row],[System Code]]&School_Listing[[#This Row],[School Code]]","v":"78031"},"Northview Junior Academy",{"$f":"School_Listing[[#This Row],[School Code]]","v":31}]
[780,"SEVIER COUNTY",{"$f":"School_Listing[[#This Row],[System Code]]","v":780},30,{"$f":"School_Listing[[#This Row],[System Code]]&School_Listing[[#This Row],[School Code]]","v":"78030"},"Northview Senior Academy",{"$f":"School_Listing[[#This Row],[School Code]]","v":30}]
[780,"SEVIER COUNTY",{"$f":"School_Listing[[#This Row],[System Code]]","v":780},37,{"$f":"School_Listing[[#This Row],[System Code]]&School_Listing[[#This Row],[School Code]]","v":"78037"},"Parkway Academy",{"$f":"School_Listing[[#This Row],[School Code]]","v":37}]
[780,"SEVIER COUNTY",{"$f":"School_Listing[[#This Row],[System Code]]","v":780},40,{"$f":"School_Listing[[#This Row],[System Code]]&School_Listing[[#This Row],[School Code]]","v":"78040"},"Pi Beta Phi Elementary",{"$f":"School_Listing[[#This Row],[School Code]]","v":40}]
[780,"SEVIER COUNTY",{"$f":"School_Listing[[#This Row],[System Code]]","v":780},46,{"$f":"School_Listing[[#This Row],[System Code]]&School_Listing[[#This Row],[School Code]]","v":"78046"},"Pigeon Forge High School",{"$f":"School_Listing[[#This Row],[School Code]]","v":46}]
[780,"SEVIER COUNTY",{"$f":"School_Listing[[#This Row],[System Code]]","v":780},43,{"$f":"School_Listing[[#This Row],[System Code]]&School_Listing[[#This Row],[School Code]]","v":"78043"},"Pigeon Forge Intermediate",{"$f":"School_Listing[[#This Row],[School Code]]","v":43}]
[780,"SEVIER COUNTY",{"$f":"School_Listing[[#This Row],[System Code]]","v":780},45,{"$f":"School_Listing[[#This Row],[System Code]]&School_Listing[[#This Row],[School Code]]","v":"78045"},"Pigeon Forge Junior High School",{"$f":"School_Listing[[#This Row],[School Code]]","v":45}]
[780,"SEVIER COUNTY",{"$f":"School_Listing[[#This Row],[System Code]]","v":780},44,{"$f":"School_Listing[[#This Row],[System Code]]&School_Listing[[#This Row],[School Code]]","v":"78044"},"Pigeon Forge Primary",{"$f":"School_Listing[[#This Row],[School Code]]","v":44}]
[780,"SEVIER COUNTY",{"$f":"School_Listing[[#This Row],[System Code]]","v":780},50,{"$f":"School_Listing[[#This Row],[System Code]]&School_Listing[[#This Row],[School Code]]","v":"78050"},"Pittman Center Elementary",{"$f":"School_Listing[[#This Row],[School Code]]","v":50}]
[780,"SEVIER COUNTY",{"$f":"School_Listing[[#This Row],[System Code]]","v":780},55,{"$f":"School_Listing[[#This Row],[System Code]]&School_Listing[[#This Row],[School Code]]","v":"78055"},"Sevier County High School",{"$f":"School_Listing[[#This Row],[School Code]]","v":55}]
[780,"SEVIER COUNTY",{"$f":"School_Listing[[#This Row],[System Code]]","v":780},59,{"$f":"School_Listing[[#This Row],[System Code]]&School_Listing[[#This Row],[School Code]]","v":"78059"},"Sevier County Virtual Academy",{"$f":"School_Listing[[#This Row],[School Code]]","v":59}]
[780,"SEVIER COUNTY",{"$f":"School_Listing[[#This Row],[System Code]]","v":780},61,{"$f":"School_Listing[[#This Row],[System Code]]&School_Listing[[#This Row],[School Code]]","v":"78061"},"Sevierville Intermediate",{"$f":"School_Listing[[#This Row],[School Code]]","v":61}]
[780,"SEVIER COUNTY",{"$f":"School_Listing[[#This Row],[System Code]]","v":780},62,{"$f":"School_Listing[[#This Row],[System Code]]&School_Listing[[#This Row],[School Code]]","v":"78062"},"Sevierville Middle School",{"$f":"School_Listing[[#This Row],[School Code]]","v":62}]
[780,"SEVIER COUNTY",{"$f":"School_Listing[[#This Row],[System Code]]","v":780},60,{"$f":"School_Listing[[#This Row],[System Code]]&School_Listing[[#This Row],[School Code]]","v":"78060"},"Sevierville Primary",{"$f":"School_Listing[[#This Row],[School Code]]","v":60}]
[780,"SEVIER COUNTY",{"$f":"School_Listing[[#This Row],[System Code]]","v":780},70,{"$f":"School_Listing[[#This Row],[System Code]]&School_Listing[[#This Row],[School Code]]","v":"78070"},"Seymour High School",{"$f":"School_Listing[[#This Row],[School Code]]","v":70}]
[780,"SEVIER COUNTY",{"$f":"School_Listing[[#This Row],[System Code]]","v":780},68,{"$f":"School_Listing[[#This Row],[System Code]]&School_Listing[[#This Row],[School Code]]","v":"78068"},"Seymour Intermediate",{"$f":"School_Listing[[#This Row],[School Code]]","v":68}]
[780,"SEVIER COUNTY",{"$f":"School_Listing[[#This Row],[System Code]]","v":780},66,{"$f":"School_Listing[[#This Row],[System Code]]&School_Listing[[#This Row],[School Code]]","v":"78066"},"Seymour Junior High",{"$f":"School_Listing[[#This Row],[School Code]]","v":66}]
[780,"SEVIER COUNTY",{"$f":"School_Listing[[#This Row],[System Code]]","v":780},65,{"$f":"School_Listing[[#This Row],[System Code]]&School_Listing[[#This Row],[School Code]]","v":"78065"},"Seymour Primary",{"$f":"School_Listing[[#This Row],[School Code]]","v":65}]
[780,"SEVIER COUNTY",{"$f":"School_Listing[[#This Row],[System Code]]","v":780},72,{"$f":"School_Listing[[#This Row],[System Code]]&School_Listing[[#This Row],[School Code]]","v":"78072"},"T Lawson Early Childhood Education Center",{"$f":"School_Listing[[#This Row],[School Code]]","v":72}]
[780,"SEVIER COUNTY",{"$f":"School_Listing[[#This Row],[System Code]]","v":780},80,{"$f":"School_Listing[[#This Row],[System Code]]&School_Listing[[#This Row],[School Code]]","v":"78080"},"Wearwood Elementary",{"$f":"School_Listing[[#This Row],[School Code]]","v":80}]
[780,"SEVIER COUNTY",{"$f":"School_Listing[[#This Row],[System Code]]","v":780},86,{"$f":"School_Listing[[#This Row],[System Code]]&School_Listing[[#This Row],[School Code]]","v":"78086"},"Whites Adult High School",{"$f":"School_Listing[[#This Row],[School Code]]","v":86}]
[792,"MEMPHIS-SHELBY COUNTY SCHOOLS",{"$f":"School_Listing[[#This Row],[System Code]]","v":792},2005,{"$f":"School_Listing[[#This Row],[System Code]]&School_Listing[[#This Row],[School Code]]","v":"7922005"},"A. B. Hill Elementary",{"$f":"School_Listing[[#This Row],[School Code]]","v":2005}]
[792,"MEMPHIS-SHELBY COUNTY SCHOOLS",{"$f":"School_Listing[[#This Row],[System Code]]","v":792},2740,{"$f":"School_Listing[[#This Row],[System Code]]&School_Listing[[#This Row],[School Code]]","v":"7922740"},"A. Maceo Walker Middle",{"$f":"School_Listing[[#This Row],[School Code]]","v":2740}]
[792,"MEMPHIS-SHELBY COUNTY SCHOOLS",{"$f":"School_Listing[[#This Row],[System Code]]","v":792},2015,{"$f":"School_Listing[[#This Row],[System Code]]&School_Listing[[#This Row],[School Code]]","v":"7922015"},"Alcy Elementary",{"$f":"School_Listing[[#This Row],[School Code]]","v":2015}]
[792,"MEMPHIS-SHELBY COUNTY SCHOOLS",{"$f":"School_Listing[[#This Row],[System Code]]","v":792},2023,{"$f":"School_Listing[[#This Row],[System Code]]&School_Listing[[#This Row],[School Code]]","v":"7922023"},"American Way Middle",{"$f":"School_Listing[[#This Row],[School Code]]","v":2023}]
[792,"MEMPHIS-SHELBY COUNTY SCHOOLS",{"$f":"School_Listing[[#This Row],[System Code]]","v":792},8150,{"$f":"School_Listing[[#This Row],[System Code]]&School_Listing[[#This Row],[School Code]]","v":"7928150"},"Arrow Academy of Excellence",{"$f":"School_Listing[[#This Row],[School Code]]","v":8150}]
[792,"MEMPHIS-SHELBY COUNTY SCHOOLS",{"$f":"School_Listing[[#This Row],[System Code]]","v":792},8257,{"$f":"School_Listing[[#This Row],[System Code]]&School_Listing[[#This Row],[School Code]]","v":"7928257"},"Aurora Collegiate Academy",{"$f":"School_Listing[[#This Row],[School Code]]","v":8257}]
[792,"MEMPHIS-SHELBY COUNTY SCHOOLS",{"$f":"School_Listing[[#This Row],[System Code]]","v":792},2025,{"$f":"School_Listing[[#This Row],[System Code]]&School_Listing[[#This Row],[School Code]]","v":"7922025"},"Avon School",{"$f":"School_Listing[[#This Row],[School Code]]","v":2025}]
[792,"MEMPHIS-SHELBY COUNTY SCHOOLS",{"$f":"School_Listing[[#This Row],[System Code]]","v":792},2030,{"$f":"School_Listing[[#This Row],[System Code]]&School_Listing[[#This Row],[School Code]]","v":"7922030"},"B. T. Washington High",{"$f":"School_Listing[[#This Row],[School Code]]","v":2030}]
[792,"MEMPHIS-SHELBY COUNTY SCHOOLS",{"$f":"School_Listing[[#This Row],[System Code]]","v":792},2610,{"$f":"School_Listing[[#This Row],[System Code]]&School_Listing[[#This Row],[School Code]]","v":"7922610"},"Balmoral/Ridgeway Elementary",{"$f":"School_Listing[[#This Row],[School Code]]","v":2610}]
[792,"MEMPHIS-SHELBY COUNTY SCHOOLS",{"$f":"School_Listing[[#This Row],[System Code]]","v":792},10,{"$f":"School_Listing[[#This Row],[System Code]]&School_Listing[[#This Row],[School Code]]","v":"79210"},"Barret's Chapel Elementary/Middle",{"$f":"School_Listing[[#This Row],[School Code]]","v":10}]
[792,"MEMPHIS-SHELBY COUNTY SCHOOLS",{"$f":"School_Listing[[#This Row],[System Code]]","v":792},8338,{"$f":"School_Listing[[#This Row],[System Code]]&School_Listing[[#This Row],[School Code]]","v":"7928338"},"Beacon College Preparatory",{"$f":"School_Listing[[#This Row],[School Code]]","v":8338}]
[792,"MEMPHIS-SHELBY COUNTY SCHOOLS",{"$f":"School_Listing[[#This Row],[System Code]]","v":792},8350,{"$f":"School_Listing[[#This Row],[System Code]]&School_Listing[[#This Row],[School Code]]","v":"7928350"},"Believe Memphis Academy Charter School",{"$f":"School_Listing[[#This Row],[School Code]]","v":8350}]
[792,"MEMPHIS-SHELBY COUNTY SCHOOLS",{"$f":"School_Listing[[#This Row],[System Code]]","v":792},300,{"$f":"School_Listing[[#This Row],[System Code]]&School_Listing[[#This Row],[School Code]]","v":"792300"},"Belle Forest Community School",{"$f":"School_Listing[[#This Row],[School Code]]","v":300}]
[792,"MEMPHIS-SHELBY COUNTY SCHOOLS",{"$f":"School_Listing[[#This Row],[System Code]]","v":792},2040,{"$f":"School_Listing[[#This Row],[System Code]]&School_Listing[[#This Row],[School Code]]","v":"7922040"},"Bellevue Middle",{"$f":"School_Listing[[#This Row],[School Code]]","v":2040}]
[792,"MEMPHIS-SHELBY COUNTY SCHOOLS",{"$f":"School_Listing[[#This Row],[System Code]]","v":792},2045,{"$f":"School_Listing[[#This Row],[System Code]]&School_Listing[[#This Row],[School Code]]","v":"7922045"},"Berclair Elementary",{"$f":"School_Listing[[#This Row],[School Code]]","v":2045}]
[792,"MEMPHIS-SHELBY COUNTY SCHOOLS",{"$f":"School_Listing[[#This Row],[System Code]]","v":792},2050,{"$f":"School_Listing[[#This Row],[System Code]]&School_Listing[[#This Row],[School Code]]","v":"7922050"},"Bethel Grove Elementary",{"$f":"School_Listing[[#This Row],[School Code]]","v":2050}]
[792,"MEMPHIS-SHELBY COUNTY SCHOOLS",{"$f":"School_Listing[[#This Row],[System Code]]","v":792},7201,{"$f":"School_Listing[[#This Row],[System Code]]&School_Listing[[#This Row],[School Code]]","v":"7927201"},"Bluebird Learning Center",{"$f":"School_Listing[[#This Row],[School Code]]","v":7201}]
[792,"MEMPHIS-SHELBY COUNTY SCHOOLS",{"$f":"School_Listing[[#This Row],[System Code]]","v":792},35,{"$f":"School_Listing[[#This Row],[System Code]]&School_Listing[[#This Row],[School Code]]","v":"79235"},"Bolton High",{"$f":"School_Listing[[#This Row],[School Code]]","v":35}]
[792,"MEMPHIS-SHELBY COUNTY SCHOOLS",{"$f":"School_Listing[[#This Row],[System Code]]","v":792},2057,{"$f":"School_Listing[[#This Row],[System Code]]&School_Listing[[#This Row],[School Code]]","v":"7922057"},"Brownsville Road Elementary",{"$f":"School_Listing[[#This Row],[School Code]]","v":2057}]
[792,"MEMPHIS-SHELBY COUNTY SCHOOLS",{"$f":"School_Listing[[#This Row],[System Code]]","v":792},2060,{"$f":"School_Listing[[#This Row],[System Code]]&School_Listing[[#This Row],[School Code]]","v":"7922060"},"Bruce Elementary",{"$f":"School_Listing[[#This Row],[School Code]]","v":2060}]
[792,"MEMPHIS-SHELBY COUNTY SCHOOLS",{"$f":"School_Listing[[#This Row],[System Code]]","v":792},7210,{"$f":"School_Listing[[#This Row],[System Code]]&School_Listing[[#This Row],[School Code]]","v":"7927210"},"Campus Kids Corner",{"$f":"School_Listing[[#This Row],[School Code]]","v":7210}]
[792,"MEMPHIS-SHELBY COUNTY SCHOOLS",{"$f":"School_Listing[[#This Row],[System Code]]","v":792},2070,{"$f":"School_Listing[[#This Row],[System Code]]&School_Listing[[#This Row],[School Code]]","v":"7922070"},"Campus School",{"$f":"School_Listing[[#This Row],[School Code]]","v":2070}]
[792,"MEMPHIS-SHELBY COUNTY SCHOOLS",{"$f":"School_Listing[[#This Row],[System Code]]","v":792},2831,{"$f":"School_Listing[[#This Row],[System Code]]&School_Listing[[#This Row],[School Code]]","v":"7922831"},"Carver College and Career Academy",{"$f":"School_Listing[[#This Row],[School Code]]","v":2831}]
[792,"MEMPHIS-SHELBY COUNTY SCHOOLS",{"$f":"School_Listing[[#This Row],[System Code]]","v":792},2090,{"$f":"School_Listing[[#This Row],[System Code]]&School_Listing[[#This Row],[School Code]]","v":"7922090"},"Central High",{"$f":"School_Listing[[#This Row],[School Code]]","v":2090}]
[792,"MEMPHIS-SHELBY COUNTY SCHOOLS",{"$f":"School_Listing[[#This Row],[System Code]]","v":792},2100,{"$f":"School_Listing[[#This Row],[System Code]]&School_Listing[[#This Row],[School Code]]","v":"7922100"},"Cherokee Elementary",{"$f":"School_Listing[[#This Row],[School Code]]","v":2100}]
[792,"MEMPHIS-SHELBY COUNTY SCHOOLS",{"$f":"School_Listing[[#This Row],[System Code]]","v":792},2108,{"$f":"School_Listing[[#This Row],[System Code]]&School_Listing[[#This Row],[School Code]]","v":"7922108"},"Chickasaw Middle",{"$f":"School_Listing[[#This Row],[School Code]]","v":2108}]
[792,"MEMPHIS-SHELBY COUNTY SCHOOLS",{"$f":"School_Listing[[#This Row],[System Code]]","v":792},2049,{"$f":"School_Listing[[#This Row],[System Code]]&School_Listing[[#This Row],[School Code]]","v":"7922049"},"Chimneyrock Elementary School",{"$f":"School_Listing[[#This Row],[School Code]]","v":2049}]
[792,"MEMPHIS-SHELBY COUNTY SCHOOLS",{"$f":"School_Listing[[#This Row],[System Code]]","v":792},8201,{"$f":"School_Listing[[#This Row],[System Code]]&School_Listing[[#This Row],[School Code]]","v":"7928201"},"Circles Of Success Learning Academy",{"$f":"School_Listing[[#This Row],[School Code]]","v":8201}]
[792,"MEMPHIS-SHELBY COUNTY SCHOOLS",{"$f":"School_Listing[[#This Row],[System Code]]","v":792},8145,{"$f":"School_Listing[[#This Row],[System Code]]&School_Listing[[#This Row],[School Code]]","v":"7928145"},"City University School Girls Preparatory",{"$f":"School_Listing[[#This Row],[School Code]]","v":8145}]
[792,"MEMPHIS-SHELBY COUNTY SCHOOLS",{"$f":"School_Listing[[#This Row],[System Code]]","v":792},8265,{"$f":"School_Listing[[#This Row],[System Code]]&School_Listing[[#This Row],[School Code]]","v":"7928265"},"City University School of Independence",{"$f":"School_Listing[[#This Row],[School Code]]","v":8265}]
[792,"MEMPHIS-SHELBY COUNTY SCHOOLS",{"$f":"School_Listing[[#This Row],[System Code]]","v":792},8204,{"$f":"School_Listing[[#This Row],[System Code]]&School_Listing[[#This Row],[School Code]]","v":"7928204"},"City University School Of Liberal Arts",{"$f":"School_Listing[[#This Row],[School Code]]","v":8204}]
[792,"MEMPHIS-SHELBY COUNTY SCHOOLS",{"$f":"School_Listing[[#This Row],[System Code]]","v":792},2115,{"$f":"School_Listing[[#This Row],[System Code]]&School_Listing[[#This Row],[School Code]]","v":"7922115"},"Colonial Middle",{"$f":"School_Listing[[#This Row],[School Code]]","v":2115}]
[792,"MEMPHIS-SHELBY COUNTY SCHOOLS",{"$f":"School_Listing[[#This Row],[System Code]]","v":792},8185,{"$f":"School_Listing[[#This Row],[System Code]]&School_Listing[[#This Row],[School Code]]","v":"7928185"},"Compass Community School, Berclair Campus",{"$f":"School_Listing[[#This Row],[School Code]]","v":8185}]
[792,"MEMPHIS-SHELBY COUNTY SCHOOLS",{"$f":"School_Listing[[#This Row],[System Code]]","v":792},8190,{"$f":"School_Listing[[#This Row],[System Code]]&School_Listing[[#This Row],[School Code]]","v":"7928190"},"Compass Community School, Binghampton Campus",{"$f":"School_Listing[[#This Row],[School Code]]","v":8190}]
[792,"MEMPHIS-SHELBY COUNTY SCHOOLS",{"$f":"School_Listing[[#This Row],[System Code]]","v":792},8195,{"$f":"School_Listing[[#This Row],[System Code]]&School_Listing[[#This Row],[School Code]]","v":"7928195"},"Compass Community School, Frayser Campus",{"$f":"School_Listing[[#This Row],[School Code]]","v":8195}]
[792,"MEMPHIS-SHELBY COUNTY SCHOOLS",{"$f":"School_Listing[[#This Row],[System Code]]","v":792},8360,{"$f":"School_Listing[[#This Row],[System Code]]&School_Listing[[#This Row],[School Code]]","v":"7928360"},"Compass Community School, Hickory Hill Campus",{"$f":"School_Listing[[#This Row],[School Code]]","v":8360}]
[792,"MEMPHIS-SHELBY COUNTY SCHOOLS",{"$f":"School_Listing[[#This Row],[System Code]]","v":792},8365,{"$f":"School_Listing[[#This Row],[System Code]]&School_Listing[[#This Row],[School Code]]","v":"7928365"},"Compass Community School, Midtown Campus",{"$f":"School_Listing[[#This Row],[School Code]]","v":8365}]
[792,"MEMPHIS-SHELBY COUNTY SCHOOLS",{"$f":"School_Listing[[#This Row],[System Code]]","v":792},8370,{"$f":"School_Listing[[#This Row],[System Code]]&School_Listing[[#This Row],[School Code]]","v":"7928370"},"Compass Community School, Orange Mound Campus",{"$f":"School_Listing[[#This Row],[School Code]]","v":8370}]
[792,"MEMPHIS-SHELBY COUNTY SCHOOLS",{"$f":"School_Listing[[#This Row],[System Code]]","v":792},2117,{"$f":"School_Listing[[#This Row],[System Code]]&School_Listing[[#This Row],[School Code]]","v":"7922117"},"Cordova Elementary",{"$f":"School_Listing[[#This Row],[School Code]]","v":2117}]
[792,"MEMPHIS-SHELBY COUNTY SCHOOLS",{"$f":"School_Listing[[#This Row],[System Code]]","v":792},2119,{"$f":"School_Listing[[#This Row],[System Code]]&School_Listing[[#This Row],[School Code]]","v":"7922119"},"Cordova High School",{"$f":"School_Listing[[#This Row],[School Code]]","v":2119}]
[792,"MEMPHIS-SHELBY COUNTY SCHOOLS",{"$f":"School_Listing[[#This Row],[System Code]]","v":792},2118,{"$f":"School_Listing[[#This Row],[System Code]]&School_Listing[[#This Row],[School Code]]","v":"7922118"},"Cordova Middle",{"$f":"School_Listing[[#This Row],[School Code]]","v":2118}]
[792,"MEMPHIS-SHELBY COUNTY SCHOOLS",{"$f":"School_Listing[[#This Row],[System Code]]","v":792},2126,{"$f":"School_Listing[[#This Row],[System Code]]&School_Listing[[#This Row],[School Code]]","v":"7922126"},"Craigmont High",{"$f":"School_Listing[[#This Row],[School Code]]","v":2126}]
[792,"MEMPHIS-SHELBY COUNTY SCHOOLS",{"$f":"School_Listing[[#This Row],[System Code]]","v":792},2128,{"$f":"School_Listing[[#This Row],[System Code]]&School_Listing[[#This Row],[School Code]]","v":"7922128"},"Craigmont Middle",{"$f":"School_Listing[[#This Row],[School Code]]","v":2128}]
[792,"MEMPHIS-SHELBY COUNTY SCHOOLS",{"$f":"School_Listing[[#This Row],[System Code]]","v":792},2130,{"$f":"School_Listing[[#This Row],[System Code]]&School_Listing[[#This Row],[School Code]]","v":"7922130"},"Cromwell Elementary",{"$f":"School_Listing[[#This Row],[School Code]]","v":2130}]
[792,"MEMPHIS-SHELBY COUNTY SCHOOLS",{"$f":"School_Listing[[#This Row],[System Code]]","v":792},8325,{"$f":"School_Listing[[#This Row],[System Code]]&School_Listing[[#This Row],[School Code]]","v":"7928325"},"Crosstown High School",{"$f":"School_Listing[[#This Row],[School Code]]","v":8325}]
[792,"MEMPHIS-SHELBY COUNTY SCHOOLS",{"$f":"School_Listing[[#This Row],[System Code]]","v":792},2133,{"$f":"School_Listing[[#This Row],[System Code]]&School_Listing[[#This Row],[School Code]]","v":"7922133"},"Crump Elementary",{"$f":"School_Listing[[#This Row],[School Code]]","v":2133}]
[792,"MEMPHIS-SHELBY COUNTY SCHOOLS",{"$f":"School_Listing[[#This Row],[System Code]]","v":792},2135,{"$f":"School_Listing[[#This Row],[System Code]]&School_Listing[[#This Row],[School Code]]","v":"7922135"},"Cummings Elementary/Middle",{"$f":"School_Listing[[#This Row],[School Code]]","v":2135}]
[792,"MEMPHIS-SHELBY COUNTY SCHOOLS",{"$f":"School_Listing[[#This Row],[System Code]]","v":792},2145,{"$f":"School_Listing[[#This Row],[System Code]]&School_Listing[[#This Row],[School Code]]","v":"7922145"},"Delano Elementary",{"$f":"School_Listing[[#This Row],[School Code]]","v":2145}]
[792,"MEMPHIS-SHELBY COUNTY SCHOOLS",{"$f":"School_Listing[[#This Row],[System Code]]","v":792},67,{"$f":"School_Listing[[#This Row],[System Code]]&School_Listing[[#This Row],[School Code]]","v":"79267"},"Dexter School",{"$f":"School_Listing[[#This Row],[School Code]]","v":67}]
[792,"MEMPHIS-SHELBY COUNTY SCHOOLS",{"$f":"School_Listing[[#This Row],[System Code]]","v":792},2153,{"$f":"School_Listing[[#This Row],[System Code]]&School_Listing[[#This Row],[School Code]]","v":"7922153"},"Double Tree Elementary",{"$f":"School_Listing[[#This Row],[School Code]]","v":2153}]
[792,"MEMPHIS-SHELBY COUNTY SCHOOLS",{"$f":"School_Listing[[#This Row],[System Code]]","v":792},2155,{"$f":"School_Listing[[#This Row],[System Code]]&School_Listing[[#This Row],[School Code]]","v":"7922155"},"Douglass Elementary/Middle",{"$f":"School_Listing[[#This Row],[School Code]]","v":2155}]
[792,"MEMPHIS-SHELBY COUNTY SCHOOLS",{"$f":"School_Listing[[#This Row],[System Code]]","v":792},2160,{"$f":"School_Listing[[#This Row],[System Code]]&School_Listing[[#This Row],[School Code]]","v":"7922160"},"Douglass High",{"$f":"School_Listing[[#This Row],[School Code]]","v":2160}]
[792,"MEMPHIS-SHELBY COUNTY SCHOOLS",{"$f":"School_Listing[[#This Row],[System Code]]","v":792},2162,{"$f":"School_Listing[[#This Row],[System Code]]&School_Listing[[#This Row],[School Code]]","v":"7922162"},"Downtown Elementary",{"$f":"School_Listing[[#This Row],[School Code]]","v":2162}]
[792,"MEMPHIS-SHELBY COUNTY SCHOOLS",{"$f":"School_Listing[[#This Row],[System Code]]","v":792},2165,{"$f":"School_Listing[[#This Row],[System Code]]&School_Listing[[#This Row],[School Code]]","v":"7922165"},"Dunbar Elementary",{"$f":"School_Listing[[#This Row],[School Code]]","v":2165}]
[792,"MEMPHIS-SHELBY COUNTY SCHOOLS",{"$f":"School_Listing[[#This Row],[System Code]]","v":792},80,{"$f":"School_Listing[[#This Row],[System Code]]&School_Listing[[#This Row],[School Code]]","v":"79280"},"E.E. Jeter Elementary/Middle",{"$f":"School_Listing[[#This Row],[School Code]]","v":80}]
[792,"MEMPHIS-SHELBY COUNTY SCHOOLS",{"$f":"School_Listing[[#This Row],[System Code]]","v":792},7211,{"$f":"School_Listing[[#This Row],[System Code]]&School_Listing[[#This Row],[School Code]]","v":"7927211"},"Early Childhood Education",{"$f":"School_Listing[[#This Row],[School Code]]","v":7211}]
[792,"MEMPHIS-SHELBY COUNTY SCHOOLS",{"$f":"School_Listing[[#This Row],[System Code]]","v":792},7213,{"$f":"School_Listing[[#This Row],[System Code]]&School_Listing[[#This Row],[School Code]]","v":"7927213"},"Early Childhood Programs",{"$f":"School_Listing[[#This Row],[School Code]]","v":7213}]
[792,"MEMPHIS-SHELBY COUNTY SCHOOLS",{"$f":"School_Listing[[#This Row],[System Code]]","v":792},2180,{"$f":"School_Listing[[#This Row],[System Code]]&School_Listing[[#This Row],[School Code]]","v":"7922180"},"East High",{"$f":"School_Listing[[#This Row],[School Code]]","v":2180}]
[792,"MEMPHIS-SHELBY COUNTY SCHOOLS",{"$f":"School_Listing[[#This Row],[System Code]]","v":792},2183,{"$f":"School_Listing[[#This Row],[System Code]]&School_Listing[[#This Row],[School Code]]","v":"7922183"},"Egypt Elementary",{"$f":"School_Listing[[#This Row],[School Code]]","v":2183}]
[792,"MEMPHIS-SHELBY COUNTY SCHOOLS",{"$f":"School_Listing[[#This Row],[System Code]]","v":792},7202,{"$f":"School_Listing[[#This Row],[System Code]]&School_Listing[[#This Row],[School Code]]","v":"7927202"},"Ernestine Rivers Child Care Center",{"$f":"School_Listing[[#This Row],[School Code]]","v":7202}]
[792,"MEMPHIS-SHELBY COUNTY SCHOOLS",{"$f":"School_Listing[[#This Row],[System Code]]","v":792},2185,{"$f":"School_Listing[[#This Row],[System Code]]&School_Listing[[#This Row],[School Code]]","v":"7922185"},"Evans Elementary",{"$f":"School_Listing[[#This Row],[School Code]]","v":2185}]
[792,"MEMPHIS-SHELBY COUNTY SCHOOLS",{"$f":"School_Listing[[#This Row],[System Code]]","v":792},2700,{"$f":"School_Listing[[#This Row],[System Code]]&School_Listing[[#This Row],[School Code]]","v":"7922700"},"Exceptional Children Special Placements",{"$f":"School_Listing[[#This Row],[School Code]]","v":2700}]
[792,"MEMPHIS-SHELBY COUNTY SCHOOLS",{"$f":"School_Listing[[#This Row],[System Code]]","v":792},2210,{"$f":"School_Listing[[#This Row],[System Code]]&School_Listing[[#This Row],[School Code]]","v":"7922210"},"Ford Road Elementary",{"$f":"School_Listing[[#This Row],[School Code]]","v":2210}]
[792,"MEMPHIS-SHELBY COUNTY SCHOOLS",{"$f":"School_Listing[[#This Row],[System Code]]","v":792},2215,{"$f":"School_Listing[[#This Row],[System Code]]&School_Listing[[#This Row],[School Code]]","v":"7922215"},"Fox Meadows Elementary",{"$f":"School_Listing[[#This Row],[School Code]]","v":2215}]
[792,"MEMPHIS-SHELBY COUNTY SCHOOLS",{"$f":"School_Listing[[#This Row],[System Code]]","v":792},101,{"$f":"School_Listing[[#This Row],[System Code]]&School_Listing[[#This Row],[School Code]]","v":"792101"},"Frayser-Corning Elementary",{"$f":"School_Listing[[#This Row],[School Code]]","v":101}]
[792,"MEMPHIS-SHELBY COUNTY SCHOOLS",{"$f":"School_Listing[[#This Row],[System Code]]","v":792},8155,{"$f":"School_Listing[[#This Row],[System Code]]&School_Listing[[#This Row],[School Code]]","v":"7928155"},"Freedom Prep Elementary - Millbranch",{"$f":"School_Listing[[#This Row],[School Code]]","v":8155}]
[792,"MEMPHIS-SHELBY COUNTY SCHOOLS",{"$f":"School_Listing[[#This Row],[System Code]]","v":792},8375,{"$f":"School_Listing[[#This Row],[System Code]]&School_Listing[[#This Row],[School Code]]","v":"7928375"},"Freedom Prep Elementary - Parkrose",{"$f":"School_Listing[[#This Row],[School Code]]","v":8375}]
[792,"MEMPHIS-SHELBY COUNTY SCHOOLS",{"$f":"School_Listing[[#This Row],[System Code]]","v":792},8355,{"$f":"School_Listing[[#This Row],[System Code]]&School_Listing[[#This Row],[School Code]]","v":"7928355"},"Freedom Prep Middle - Brownlee",{"$f":"School_Listing[[#This Row],[School Code]]","v":8355}]
[792,"MEMPHIS-SHELBY COUNTY SCHOOLS",{"$f":"School_Listing[[#This Row],[System Code]]","v":792},8234,{"$f":"School_Listing[[#This Row],[System Code]]&School_Listing[[#This Row],[School Code]]","v":"7928234"},"Freedom Preparatory Academy Flagship",{"$f":"School_Listing[[#This Row],[School Code]]","v":8234}]
[792,"MEMPHIS-SHELBY COUNTY SCHOOLS",{"$f":"School_Listing[[#This Row],[System Code]]","v":792},2230,{"$f":"School_Listing[[#This Row],[System Code]]&School_Listing[[#This Row],[School Code]]","v":"7922230"},"Gardenview Elementary",{"$f":"School_Listing[[#This Row],[School Code]]","v":2230}]
[792,"MEMPHIS-SHELBY COUNTY SCHOOLS",{"$f":"School_Listing[[#This Row],[System Code]]","v":792},2245,{"$f":"School_Listing[[#This Row],[System Code]]&School_Listing[[#This Row],[School Code]]","v":"7922245"},"Geeter School",{"$f":"School_Listing[[#This Row],[School Code]]","v":2245}]
[792,"MEMPHIS-SHELBY COUNTY SCHOOLS",{"$f":"School_Listing[[#This Row],[System Code]]","v":792},102,{"$f":"School_Listing[[#This Row],[System Code]]&School_Listing[[#This Row],[School Code]]","v":"792102"},"Georgian Hills Elementary",{"$f":"School_Listing[[#This Row],[School Code]]","v":102}]
[792,"MEMPHIS-SHELBY COUNTY SCHOOLS",{"$f":"School_Listing[[#This Row],[System Code]]","v":792},2255,{"$f":"School_Listing[[#This Row],[System Code]]&School_Listing[[#This Row],[School Code]]","v":"7922255"},"Georgian Hills Middle",{"$f":"School_Listing[[#This Row],[School Code]]","v":2255}]
[792,"MEMPHIS-SHELBY COUNTY SCHOOLS",{"$f":"School_Listing[[#This Row],[System Code]]","v":792},2258,{"$f":"School_Listing[[#This Row],[System Code]]&School_Listing[[#This Row],[School Code]]","v":"7922258"},"Germanshire Elementary",{"$f":"School_Listing[[#This Row],[School Code]]","v":2258}]
[792,"MEMPHIS-SHELBY COUNTY SCHOOLS",{"$f":"School_Listing[[#This Row],[System Code]]","v":792},105,{"$f":"School_Listing[[#This Row],[System Code]]&School_Listing[[#This Row],[School Code]]","v":"792105"},"Germantown Elementary",{"$f":"School_Listing[[#This Row],[School Code]]","v":105}]
[792,"MEMPHIS-SHELBY COUNTY SCHOOLS",{"$f":"School_Listing[[#This Row],[System Code]]","v":792},110,{"$f":"School_Listing[[#This Row],[System Code]]&School_Listing[[#This Row],[School Code]]","v":"792110"},"Germantown High",{"$f":"School_Listing[[#This Row],[School Code]]","v":110}]
[792,"MEMPHIS-SHELBY COUNTY SCHOOLS",{"$f":"School_Listing[[#This Row],[System Code]]","v":792},107,{"$f":"School_Listing[[#This Row],[System Code]]&School_Listing[[#This Row],[School Code]]","v":"792107"},"Germantown Middle",{"$f":"School_Listing[[#This Row],[School Code]]","v":107}]
[792,"MEMPHIS-SHELBY COUNTY SCHOOLS",{"$f":"School_Listing[[#This Row],[System Code]]","v":792},2259,{"$f":"School_Listing[[#This Row],[System Code]]&School_Listing[[#This Row],[School Code]]","v":"7922259"},"Getwell Elementary",{"$f":"School_Listing[[#This Row],[School Code]]","v":2259}]
[792,"MEMPHIS-SHELBY COUNTY SCHOOLS",{"$f":"School_Listing[[#This Row],[System Code]]","v":792},2285,{"$f":"School_Listing[[#This Row],[System Code]]&School_Listing[[#This Row],[School Code]]","v":"7922285"},"Grahamwood Elementary",{"$f":"School_Listing[[#This Row],[School Code]]","v":2285}]
[792,"MEMPHIS-SHELBY COUNTY SCHOOLS",{"$f":"School_Listing[[#This Row],[System Code]]","v":792},2835,{"$f":"School_Listing[[#This Row],[System Code]]&School_Listing[[#This Row],[School Code]]","v":"7922835"},"Grandview Heights Middle School",{"$f":"School_Listing[[#This Row],[School Code]]","v":2835}]
[792,"MEMPHIS-SHELBY COUNTY SCHOOLS",{"$f":"School_Listing[[#This Row],[System Code]]","v":792},8280,{"$f":"School_Listing[[#This Row],[System Code]]&School_Listing[[#This Row],[School Code]]","v":"7928280"},"Granville T. Woods Academy of Innovation Charter School",{"$f":"School_Listing[[#This Row],[School Code]]","v":8280}]
[792,"MEMPHIS-SHELBY COUNTY SCHOOLS",{"$f":"School_Listing[[#This Row],[System Code]]","v":792},2317,{"$f":"School_Listing[[#This Row],[System Code]]&School_Listing[[#This Row],[School Code]]","v":"7922317"},"Hamilton High",{"$f":"School_Listing[[#This Row],[School Code]]","v":2317}]
[792,"MEMPHIS-SHELBY COUNTY SCHOOLS",{"$f":"School_Listing[[#This Row],[System Code]]","v":792},2311,{"$f":"School_Listing[[#This Row],[System Code]]&School_Listing[[#This Row],[School Code]]","v":"7922311"},"Hamilton School",{"$f":"School_Listing[[#This Row],[School Code]]","v":2311}]
[792,"MEMPHIS-SHELBY COUNTY SCHOOLS",{"$f":"School_Listing[[#This Row],[System Code]]","v":792},2325,{"$f":"School_Listing[[#This Row],[System Code]]&School_Listing[[#This Row],[School Code]]","v":"7922325"},"Havenview Middle",{"$f":"School_Listing[[#This Row],[School Code]]","v":2325}]
[792,"MEMPHIS-SHELBY COUNTY SCHOOLS",{"$f":"School_Listing[[#This Row],[System Code]]","v":792},2330,{"$f":"School_Listing[[#This Row],[System Code]]&School_Listing[[#This Row],[School Code]]","v":"7922330"},"Hawkins Mill Elementary",{"$f":"School_Listing[[#This Row],[School Code]]","v":2330}]
[792,"MEMPHIS-SHELBY COUNTY SCHOOLS",{"$f":"School_Listing[[#This Row],[System Code]]","v":792},2331,{"$f":"School_Listing[[#This Row],[System Code]]&School_Listing[[#This Row],[School Code]]","v":"7922331"},"Hickory Ridge Elementary",{"$f":"School_Listing[[#This Row],[School Code]]","v":2331}]
[792,"MEMPHIS-SHELBY COUNTY SCHOOLS",{"$f":"School_Listing[[#This Row],[System Code]]","v":792},2333,{"$f":"School_Listing[[#This Row],[System Code]]&School_Listing[[#This Row],[School Code]]","v":"7922333"},"Hickory Ridge Middle",{"$f":"School_Listing[[#This Row],[School Code]]","v":2333}]
[792,"MEMPHIS-SHELBY COUNTY SCHOOLS",{"$f":"School_Listing[[#This Row],[System Code]]","v":792},108,{"$f":"School_Listing[[#This Row],[System Code]]&School_Listing[[#This Row],[School Code]]","v":"792108"},"Highland Oaks Elementary",{"$f":"School_Listing[[#This Row],[School Code]]","v":108}]
[792,"MEMPHIS-SHELBY COUNTY SCHOOLS",{"$f":"School_Listing[[#This Row],[System Code]]","v":792},200,{"$f":"School_Listing[[#This Row],[System Code]]&School_Listing[[#This Row],[School Code]]","v":"792200"},"Highland Oaks Middle",{"$f":"School_Listing[[#This Row],[School Code]]","v":200}]
[792,"MEMPHIS-SHELBY COUNTY SCHOOLS",{"$f":"School_Listing[[#This Row],[System Code]]","v":792},2338,{"$f":"School_Listing[[#This Row],[System Code]]&School_Listing[[#This Row],[School Code]]","v":"7922338"},"Hollis F. Price Middle College",{"$f":"School_Listing[[#This Row],[School Code]]","v":2338}]
[792,"MEMPHIS-SHELBY COUNTY SCHOOLS",{"$f":"School_Listing[[#This Row],[System Code]]","v":792},2343,{"$f":"School_Listing[[#This Row],[System Code]]&School_Listing[[#This Row],[School Code]]","v":"7922343"},"Holmes Road Elementary",{"$f":"School_Listing[[#This Row],[School Code]]","v":2343}]
[792,"MEMPHIS-SHELBY COUNTY SCHOOLS",{"$f":"School_Listing[[#This Row],[System Code]]","v":792},7203,{"$f":"School_Listing[[#This Row],[System Code]]&School_Listing[[#This Row],[School Code]]","v":"7927203"},"Hooks Dimmick Child Care Center",{"$f":"School_Listing[[#This Row],[School Code]]","v":7203}]
[792,"MEMPHIS-SHELBY COUNTY SCHOOLS",{"$f":"School_Listing[[#This Row],[System Code]]","v":792},7204,{"$f":"School_Listing[[#This Row],[System Code]]&School_Listing[[#This Row],[School Code]]","v":"7927204"},"Horn Lake Road Learning Center",{"$f":"School_Listing[[#This Row],[School Code]]","v":7204}]
[792,"MEMPHIS-SHELBY COUNTY SCHOOLS",{"$f":"School_Listing[[#This Row],[System Code]]","v":792},2353,{"$f":"School_Listing[[#This Row],[System Code]]&School_Listing[[#This Row],[School Code]]","v":"7922353"},"Ida B. Wells Academy ES/MS",{"$f":"School_Listing[[#This Row],[School Code]]","v":2353}]
[792,"MEMPHIS-SHELBY COUNTY SCHOOLS",{"$f":"School_Listing[[#This Row],[System Code]]","v":792},2355,{"$f":"School_Listing[[#This Row],[System Code]]&School_Listing[[#This Row],[School Code]]","v":"7922355"},"Idlewild Elementary",{"$f":"School_Listing[[#This Row],[School Code]]","v":2355}]
[792,"MEMPHIS-SHELBY COUNTY SCHOOLS",{"$f":"School_Listing[[#This Row],[System Code]]","v":792},2362,{"$f":"School_Listing[[#This Row],[System Code]]&School_Listing[[#This Row],[School Code]]","v":"7922362"},"J. P. Freeman Elementary/Middle",{"$f":"School_Listing[[#This Row],[School Code]]","v":2362}]
[792,"MEMPHIS-SHELBY COUNTY SCHOOLS",{"$f":"School_Listing[[#This Row],[System Code]]","v":792},2360,{"$f":"School_Listing[[#This Row],[System Code]]&School_Listing[[#This Row],[School Code]]","v":"7922360"},"Jackson Elementary",{"$f":"School_Listing[[#This Row],[School Code]]","v":2360}]
[792,"MEMPHIS-SHELBY COUNTY SCHOOLS",{"$f":"School_Listing[[#This Row],[System Code]]","v":792},7205,{"$f":"School_Listing[[#This Row],[System Code]]&School_Listing[[#This Row],[School Code]]","v":"7927205"},"Jessie Mahan Day Care Center",{"$f":"School_Listing[[#This Row],[School Code]]","v":7205}]
[792,"MEMPHIS-SHELBY COUNTY SCHOOLS",{"$f":"School_Listing[[#This Row],[System Code]]","v":792},8175,{"$f":"School_Listing[[#This Row],[System Code]]&School_Listing[[#This Row],[School Code]]","v":"7928175"},"Journey East Academy",{"$f":"School_Listing[[#This Row],[School Code]]","v":8175}]
[792,"MEMPHIS-SHELBY COUNTY SCHOOLS",{"$f":"School_Listing[[#This Row],[System Code]]","v":792},2116,{"$f":"School_Listing[[#This Row],[System Code]]&School_Listing[[#This Row],[School Code]]","v":"7922116"},"Kate Bond Elementary School",{"$f":"School_Listing[[#This Row],[School Code]]","v":2116}]
[792,"MEMPHIS-SHELBY COUNTY SCHOOLS",{"$f":"School_Listing[[#This Row],[System Code]]","v":792},2007,{"$f":"School_Listing[[#This Row],[System Code]]&School_Listing[[#This Row],[School Code]]","v":"7922007"},"Kate Bond Middle School",{"$f":"School_Listing[[#This Row],[School Code]]","v":2007}]
[792,"MEMPHIS-SHELBY COUNTY SCHOOLS",{"$f":"School_Listing[[#This Row],[System Code]]","v":792},2368,{"$f":"School_Listing[[#This Row],[System Code]]&School_Listing[[#This Row],[School Code]]","v":"7922368"},"Keystone Elementary",{"$f":"School_Listing[[#This Row],[School Code]]","v":2368}]
[792,"MEMPHIS-SHELBY COUNTY SCHOOLS",{"$f":"School_Listing[[#This Row],[System Code]]","v":792},7206,{"$f":"School_Listing[[#This Row],[System Code]]&School_Listing[[#This Row],[School Code]]","v":"7927206"},"Kids School Early Childhood Development Center",{"$f":"School_Listing[[#This Row],[School Code]]","v":7206}]
[792,"MEMPHIS-SHELBY COUNTY SCHOOLS",{"$f":"School_Listing[[#This Row],[System Code]]","v":792},2377,{"$f":"School_Listing[[#This Row],[System Code]]&School_Listing[[#This Row],[School Code]]","v":"7922377"},"Kingsbury Career Technology Center",{"$f":"School_Listing[[#This Row],[School Code]]","v":2377}]
[792,"MEMPHIS-SHELBY COUNTY SCHOOLS",{"$f":"School_Listing[[#This Row],[System Code]]","v":792},2370,{"$f":"School_Listing[[#This Row],[System Code]]&School_Listing[[#This Row],[School Code]]","v":"7922370"},"Kingsbury Elementary",{"$f":"School_Listing[[#This Row],[School Code]]","v":2370}]
[792,"MEMPHIS-SHELBY COUNTY SCHOOLS",{"$f":"School_Listing[[#This Row],[System Code]]","v":792},2375,{"$f":"School_Listing[[#This Row],[System Code]]&School_Listing[[#This Row],[School Code]]","v":"7922375"},"Kingsbury High",{"$f":"School_Listing[[#This Row],[School Code]]","v":2375}]
[792,"MEMPHIS-SHELBY COUNTY SCHOOLS",{"$f":"School_Listing[[#This Row],[System Code]]","v":792},2373,{"$f":"School_Listing[[#This Row],[System Code]]&School_Listing[[#This Row],[School Code]]","v":"7922373"},"Kingsbury Middle",{"$f":"School_Listing[[#This Row],[School Code]]","v":2373}]
[792,"MEMPHIS-SHELBY COUNTY SCHOOLS",{"$f":"School_Listing[[#This Row],[System Code]]","v":792},8258,{"$f":"School_Listing[[#This Row],[System Code]]&School_Listing[[#This Row],[School Code]]","v":"7928258"},"KIPP Memphis Academy Middle",{"$f":"School_Listing[[#This Row],[School Code]]","v":8258}]
[792,"MEMPHIS-SHELBY COUNTY SCHOOLS",{"$f":"School_Listing[[#This Row],[System Code]]","v":792},8262,{"$f":"School_Listing[[#This Row],[System Code]]&School_Listing[[#This Row],[School Code]]","v":"7928262"},"KIPP Memphis Collegiate Elementary",{"$f":"School_Listing[[#This Row],[School Code]]","v":8262}]
[792,"MEMPHIS-SHELBY COUNTY SCHOOLS",{"$f":"School_Listing[[#This Row],[System Code]]","v":792},8202,{"$f":"School_Listing[[#This Row],[System Code]]&School_Listing[[#This Row],[School Code]]","v":"7928202"},"KIPP Memphis Collegiate High School",{"$f":"School_Listing[[#This Row],[School Code]]","v":8202}]
[792,"MEMPHIS-SHELBY COUNTY SCHOOLS",{"$f":"School_Listing[[#This Row],[System Code]]","v":792},8238,{"$f":"School_Listing[[#This Row],[System Code]]&School_Listing[[#This Row],[School Code]]","v":"7928238"},"KIPP Memphis Collegiate Middle",{"$f":"School_Listing[[#This Row],[School Code]]","v":8238}]
[792,"MEMPHIS-SHELBY COUNTY SCHOOLS",{"$f":"School_Listing[[#This Row],[System Code]]","v":792},2379,{"$f":"School_Listing[[#This Row],[System Code]]&School_Listing[[#This Row],[School Code]]","v":"7922379"},"Kirby High",{"$f":"School_Listing[[#This Row],[School Code]]","v":2379}]
[792,"MEMPHIS-SHELBY COUNTY SCHOOLS",{"$f":"School_Listing[[#This Row],[System Code]]","v":792},2395,{"$f":"School_Listing[[#This Row],[System Code]]&School_Listing[[#This Row],[School Code]]","v":"7922395"},"Larose Elementary",{"$f":"School_Listing[[#This Row],[School Code]]","v":2395}]
[792,"MEMPHIS-SHELBY COUNTY SCHOOLS",{"$f":"School_Listing[[#This Row],[System Code]]","v":792},8286,{"$f":"School_Listing[[#This Row],[System Code]]&School_Listing[[#This Row],[School Code]]","v":"7928286"},"Leadership Preparatory Charter School",{"$f":"School_Listing[[#This Row],[School Code]]","v":8286}]
[792,"MEMPHIS-SHELBY COUNTY SCHOOLS",{"$f":"School_Listing[[#This Row],[System Code]]","v":792},2435,{"$f":"School_Listing[[#This Row],[System Code]]&School_Listing[[#This Row],[School Code]]","v":"7922435"},"Levi Elementary",{"$f":"School_Listing[[#This Row],[School Code]]","v":2435}]
[792,"MEMPHIS-SHELBY COUNTY SCHOOLS",{"$f":"School_Listing[[#This Row],[System Code]]","v":792},205,{"$f":"School_Listing[[#This Row],[System Code]]&School_Listing[[#This Row],[School Code]]","v":"792205"},"Lowrance Elementary/Middle",{"$f":"School_Listing[[#This Row],[School Code]]","v":205}]
[792,"MEMPHIS-SHELBY COUNTY SCHOOLS",{"$f":"School_Listing[[#This Row],[System Code]]","v":792},2463,{"$f":"School_Listing[[#This Row],[System Code]]&School_Listing[[#This Row],[School Code]]","v":"7922463"},"Lucie E. Campbell Elementary",{"$f":"School_Listing[[#This Row],[School Code]]","v":2463}]
[792,"MEMPHIS-SHELBY COUNTY SCHOOLS",{"$f":"School_Listing[[#This Row],[System Code]]","v":792},115,{"$f":"School_Listing[[#This Row],[System Code]]&School_Listing[[#This Row],[School Code]]","v":"792115"},"Lucy Elementary",{"$f":"School_Listing[[#This Row],[School Code]]","v":115}]
[792,"MEMPHIS-SHELBY COUNTY SCHOOLS",{"$f":"School_Listing[[#This Row],[System Code]]","v":792},118,{"$f":"School_Listing[[#This Row],[System Code]]&School_Listing[[#This Row],[School Code]]","v":"792118"},"Macon-Hall Elementary",{"$f":"School_Listing[[#This Row],[School Code]]","v":118}]
[792,"MEMPHIS-SHELBY COUNTY SCHOOLS",{"$f":"School_Listing[[#This Row],[System Code]]","v":792},2480,{"$f":"School_Listing[[#This Row],[System Code]]&School_Listing[[#This Row],[School Code]]","v":"7922480"},"Manassas High",{"$f":"School_Listing[[#This Row],[School Code]]","v":2480}]
[792,"MEMPHIS-SHELBY COUNTY SCHOOLS",{"$f":"School_Listing[[#This Row],[System Code]]","v":792},2836,{"$f":"School_Listing[[#This Row],[System Code]]&School_Listing[[#This Row],[School Code]]","v":"7922836"},"Maxine Smith STEAM Academy",{"$f":"School_Listing[[#This Row],[School Code]]","v":2836}]
[792,"MEMPHIS-SHELBY COUNTY SCHOOLS",{"$f":"School_Listing[[#This Row],[System Code]]","v":792},19,{"$f":"School_Listing[[#This Row],[System Code]]&School_Listing[[#This Row],[School Code]]","v":"79219"},"Medical District High School",{"$f":"School_Listing[[#This Row],[School Code]]","v":19}]
[792,"MEMPHIS-SHELBY COUNTY SCHOOLS",{"$f":"School_Listing[[#This Row],[System Code]]","v":792},2493,{"$f":"School_Listing[[#This Row],[System Code]]&School_Listing[[#This Row],[School Code]]","v":"7922493"},"Melrose High",{"$f":"School_Listing[[#This Row],[School Code]]","v":2493}]
[792,"MEMPHIS-SHELBY COUNTY SCHOOLS",{"$f":"School_Listing[[#This Row],[System Code]]","v":792},8205,{"$f":"School_Listing[[#This Row],[System Code]]&School_Listing[[#This Row],[School Code]]","v":"7928205"},"Memphis Academy Of Science Engineering Middle/High",{"$f":"School_Listing[[#This Row],[School Code]]","v":8205}]
[792,"MEMPHIS-SHELBY COUNTY SCHOOLS",{"$f":"School_Listing[[#This Row],[System Code]]","v":792},8207,{"$f":"School_Listing[[#This Row],[System Code]]&School_Listing[[#This Row],[School Code]]","v":"7928207"},"Memphis Business Academy Elementary School",{"$f":"School_Listing[[#This Row],[School Code]]","v":8207}]
[792,"MEMPHIS-SHELBY COUNTY SCHOOLS",{"$f":"School_Listing[[#This Row],[System Code]]","v":792},8340,{"$f":"School_Listing[[#This Row],[System Code]]&School_Listing[[#This Row],[School Code]]","v":"7928340"},"Memphis Business Academy Hickory Hill Elementary School",{"$f":"School_Listing[[#This Row],[School Code]]","v":8340}]
[792,"MEMPHIS-SHELBY COUNTY SCHOOLS",{"$f":"School_Listing[[#This Row],[System Code]]","v":792},8335,{"$f":"School_Listing[[#This Row],[System Code]]&School_Listing[[#This Row],[School Code]]","v":"7928335"},"Memphis Business Academy Hickory Hill Middle School",{"$f":"School_Listing[[#This Row],[School Code]]","v":8335}]
[792,"MEMPHIS-SHELBY COUNTY SCHOOLS",{"$f":"School_Listing[[#This Row],[System Code]]","v":792},8217,{"$f":"School_Listing[[#This Row],[System Code]]&School_Listing[[#This Row],[School Code]]","v":"7928217"},"Memphis Business Academy High School",{"$f":"School_Listing[[#This Row],[School Code]]","v":8217}]
[792,"MEMPHIS-SHELBY COUNTY SCHOOLS",{"$f":"School_Listing[[#This Row],[System Code]]","v":792},8215,{"$f":"School_Listing[[#This Row],[System Code]]&School_Listing[[#This Row],[School Code]]","v":"7928215"},"Memphis Business Academy Middle",{"$f":"School_Listing[[#This Row],[School Code]]","v":8215}]
[792,"MEMPHIS-SHELBY COUNTY SCHOOLS",{"$f":"School_Listing[[#This Row],[System Code]]","v":792},8240,{"$f":"School_Listing[[#This Row],[System Code]]&School_Listing[[#This Row],[School Code]]","v":"7928240"},"Memphis College Preparatory",{"$f":"School_Listing[[#This Row],[School Code]]","v":8240}]
[792,"MEMPHIS-SHELBY COUNTY SCHOOLS",{"$f":"School_Listing[[#This Row],[System Code]]","v":792},8170,{"$f":"School_Listing[[#This Row],[System Code]]&School_Listing[[#This Row],[School Code]]","v":"7928170"},"Memphis Delta Preparatory",{"$f":"School_Listing[[#This Row],[School Code]]","v":8170}]
[792,"MEMPHIS-SHELBY COUNTY SCHOOLS",{"$f":"School_Listing[[#This Row],[System Code]]","v":792},8260,{"$f":"School_Listing[[#This Row],[System Code]]&School_Listing[[#This Row],[School Code]]","v":"7928260"},"Memphis Grizzlies Preparatory Charter School",{"$f":"School_Listing[[#This Row],[School Code]]","v":8260}]
[792,"MEMPHIS-SHELBY COUNTY SCHOOLS",{"$f":"School_Listing[[#This Row],[System Code]]","v":792},7207,{"$f":"School_Listing[[#This Row],[System Code]]&School_Listing[[#This Row],[School Code]]","v":"7927207"},"Memphis Learning Academy",{"$f":"School_Listing[[#This Row],[School Code]]","v":7207}]
[792,"MEMPHIS-SHELBY COUNTY SCHOOLS",{"$f":"School_Listing[[#This Row],[System Code]]","v":792},8380,{"$f":"School_Listing[[#This Row],[System Code]]&School_Listing[[#This Row],[School Code]]","v":"7928380"},"Memphis Merit Academy",{"$f":"School_Listing[[#This Row],[School Code]]","v":8380}]
[792,"MEMPHIS-SHELBY COUNTY SCHOOLS",{"$f":"School_Listing[[#This Row],[System Code]]","v":792},8264,{"$f":"School_Listing[[#This Row],[System Code]]&School_Listing[[#This Row],[School Code]]","v":"7928264"},"Memphis Rise Academy",{"$f":"School_Listing[[#This Row],[School Code]]","v":8264}]
[792,"MEMPHIS-SHELBY COUNTY SCHOOLS",{"$f":"School_Listing[[#This Row],[System Code]]","v":792},8252,{"$f":"School_Listing[[#This Row],[System Code]]&School_Listing[[#This Row],[School Code]]","v":"7928252"},"Memphis School of Excellence",{"$f":"School_Listing[[#This Row],[School Code]]","v":8252}]
[792,"MEMPHIS-SHELBY COUNTY SCHOOLS",{"$f":"School_Listing[[#This Row],[System Code]]","v":792},8304,{"$f":"School_Listing[[#This Row],[System Code]]&School_Listing[[#This Row],[School Code]]","v":"7928304"},"Memphis School of Excellence Cordova",{"$f":"School_Listing[[#This Row],[School Code]]","v":8304}]
[792,"MEMPHIS-SHELBY COUNTY SCHOOLS",{"$f":"School_Listing[[#This Row],[System Code]]","v":792},8310,{"$f":"School_Listing[[#This Row],[System Code]]&School_Listing[[#This Row],[School Code]]","v":"7928310"},"Memphis School of Excellence Elementary",{"$f":"School_Listing[[#This Row],[School Code]]","v":8310}]
[792,"MEMPHIS-SHELBY COUNTY SCHOOLS",{"$f":"School_Listing[[#This Row],[System Code]]","v":792},8303,{"$f":"School_Listing[[#This Row],[System Code]]&School_Listing[[#This Row],[School Code]]","v":"7928303"},"Memphis School of Excellence Elementary Cordova",{"$f":"School_Listing[[#This Row],[School Code]]","v":8303}]
[792,"MEMPHIS-SHELBY COUNTY SCHOOLS",{"$f":"School_Listing[[#This Row],[System Code]]","v":792},8165,{"$f":"School_Listing[[#This Row],[System Code]]&School_Listing[[#This Row],[School Code]]","v":"7928165"},"Memphis STEM Academy",{"$f":"School_Listing[[#This Row],[School Code]]","v":8165}]
[792,"MEMPHIS-SHELBY COUNTY SCHOOLS",{"$f":"School_Listing[[#This Row],[System Code]]","v":792},2832,{"$f":"School_Listing[[#This Row],[System Code]]&School_Listing[[#This Row],[School Code]]","v":"7922832"},"Memphis Virtual School",{"$f":"School_Listing[[#This Row],[School Code]]","v":2832}]
[792,"MEMPHIS-SHELBY COUNTY SCHOOLS",{"$f":"School_Listing[[#This Row],[System Code]]","v":792},2515,{"$f":"School_Listing[[#This Row],[System Code]]&School_Listing[[#This Row],[School Code]]","v":"7922515"},"Middle College High",{"$f":"School_Listing[[#This Row],[School Code]]","v":2515}]
[792,"MEMPHIS-SHELBY COUNTY SCHOOLS",{"$f":"School_Listing[[#This Row],[System Code]]","v":792},2520,{"$f":"School_Listing[[#This Row],[System Code]]&School_Listing[[#This Row],[School Code]]","v":"7922520"},"Mitchell High",{"$f":"School_Listing[[#This Row],[School Code]]","v":2520}]
[792,"MEMPHIS-SHELBY COUNTY SCHOOLS",{"$f":"School_Listing[[#This Row],[System Code]]","v":792},140,{"$f":"School_Listing[[#This Row],[System Code]]&School_Listing[[#This Row],[School Code]]","v":"792140"},"Mt. Pisgah Middle/High",{"$f":"School_Listing[[#This Row],[School Code]]","v":140}]
[792,"MEMPHIS-SHELBY COUNTY SCHOOLS",{"$f":"School_Listing[[#This Row],[System Code]]","v":792},7208,{"$f":"School_Listing[[#This Row],[System Code]]&School_Listing[[#This Row],[School Code]]","v":"7927208"},"Nat Burning Orange Mound Day Nursery Learning, Inc.",{"$f":"School_Listing[[#This Row],[School Code]]","v":7208}]
[792,"MEMPHIS-SHELBY COUNTY SCHOOLS",{"$f":"School_Listing[[#This Row],[System Code]]","v":792},2525,{"$f":"School_Listing[[#This Row],[System Code]]&School_Listing[[#This Row],[School Code]]","v":"7922525"},"Newberry Elementary",{"$f":"School_Listing[[#This Row],[School Code]]","v":2525}]
[792,"MEMPHIS-SHELBY COUNTY SCHOOLS",{"$f":"School_Listing[[#This Row],[System Code]]","v":792},145,{"$f":"School_Listing[[#This Row],[System Code]]&School_Listing[[#This Row],[School Code]]","v":"792145"},"Northaven Elementary",{"$f":"School_Listing[[#This Row],[School Code]]","v":145}]
[792,"MEMPHIS-SHELBY COUNTY SCHOOLS",{"$f":"School_Listing[[#This Row],[System Code]]","v":792},2824,{"$f":"School_Listing[[#This Row],[System Code]]&School_Listing[[#This Row],[School Code]]","v":"7922824"},"Northwest Prep Academy",{"$f":"School_Listing[[#This Row],[School Code]]","v":2824}]
[792,"MEMPHIS-SHELBY COUNTY SCHOOLS",{"$f":"School_Listing[[#This Row],[System Code]]","v":792},2692,{"$f":"School_Listing[[#This Row],[System Code]]&School_Listing[[#This Row],[School Code]]","v":"7922692"},"Oak Forest Elementary",{"$f":"School_Listing[[#This Row],[School Code]]","v":2692}]
[792,"MEMPHIS-SHELBY COUNTY SCHOOLS",{"$f":"School_Listing[[#This Row],[System Code]]","v":792},2540,{"$f":"School_Listing[[#This Row],[System Code]]&School_Listing[[#This Row],[School Code]]","v":"7922540"},"Oakhaven Elementary",{"$f":"School_Listing[[#This Row],[School Code]]","v":2540}]
[792,"MEMPHIS-SHELBY COUNTY SCHOOLS",{"$f":"School_Listing[[#This Row],[System Code]]","v":792},2545,{"$f":"School_Listing[[#This Row],[System Code]]&School_Listing[[#This Row],[School Code]]","v":"7922545"},"Oakhaven High",{"$f":"School_Listing[[#This Row],[School Code]]","v":2545}]
[792,"MEMPHIS-SHELBY COUNTY SCHOOLS",{"$f":"School_Listing[[#This Row],[System Code]]","v":792},2543,{"$f":"School_Listing[[#This Row],[System Code]]&School_Listing[[#This Row],[School Code]]","v":"7922543"},"Oakhaven Middle",{"$f":"School_Listing[[#This Row],[School Code]]","v":2543}]
[792,"MEMPHIS-SHELBY COUNTY SCHOOLS",{"$f":"School_Listing[[#This Row],[System Code]]","v":792},2550,{"$f":"School_Listing[[#This Row],[System Code]]&School_Listing[[#This Row],[School Code]]","v":"7922550"},"Oakshire Elementary",{"$f":"School_Listing[[#This Row],[School Code]]","v":2550}]
[792,"MEMPHIS-SHELBY COUNTY SCHOOLS",{"$f":"School_Listing[[#This Row],[System Code]]","v":792},2565,{"$f":"School_Listing[[#This Row],[System Code]]&School_Listing[[#This Row],[School Code]]","v":"7922565"},"Overton High",{"$f":"School_Listing[[#This Row],[School Code]]","v":2565}]
[792,"MEMPHIS-SHELBY COUNTY SCHOOLS",{"$f":"School_Listing[[#This Row],[System Code]]","v":792},2261,{"$f":"School_Listing[[#This Row],[System Code]]&School_Listing[[#This Row],[School Code]]","v":"7922261"},"Parkway Village Elementary",{"$f":"School_Listing[[#This Row],[School Code]]","v":2261}]
[792,"MEMPHIS-SHELBY COUNTY SCHOOLS",{"$f":"School_Listing[[#This Row],[System Code]]","v":792},2570,{"$f":"School_Listing[[#This Row],[System Code]]&School_Listing[[#This Row],[School Code]]","v":"7922570"},"Peabody Elementary",{"$f":"School_Listing[[#This Row],[School Code]]","v":2570}]
[792,"MEMPHIS-SHELBY COUNTY SCHOOLS",{"$f":"School_Listing[[#This Row],[System Code]]","v":792},8345,{"$f":"School_Listing[[#This Row],[System Code]]&School_Listing[[#This Row],[School Code]]","v":"7928345"},"Perea Elementary School",{"$f":"School_Listing[[#This Row],[School Code]]","v":8345}]
[792,"MEMPHIS-SHELBY COUNTY SCHOOLS",{"$f":"School_Listing[[#This Row],[System Code]]","v":792},8315,{"$f":"School_Listing[[#This Row],[System Code]]&School_Listing[[#This Row],[School Code]]","v":"7928315"},"Power Center Academy Elementary - Southeast",{"$f":"School_Listing[[#This Row],[School Code]]","v":8315}]
[792,"MEMPHIS-SHELBY COUNTY SCHOOLS",{"$f":"School_Listing[[#This Row],[System Code]]","v":792},8270,{"$f":"School_Listing[[#This Row],[System Code]]&School_Listing[[#This Row],[School Code]]","v":"7928270"},"Power Center Academy Elementary School",{"$f":"School_Listing[[#This Row],[School Code]]","v":8270}]
[792,"MEMPHIS-SHELBY COUNTY SCHOOLS",{"$f":"School_Listing[[#This Row],[System Code]]","v":792},8206,{"$f":"School_Listing[[#This Row],[System Code]]&School_Listing[[#This Row],[School Code]]","v":"7928206"},"Power Center Academy High School",{"$f":"School_Listing[[#This Row],[School Code]]","v":8206}]
[792,"MEMPHIS-SHELBY COUNTY SCHOOLS",{"$f":"School_Listing[[#This Row],[System Code]]","v":792},8220,{"$f":"School_Listing[[#This Row],[System Code]]&School_Listing[[#This Row],[School Code]]","v":"7928220"},"Power Center Academy Middle",{"$f":"School_Listing[[#This Row],[School Code]]","v":8220}]
[792,"MEMPHIS-SHELBY COUNTY SCHOOLS",{"$f":"School_Listing[[#This Row],[System Code]]","v":792},8160,{"$f":"School_Listing[[#This Row],[System Code]]&School_Listing[[#This Row],[School Code]]","v":"7928160"},"Power Center Academy Middle - Southeast",{"$f":"School_Listing[[#This Row],[School Code]]","v":8160}]
[792,"MEMPHIS-SHELBY COUNTY SCHOOLS",{"$f":"School_Listing[[#This Row],[System Code]]","v":792},7209,{"$f":"School_Listing[[#This Row],[System Code]]&School_Listing[[#This Row],[School Code]]","v":"7927209"},"Primary Prepatory",{"$f":"School_Listing[[#This Row],[School Code]]","v":7209}]
[792,"MEMPHIS-SHELBY COUNTY SCHOOLS",{"$f":"School_Listing[[#This Row],[System Code]]","v":792},8225,{"$f":"School_Listing[[#This Row],[System Code]]&School_Listing[[#This Row],[School Code]]","v":"7928225"},"Promise Academy",{"$f":"School_Listing[[#This Row],[School Code]]","v":8225}]
[792,"MEMPHIS-SHELBY COUNTY SCHOOLS",{"$f":"School_Listing[[#This Row],[System Code]]","v":792},2599,{"$f":"School_Listing[[#This Row],[System Code]]&School_Listing[[#This Row],[School Code]]","v":"7922599"},"Raleigh Egypt Middle School",{"$f":"School_Listing[[#This Row],[School Code]]","v":2599}]
[792,"MEMPHIS-SHELBY COUNTY SCHOOLS",{"$f":"School_Listing[[#This Row],[System Code]]","v":792},2597,{"$f":"School_Listing[[#This Row],[System Code]]&School_Listing[[#This Row],[School Code]]","v":"7922597"},"Raleigh-Bartlett Meadows Elementary",{"$f":"School_Listing[[#This Row],[School Code]]","v":2597}]
[792,"MEMPHIS-SHELBY COUNTY SCHOOLS",{"$f":"School_Listing[[#This Row],[System Code]]","v":792},2598,{"$f":"School_Listing[[#This Row],[System Code]]&School_Listing[[#This Row],[School Code]]","v":"7922598"},"Raleigh-Egypt High",{"$f":"School_Listing[[#This Row],[School Code]]","v":2598}]
[792,"MEMPHIS-SHELBY COUNTY SCHOOLS",{"$f":"School_Listing[[#This Row],[System Code]]","v":792},2600,{"$f":"School_Listing[[#This Row],[System Code]]&School_Listing[[#This Row],[School Code]]","v":"7922600"},"Richland Elementary",{"$f":"School_Listing[[#This Row],[School Code]]","v":2600}]
[792,"MEMPHIS-SHELBY COUNTY SCHOOLS",{"$f":"School_Listing[[#This Row],[System Code]]","v":792},7214,{"$f":"School_Listing[[#This Row],[System Code]]&School_Listing[[#This Row],[School Code]]","v":"7927214"},"Ridgeway Early Learning Center",{"$f":"School_Listing[[#This Row],[School Code]]","v":7214}]
[792,"MEMPHIS-SHELBY COUNTY SCHOOLS",{"$f":"School_Listing[[#This Row],[System Code]]","v":792},2615,{"$f":"School_Listing[[#This Row],[System Code]]&School_Listing[[#This Row],[School Code]]","v":"7922615"},"Ridgeway High",{"$f":"School_Listing[[#This Row],[School Code]]","v":2615}]
[792,"MEMPHIS-SHELBY COUNTY SCHOOLS",{"$f":"School_Listing[[#This Row],[System Code]]","v":792},2612,{"$f":"School_Listing[[#This Row],[System Code]]&School_Listing[[#This Row],[School Code]]","v":"7922612"},"Ridgeway Middle",{"$f":"School_Listing[[#This Row],[School Code]]","v":2612}]
[792,"MEMPHIS-SHELBY COUNTY SCHOOLS",{"$f":"School_Listing[[#This Row],[System Code]]","v":792},2625,{"$f":"School_Listing[[#This Row],[System Code]]&School_Listing[[#This Row],[School Code]]","v":"7922625"},"Riverview Elementary/Middle",{"$f":"School_Listing[[#This Row],[School Code]]","v":2625}]
[792,"MEMPHIS-SHELBY COUNTY SCHOOLS",{"$f":"School_Listing[[#This Row],[System Code]]","v":792},2717,{"$f":"School_Listing[[#This Row],[System Code]]&School_Listing[[#This Row],[School Code]]","v":"7922717"},"Riverwood Elementary School",{"$f":"School_Listing[[#This Row],[School Code]]","v":2717}]
[792,"MEMPHIS-SHELBY COUNTY SCHOOLS",{"$f":"School_Listing[[#This Row],[System Code]]","v":792},2626,{"$f":"School_Listing[[#This Row],[System Code]]&School_Listing[[#This Row],[School Code]]","v":"7922626"},"Robert R. Church Elementary",{"$f":"School_Listing[[#This Row],[School Code]]","v":2626}]
[792,"MEMPHIS-SHELBY COUNTY SCHOOLS",{"$f":"School_Listing[[#This Row],[System Code]]","v":792},2627,{"$f":"School_Listing[[#This Row],[System Code]]&School_Listing[[#This Row],[School Code]]","v":"7922627"},"Ross Elementary",{"$f":"School_Listing[[#This Row],[School Code]]","v":2627}]
[792,"MEMPHIS-SHELBY COUNTY SCHOOLS",{"$f":"School_Listing[[#This Row],[System Code]]","v":792},2630,{"$f":"School_Listing[[#This Row],[System Code]]&School_Listing[[#This Row],[School Code]]","v":"7922630"},"Rozelle Elementary",{"$f":"School_Listing[[#This Row],[School Code]]","v":2630}]
[792,"MEMPHIS-SHELBY COUNTY SCHOOLS",{"$f":"School_Listing[[#This Row],[System Code]]","v":792},2633,{"$f":"School_Listing[[#This Row],[System Code]]&School_Listing[[#This Row],[School Code]]","v":"7922633"},"Scenic Hills Elementary",{"$f":"School_Listing[[#This Row],[School Code]]","v":2633}]
[792,"MEMPHIS-SHELBY COUNTY SCHOOLS",{"$f":"School_Listing[[#This Row],[System Code]]","v":792},2637,{"$f":"School_Listing[[#This Row],[System Code]]&School_Listing[[#This Row],[School Code]]","v":"7922637"},"Sea Isle Elementary",{"$f":"School_Listing[[#This Row],[School Code]]","v":2637}]
[792,"MEMPHIS-SHELBY COUNTY SCHOOLS",{"$f":"School_Listing[[#This Row],[System Code]]","v":792},2650,{"$f":"School_Listing[[#This Row],[System Code]]&School_Listing[[#This Row],[School Code]]","v":"7922650"},"Sharpe Elementary",{"$f":"School_Listing[[#This Row],[School Code]]","v":2650}]
[792,"MEMPHIS-SHELBY COUNTY SCHOOLS",{"$f":"School_Listing[[#This Row],[System Code]]","v":792},2663,{"$f":"School_Listing[[#This Row],[System Code]]&School_Listing[[#This Row],[School Code]]","v":"7922663"},"Sheffield Career Technology Center",{"$f":"School_Listing[[#This Row],[School Code]]","v":2663}]
[792,"MEMPHIS-SHELBY COUNTY SCHOOLS",{"$f":"School_Listing[[#This Row],[System Code]]","v":792},2655,{"$f":"School_Listing[[#This Row],[System Code]]&School_Listing[[#This Row],[School Code]]","v":"7922655"},"Sheffield Elementary",{"$f":"School_Listing[[#This Row],[School Code]]","v":2655}]
[792,"MEMPHIS-SHELBY COUNTY SCHOOLS",{"$f":"School_Listing[[#This Row],[System Code]]","v":792},2660,{"$f":"School_Listing[[#This Row],[System Code]]&School_Listing[[#This Row],[School Code]]","v":"7922660"},"Sheffield High",{"$f":"School_Listing[[#This Row],[School Code]]","v":2660}]
[792,"MEMPHIS-SHELBY COUNTY SCHOOLS",{"$f":"School_Listing[[#This Row],[System Code]]","v":792},2680,{"$f":"School_Listing[[#This Row],[System Code]]&School_Listing[[#This Row],[School Code]]","v":"7922680"},"Shelby Oaks Elementary",{"$f":"School_Listing[[#This Row],[School Code]]","v":2680}]
[792,"MEMPHIS-SHELBY COUNTY SCHOOLS",{"$f":"School_Listing[[#This Row],[System Code]]","v":792},2665,{"$f":"School_Listing[[#This Row],[System Code]]&School_Listing[[#This Row],[School Code]]","v":"7922665"},"Sherwood Elementary",{"$f":"School_Listing[[#This Row],[School Code]]","v":2665}]
[792,"MEMPHIS-SHELBY COUNTY SCHOOLS",{"$f":"School_Listing[[#This Row],[System Code]]","v":792},2670,{"$f":"School_Listing[[#This Row],[System Code]]&School_Listing[[#This Row],[School Code]]","v":"7922670"},"Sherwood Middle",{"$f":"School_Listing[[#This Row],[School Code]]","v":2670}]
[792,"MEMPHIS-SHELBY COUNTY SCHOOLS",{"$f":"School_Listing[[#This Row],[System Code]]","v":792},2675,{"$f":"School_Listing[[#This Row],[System Code]]&School_Listing[[#This Row],[School Code]]","v":"7922675"},"Shrine School",{"$f":"School_Listing[[#This Row],[School Code]]","v":2675}]
[792,"MEMPHIS-SHELBY COUNTY SCHOOLS",{"$f":"School_Listing[[#This Row],[System Code]]","v":792},2690,{"$f":"School_Listing[[#This Row],[System Code]]&School_Listing[[#This Row],[School Code]]","v":"7922690"},"Snowden Elementary/Middle",{"$f":"School_Listing[[#This Row],[School Code]]","v":2690}]
[792,"MEMPHIS-SHELBY COUNTY SCHOOLS",{"$f":"School_Listing[[#This Row],[System Code]]","v":792},8232,{"$f":"School_Listing[[#This Row],[System Code]]&School_Listing[[#This Row],[School Code]]","v":"7928232"},"Soulsville Charter School",{"$f":"School_Listing[[#This Row],[School Code]]","v":8232}]
[792,"MEMPHIS-SHELBY COUNTY SCHOOLS",{"$f":"School_Listing[[#This Row],[System Code]]","v":792},2695,{"$f":"School_Listing[[#This Row],[System Code]]&School_Listing[[#This Row],[School Code]]","v":"7922695"},"South Park Elementary",{"$f":"School_Listing[[#This Row],[School Code]]","v":2695}]
[792,"MEMPHIS-SHELBY COUNTY SCHOOLS",{"$f":"School_Listing[[#This Row],[System Code]]","v":792},8228,{"$f":"School_Listing[[#This Row],[System Code]]&School_Listing[[#This Row],[School Code]]","v":"7928228"},"Southern Avenue Charter School Of Academic Excellence Creative Arts",{"$f":"School_Listing[[#This Row],[School Code]]","v":8228}]
[792,"MEMPHIS-SHELBY COUNTY SCHOOLS",{"$f":"School_Listing[[#This Row],[System Code]]","v":792},2703,{"$f":"School_Listing[[#This Row],[System Code]]&School_Listing[[#This Row],[School Code]]","v":"7922703"},"Southwest Career Technology Center",{"$f":"School_Listing[[#This Row],[School Code]]","v":2703}]
[792,"MEMPHIS-SHELBY COUNTY SCHOOLS",{"$f":"School_Listing[[#This Row],[System Code]]","v":792},175,{"$f":"School_Listing[[#This Row],[System Code]]&School_Listing[[#This Row],[School Code]]","v":"792175"},"Southwind Elementary",{"$f":"School_Listing[[#This Row],[School Code]]","v":175}]
[792,"MEMPHIS-SHELBY COUNTY SCHOOLS",{"$f":"School_Listing[[#This Row],[System Code]]","v":792},178,{"$f":"School_Listing[[#This Row],[System Code]]&School_Listing[[#This Row],[School Code]]","v":"792178"},"Southwind High",{"$f":"School_Listing[[#This Row],[School Code]]","v":178}]
[792,"MEMPHIS-SHELBY COUNTY SCHOOLS",{"$f":"School_Listing[[#This Row],[System Code]]","v":792},2705,{"$f":"School_Listing[[#This Row],[System Code]]&School_Listing[[#This Row],[School Code]]","v":"7922705"},"Springdale Elementary",{"$f":"School_Listing[[#This Row],[School Code]]","v":2705}]
[792,"MEMPHIS-SHELBY COUNTY SCHOOLS",{"$f":"School_Listing[[#This Row],[System Code]]","v":792},8230,{"$f":"School_Listing[[#This Row],[System Code]]&School_Listing[[#This Row],[School Code]]","v":"7928230"},"Star Academy",{"$f":"School_Listing[[#This Row],[School Code]]","v":8230}]
[792,"MEMPHIS-SHELBY COUNTY SCHOOLS",{"$f":"School_Listing[[#This Row],[System Code]]","v":792},8275,{"$f":"School_Listing[[#This Row],[System Code]]&School_Listing[[#This Row],[School Code]]","v":"7928275"},"The Excel Center",{"$f":"School_Listing[[#This Row],[School Code]]","v":8275}]
[792,"MEMPHIS-SHELBY COUNTY SCHOOLS",{"$f":"School_Listing[[#This Row],[System Code]]","v":792},2715,{"$f":"School_Listing[[#This Row],[System Code]]&School_Listing[[#This Row],[School Code]]","v":"7922715"},"Treadwell Elementary",{"$f":"School_Listing[[#This Row],[School Code]]","v":2715}]
[792,"MEMPHIS-SHELBY COUNTY SCHOOLS",{"$f":"School_Listing[[#This Row],[System Code]]","v":792},2723,{"$f":"School_Listing[[#This Row],[System Code]]&School_Listing[[#This Row],[School Code]]","v":"7922723"},"Treadwell Middle School",{"$f":"School_Listing[[#This Row],[School Code]]","v":2723}]
[792,"MEMPHIS-SHELBY COUNTY SCHOOLS",{"$f":"School_Listing[[#This Row],[System Code]]","v":792},2727,{"$f":"School_Listing[[#This Row],[System Code]]&School_Listing[[#This Row],[School Code]]","v":"7922727"},"Trezevant Career and Technology Center",{"$f":"School_Listing[[#This Row],[School Code]]","v":2727}]
[792,"MEMPHIS-SHELBY COUNTY SCHOOLS",{"$f":"School_Listing[[#This Row],[System Code]]","v":792},2725,{"$f":"School_Listing[[#This Row],[System Code]]&School_Listing[[#This Row],[School Code]]","v":"7922725"},"Trezevant High",{"$f":"School_Listing[[#This Row],[School Code]]","v":2725}]
[792,"MEMPHIS-SHELBY COUNTY SCHOOLS",{"$f":"School_Listing[[#This Row],[System Code]]","v":792},2724,{"$f":"School_Listing[[#This Row],[System Code]]&School_Listing[[#This Row],[School Code]]","v":"7922724"},"University High School",{"$f":"School_Listing[[#This Row],[School Code]]","v":2724}]
[792,"MEMPHIS-SHELBY COUNTY SCHOOLS",{"$f":"School_Listing[[#This Row],[System Code]]","v":792},2726,{"$f":"School_Listing[[#This Row],[System Code]]&School_Listing[[#This Row],[School Code]]","v":"7922726"},"University Middle",{"$f":"School_Listing[[#This Row],[School Code]]","v":2726}]
[792,"MEMPHIS-SHELBY COUNTY SCHOOLS",{"$f":"School_Listing[[#This Row],[System Code]]","v":792},8254,{"$f":"School_Listing[[#This Row],[System Code]]&School_Listing[[#This Row],[School Code]]","v":"7928254"},"Veritas College Preparatory",{"$f":"School_Listing[[#This Row],[School Code]]","v":8254}]
[792,"MEMPHIS-SHELBY COUNTY SCHOOLS",{"$f":"School_Listing[[#This Row],[System Code]]","v":792},8266,{"$f":"School_Listing[[#This Row],[System Code]]&School_Listing[[#This Row],[School Code]]","v":"7928266"},"Vision Preparatory Charter School",{"$f":"School_Listing[[#This Row],[School Code]]","v":8266}]
[792,"MEMPHIS-SHELBY COUNTY SCHOOLS",{"$f":"School_Listing[[#This Row],[System Code]]","v":792},2730,{"$f":"School_Listing[[#This Row],[System Code]]&School_Listing[[#This Row],[School Code]]","v":"7922730"},"Vollentine Elementary",{"$f":"School_Listing[[#This Row],[School Code]]","v":2730}]
[792,"MEMPHIS-SHELBY COUNTY SCHOOLS",{"$f":"School_Listing[[#This Row],[System Code]]","v":792},2745,{"$f":"School_Listing[[#This Row],[System Code]]&School_Listing[[#This Row],[School Code]]","v":"7922745"},"Wells Station Elementary",{"$f":"School_Listing[[#This Row],[School Code]]","v":2745}]
[792,"MEMPHIS-SHELBY COUNTY SCHOOLS",{"$f":"School_Listing[[#This Row],[System Code]]","v":792},2840,{"$f":"School_Listing[[#This Row],[System Code]]&School_Listing[[#This Row],[School Code]]","v":"7922840"},"Westhaven Elementary",{"$f":"School_Listing[[#This Row],[School Code]]","v":2840}]
[792,"MEMPHIS-SHELBY COUNTY SCHOOLS",{"$f":"School_Listing[[#This Row],[System Code]]","v":792},2750,{"$f":"School_Listing[[#This Row],[System Code]]&School_Listing[[#This Row],[School Code]]","v":"7922750"},"Westside Elementary",{"$f":"School_Listing[[#This Row],[School Code]]","v":2750}]
[792,"MEMPHIS-SHELBY COUNTY SCHOOLS",{"$f":"School_Listing[[#This Row],[System Code]]","v":792},2770,{"$f":"School_Listing[[#This Row],[System Code]]&School_Listing[[#This Row],[School Code]]","v":"7922770"},"Westwood High",{"$f":"School_Listing[[#This Row],[School Code]]","v":2770}]
[792,"MEMPHIS-SHELBY COUNTY SCHOOLS",{"$f":"School_Listing[[#This Row],[System Code]]","v":792},2777,{"$f":"School_Listing[[#This Row],[System Code]]&School_Listing[[#This Row],[School Code]]","v":"7922777"},"White Station Elementary",{"$f":"School_Listing[[#This Row],[School Code]]","v":2777}]
[792,"MEMPHIS-SHELBY COUNTY SCHOOLS",{"$f":"School_Listing[[#This Row],[System Code]]","v":792},2780,{"$f":"School_Listing[[#This Row],[System Code]]&School_Listing[[#This Row],[School Code]]","v":"7922780"},"White Station High",{"$f":"School_Listing[[#This Row],[School Code]]","v":2780}]
[792,"MEMPHIS-SHELBY COUNTY SCHOOLS",{"$f":"School_Listing[[#This Row],[System Code]]","v":792},2783,{"$f":"School_Listing[[#This Row],[System Code]]&School_Listing[[#This Row],[School Code]]","v":"7922783"},"White Station Middle",{"$f":"School_Listing[[#This Row],[School Code]]","v":2783}]
[792,"MEMPHIS-SHELBY COUNTY SCHOOLS",{"$f":"School_Listing[[#This Row],[System Code]]","v":792},2785,{"$f":"School_Listing[[#This Row],[System Code]]&School_Listing[[#This Row],[School Code]]","v":"7922785"},"Whitehaven Elementary",{"$f":"School_Listing[[#This Row],[School Code]]","v":2785}]
[792,"MEMPHIS-SHELBY COUNTY SCHOOLS",{"$f":"School_Listing[[#This Row],[System Code]]","v":792},2790,{"$f":"School_Listing[[#This Row],[System Code]]&School_Listing[[#This Row],[School Code]]","v":"7922790"},"Whitehaven High",{"$f":"School_Listing[[#This Row],[School Code]]","v":2790}]
[792,"MEMPHIS-SHELBY COUNTY SCHOOLS",{"$f":"School_Listing[[#This Row],[System Code]]","v":792},2694,{"$f":"School_Listing[[#This Row],[System Code]]&School_Listing[[#This Row],[School Code]]","v":"7922694"},"Whitney Elementary",{"$f":"School_Listing[[#This Row],[School Code]]","v":2694}]
[792,"MEMPHIS-SHELBY COUNTY SCHOOLS",{"$f":"School_Listing[[#This Row],[System Code]]","v":792},2053,{"$f":"School_Listing[[#This Row],[System Code]]&School_Listing[[#This Row],[School Code]]","v":"7922053"},"William Herbert Brewster Elementary School",{"$f":"School_Listing[[#This Row],[School Code]]","v":2053}]
[792,"MEMPHIS-SHELBY COUNTY SCHOOLS",{"$f":"School_Listing[[#This Row],[System Code]]","v":792},2800,{"$f":"School_Listing[[#This Row],[System Code]]&School_Listing[[#This Row],[School Code]]","v":"7922800"},"Willow Oaks Elementary",{"$f":"School_Listing[[#This Row],[School Code]]","v":2800}]
[792,"MEMPHIS-SHELBY COUNTY SCHOOLS",{"$f":"School_Listing[[#This Row],[System Code]]","v":792},2805,{"$f":"School_Listing[[#This Row],[System Code]]&School_Listing[[#This Row],[School Code]]","v":"7922805"},"Winchester Elementary",{"$f":"School_Listing[[#This Row],[School Code]]","v":2805}]
[792,"MEMPHIS-SHELBY COUNTY SCHOOLS",{"$f":"School_Listing[[#This Row],[System Code]]","v":792},2810,{"$f":"School_Listing[[#This Row],[System Code]]&School_Listing[[#This Row],[School Code]]","v":"7922810"},"Winridge Elementary",{"$f":"School_Listing[[#This Row],[School Code]]","v":2810}]
[792,"MEMPHIS-SHELBY COUNTY SCHOOLS",{"$f":"School_Listing[[#This Row],[System Code]]","v":792},2815,{"$f":"School_Listing[[#This Row],[System Code]]&School_Listing[[#This Row],[School Code]]","v":"7922815"},"Wooddale High",{"$f":"School_Listing[[#This Row],[School Code]]","v":2815}]
[792,"MEMPHIS-SHELBY COUNTY SCHOOLS",{"$f":"School_Listing[[#This Row],[System Code]]","v":792},185,{"$f":"School_Listing[[#This Row],[System Code]]&School_Listing[[#This Row],[School Code]]","v":"792185"},"Woodstock Middle School",{"$f":"School_Listing[[#This Row],[School Code]]","v":185}]
[793,"ARLINGTON",{"$f":"School_Listing[[#This Row],[System Code]]","v":793},5,{"$f":"School_Listing[[#This Row],[System Code]]&School_Listing[[#This Row],[School Code]]","v":"7935"},"Arlington Elementary",{"$f":"School_Listing[[#This Row],[School Code]]","v":5}]
[793,"ARLINGTON",{"$f":"School_Listing[[#This Row],[System Code]]","v":793},1,{"$f":"School_Listing[[#This Row],[System Code]]&School_Listing[[#This Row],[School Code]]","v":"7931"},"Arlington High",{"$f":"School_Listing[[#This Row],[School Code]]","v":1}]
[793,"ARLINGTON",{"$f":"School_Listing[[#This Row],[System Code]]","v":793},6,{"$f":"School_Listing[[#This Row],[System Code]]&School_Listing[[#This Row],[School Code]]","v":"7936"},"Arlington Middle",{"$f":"School_Listing[[#This Row],[School Code]]","v":6}]
[793,"ARLINGTON",{"$f":"School_Listing[[#This Row],[System Code]]","v":793},195,{"$f":"School_Listing[[#This Row],[System Code]]&School_Listing[[#This Row],[School Code]]","v":"793195"},"Donelson Elementary",{"$f":"School_Listing[[#This Row],[School Code]]","v":195}]
[794,"BARTLETT",{"$f":"School_Listing[[#This Row],[System Code]]","v":794},3,{"$f":"School_Listing[[#This Row],[System Code]]&School_Listing[[#This Row],[School Code]]","v":"7943"},"Altruria Elementary",{"$f":"School_Listing[[#This Row],[School Code]]","v":3}]
[794,"BARTLETT",{"$f":"School_Listing[[#This Row],[System Code]]","v":794},7,{"$f":"School_Listing[[#This Row],[System Code]]&School_Listing[[#This Row],[School Code]]","v":"7947"},"Appling Middle School",{"$f":"School_Listing[[#This Row],[School Code]]","v":7}]
[794,"BARTLETT",{"$f":"School_Listing[[#This Row],[System Code]]","v":794},20,{"$f":"School_Listing[[#This Row],[System Code]]&School_Listing[[#This Row],[School Code]]","v":"79420"},"Bartlett Elementary School",{"$f":"School_Listing[[#This Row],[School Code]]","v":20}]
[794,"BARTLETT",{"$f":"School_Listing[[#This Row],[System Code]]","v":794},25,{"$f":"School_Listing[[#This Row],[System Code]]&School_Listing[[#This Row],[School Code]]","v":"79425"},"Bartlett High School",{"$f":"School_Listing[[#This Row],[School Code]]","v":25}]
[794,"BARTLETT",{"$f":"School_Listing[[#This Row],[System Code]]","v":794},30,{"$f":"School_Listing[[#This Row],[System Code]]&School_Listing[[#This Row],[School Code]]","v":"79430"},"Bon Lin Elementary School",{"$f":"School_Listing[[#This Row],[School Code]]","v":30}]
[794,"BARTLETT",{"$f":"School_Listing[[#This Row],[System Code]]","v":794},33,{"$f":"School_Listing[[#This Row],[System Code]]&School_Listing[[#This Row],[School Code]]","v":"79433"},"Bon Lin Middle School",{"$f":"School_Listing[[#This Row],[School Code]]","v":33}]
[794,"BARTLETT",{"$f":"School_Listing[[#This Row],[System Code]]","v":794},90,{"$f":"School_Listing[[#This Row],[System Code]]&School_Listing[[#This Row],[School Code]]","v":"79490"},"Ellendale Elementary",{"$f":"School_Listing[[#This Row],[School Code]]","v":90}]
[794,"BARTLETT",{"$f":"School_Listing[[#This Row],[System Code]]","v":794},95,{"$f":"School_Listing[[#This Row],[System Code]]&School_Listing[[#This Row],[School Code]]","v":"79495"},"Elmore Park Middle School",{"$f":"School_Listing[[#This Row],[School Code]]","v":95}]
[794,"BARTLETT",{"$f":"School_Listing[[#This Row],[System Code]]","v":794},150,{"$f":"School_Listing[[#This Row],[System Code]]&School_Listing[[#This Row],[School Code]]","v":"794150"},"Oak Elementary",{"$f":"School_Listing[[#This Row],[School Code]]","v":150}]
[794,"BARTLETT",{"$f":"School_Listing[[#This Row],[System Code]]","v":794},155,{"$f":"School_Listing[[#This Row],[System Code]]&School_Listing[[#This Row],[School Code]]","v":"794155"},"Rivercrest Elementary",{"$f":"School_Listing[[#This Row],[School Code]]","v":155}]
[795,"COLLIERVILLE",{"$f":"School_Listing[[#This Row],[System Code]]","v":795},8,{"$f":"School_Listing[[#This Row],[System Code]]&School_Listing[[#This Row],[School Code]]","v":"7958"},"Bailey Station Elementary School",{"$f":"School_Listing[[#This Row],[School Code]]","v":8}]
[795,"COLLIERVILLE",{"$f":"School_Listing[[#This Row],[System Code]]","v":795},55,{"$f":"School_Listing[[#This Row],[System Code]]&School_Listing[[#This Row],[School Code]]","v":"79555"},"Collierville Elementary School",{"$f":"School_Listing[[#This Row],[School Code]]","v":55}]
[795,"COLLIERVILLE",{"$f":"School_Listing[[#This Row],[System Code]]","v":795},60,{"$f":"School_Listing[[#This Row],[System Code]]&School_Listing[[#This Row],[School Code]]","v":"79560"},"Collierville High School",{"$f":"School_Listing[[#This Row],[School Code]]","v":60}]
[795,"COLLIERVILLE",{"$f":"School_Listing[[#This Row],[System Code]]","v":795},63,{"$f":"School_Listing[[#This Row],[System Code]]&School_Listing[[#This Row],[School Code]]","v":"79563"},"Collierville Middle School",{"$f":"School_Listing[[#This Row],[School Code]]","v":63}]
[795,"COLLIERVILLE",{"$f":"School_Listing[[#This Row],[System Code]]","v":795},50,{"$f":"School_Listing[[#This Row],[System Code]]&School_Listing[[#This Row],[School Code]]","v":"79550"},"Collierville Virtual Academy",{"$f":"School_Listing[[#This Row],[School Code]]","v":50}]
[795,"COLLIERVILLE",{"$f":"School_Listing[[#This Row],[System Code]]","v":795},65,{"$f":"School_Listing[[#This Row],[System Code]]&School_Listing[[#This Row],[School Code]]","v":"79565"},"Crosswind Elementary School",{"$f":"School_Listing[[#This Row],[School Code]]","v":65}]
[795,"COLLIERVILLE",{"$f":"School_Listing[[#This Row],[System Code]]","v":795},165,{"$f":"School_Listing[[#This Row],[System Code]]&School_Listing[[#This Row],[School Code]]","v":"795165"},"Schilling Farms Elementary School",{"$f":"School_Listing[[#This Row],[School Code]]","v":165}]
[795,"COLLIERVILLE",{"$f":"School_Listing[[#This Row],[System Code]]","v":795},183,{"$f":"School_Listing[[#This Row],[System Code]]&School_Listing[[#This Row],[School Code]]","v":"795183"},"Sycamore Elementary School",{"$f":"School_Listing[[#This Row],[School Code]]","v":183}]
[795,"COLLIERVILLE",{"$f":"School_Listing[[#This Row],[System Code]]","v":795},190,{"$f":"School_Listing[[#This Row],[System Code]]&School_Listing[[#This Row],[School Code]]","v":"795190"},"Tara Oaks Elementary School",{"$f":"School_Listing[[#This Row],[School Code]]","v":190}]
[795,"COLLIERVILLE",{"$f":"School_Listing[[#This Row],[System Code]]","v":795},168,{"$f":"School_Listing[[#This Row],[System Code]]&School_Listing[[#This Row],[School Code]]","v":"795168"},"West Collierville Middle School",{"$f":"School_Listing[[#This Row],[School Code]]","v":168}]
[796,"GERMANTOWN",{"$f":"School_Listing[[#This Row],[System Code]]","v":796},70,{"$f":"School_Listing[[#This Row],[System Code]]&School_Listing[[#This Row],[School Code]]","v":"79670"},"Dogwood Elementary School",{"$f":"School_Listing[[#This Row],[School Code]]","v":70}]
[796,"GERMANTOWN",{"$f":"School_Listing[[#This Row],[System Code]]","v":796},100,{"$f":"School_Listing[[#This Row],[System Code]]&School_Listing[[#This Row],[School Code]]","v":"796100"},"Farmington Elementary School",{"$f":"School_Listing[[#This Row],[School Code]]","v":100}]
[796,"GERMANTOWN",{"$f":"School_Listing[[#This Row],[System Code]]","v":796},105,{"$f":"School_Listing[[#This Row],[System Code]]&School_Listing[[#This Row],[School Code]]","v":"796105"},"Forest Hill Elementary School",{"$f":"School_Listing[[#This Row],[School Code]]","v":105}]
[796,"GERMANTOWN",{"$f":"School_Listing[[#This Row],[System Code]]","v":796},110,{"$f":"School_Listing[[#This Row],[System Code]]&School_Listing[[#This Row],[School Code]]","v":"796110"},"Germantown Online Academy of Learning",{"$f":"School_Listing[[#This Row],[School Code]]","v":110}]
[796,"GERMANTOWN",{"$f":"School_Listing[[#This Row],[System Code]]","v":796},111,{"$f":"School_Listing[[#This Row],[System Code]]&School_Listing[[#This Row],[School Code]]","v":"796111"},"Houston High School",{"$f":"School_Listing[[#This Row],[School Code]]","v":111}]
[796,"GERMANTOWN",{"$f":"School_Listing[[#This Row],[System Code]]","v":796},109,{"$f":"School_Listing[[#This Row],[System Code]]&School_Listing[[#This Row],[School Code]]","v":"796109"},"Houston Middle School",{"$f":"School_Listing[[#This Row],[School Code]]","v":109}]
[796,"GERMANTOWN",{"$f":"School_Listing[[#This Row],[System Code]]","v":796},160,{"$f":"School_Listing[[#This Row],[System Code]]&School_Listing[[#This Row],[School Code]]","v":"796160"},"Riverdale Elementary School",{"$f":"School_Listing[[#This Row],[School Code]]","v":160}]
[797,"LAKELAND",{"$f":"School_Listing[[#This Row],[System Code]]","v":797},116,{"$f":"School_Listing[[#This Row],[System Code]]&School_Listing[[#This Row],[School Code]]","v":"797116"},"Lakeland Elementary School",{"$f":"School_Listing[[#This Row],[School Code]]","v":116}]
[797,"LAKELAND",{"$f":"School_Listing[[#This Row],[System Code]]","v":797},120,{"$f":"School_Listing[[#This Row],[System Code]]&School_Listing[[#This Row],[School Code]]","v":"797120"},"Lakeland Preparatory School",{"$f":"School_Listing[[#This Row],[School Code]]","v":120}]
[798,"MILLINGTON MUNICIPAL SCHOOLS",{"$f":"School_Listing[[#This Row],[System Code]]","v":798},130,{"$f":"School_Listing[[#This Row],[System Code]]&School_Listing[[#This Row],[School Code]]","v":"798130"},"Millington Central Middle High School",{"$f":"School_Listing[[#This Row],[School Code]]","v":130}]
[798,"MILLINGTON MUNICIPAL SCHOOLS",{"$f":"School_Listing[[#This Row],[System Code]]","v":798},132,{"$f":"School_Listing[[#This Row],[System Code]]&School_Listing[[#This Row],[School Code]]","v":"798132"},"Millington Intermediate School",{"$f":"School_Listing[[#This Row],[School Code]]","v":132}]
[798,"MILLINGTON MUNICIPAL SCHOOLS",{"$f":"School_Listing[[#This Row],[System Code]]","v":798},123,{"$f":"School_Listing[[#This Row],[System Code]]&School_Listing[[#This Row],[School Code]]","v":"798123"},"Millington Primary School",{"$f":"School_Listing[[#This Row],[School Code]]","v":123}]
[800,"SMITH COUNTY",{"$f":"School_Listing[[#This Row],[System Code]]","v":800},5,{"$f":"School_Listing[[#This Row],[System Code]]&School_Listing[[#This Row],[School Code]]","v":"8005"},"Carthage Elementary",{"$f":"School_Listing[[#This Row],[School Code]]","v":5}]
[800,"SMITH COUNTY",{"$f":"School_Listing[[#This Row],[System Code]]","v":800},15,{"$f":"School_Listing[[#This Row],[System Code]]&School_Listing[[#This Row],[School Code]]","v":"80015"},"Defeated Elementary",{"$f":"School_Listing[[#This Row],[School Code]]","v":15}]
[800,"SMITH COUNTY",{"$f":"School_Listing[[#This Row],[System Code]]","v":800},20,{"$f":"School_Listing[[#This Row],[System Code]]&School_Listing[[#This Row],[School Code]]","v":"80020"},"Forks River Elementary",{"$f":"School_Listing[[#This Row],[School Code]]","v":20}]
[800,"SMITH COUNTY",{"$f":"School_Listing[[#This Row],[System Code]]","v":800},30,{"$f":"School_Listing[[#This Row],[System Code]]&School_Listing[[#This Row],[School Code]]","v":"80030"},"Gordonsville Elementary School",{"$f":"School_Listing[[#This Row],[School Code]]","v":30}]
[800,"SMITH COUNTY",{"$f":"School_Listing[[#This Row],[System Code]]","v":800},25,{"$f":"School_Listing[[#This Row],[System Code]]&School_Listing[[#This Row],[School Code]]","v":"80025"},"Gordonsville High School",{"$f":"School_Listing[[#This Row],[School Code]]","v":25}]
[800,"SMITH COUNTY",{"$f":"School_Listing[[#This Row],[System Code]]","v":800},35,{"$f":"School_Listing[[#This Row],[System Code]]&School_Listing[[#This Row],[School Code]]","v":"80035"},"New Middleton Elementary",{"$f":"School_Listing[[#This Row],[School Code]]","v":35}]
[800,"SMITH COUNTY",{"$f":"School_Listing[[#This Row],[System Code]]","v":800},45,{"$f":"School_Listing[[#This Row],[System Code]]&School_Listing[[#This Row],[School Code]]","v":"80045"},"Smith County High School",{"$f":"School_Listing[[#This Row],[School Code]]","v":45}]
[800,"SMITH COUNTY",{"$f":"School_Listing[[#This Row],[System Code]]","v":800},51,{"$f":"School_Listing[[#This Row],[System Code]]&School_Listing[[#This Row],[School Code]]","v":"80051"},"Smith County Middle School",{"$f":"School_Listing[[#This Row],[School Code]]","v":51}]
[800,"SMITH COUNTY",{"$f":"School_Listing[[#This Row],[System Code]]","v":800},60,{"$f":"School_Listing[[#This Row],[System Code]]&School_Listing[[#This Row],[School Code]]","v":"80060"},"Union Heights Elementary",{"$f":"School_Listing[[#This Row],[School Code]]","v":60}]
[810,"STEWART COUNTY",{"$f":"School_Listing[[#This Row],[System Code]]","v":810},15,{"$f":"School_Listing[[#This Row],[System Code]]&School_Listing[[#This Row],[School Code]]","v":"81015"},"Dover Elementary",{"$f":"School_Listing[[#This Row],[School Code]]","v":15}]
[810,"STEWART COUNTY",{"$f":"School_Listing[[#This Row],[System Code]]","v":810},7001,{"$f":"School_Listing[[#This Row],[System Code]]&School_Listing[[#This Row],[School Code]]","v":"8107001"},"Highland Rim Head Start",{"$f":"School_Listing[[#This Row],[School Code]]","v":7001}]
[810,"STEWART COUNTY",{"$f":"School_Listing[[#This Row],[System Code]]","v":810},17,{"$f":"School_Listing[[#This Row],[System Code]]&School_Listing[[#This Row],[School Code]]","v":"81017"},"North Stewart Elementary",{"$f":"School_Listing[[#This Row],[School Code]]","v":17}]
[810,"STEWART COUNTY",{"$f":"School_Listing[[#This Row],[System Code]]","v":810},25,{"$f":"School_Listing[[#This Row],[System Code]]&School_Listing[[#This Row],[School Code]]","v":"81025"},"Stewart Co High School",{"$f":"School_Listing[[#This Row],[School Code]]","v":25}]
[810,"STEWART COUNTY",{"$f":"School_Listing[[#This Row],[System Code]]","v":810},40,{"$f":"School_Listing[[#This Row],[System Code]]&School_Listing[[#This Row],[School Code]]","v":"81040"},"Stewart County Adult High School",{"$f":"School_Listing[[#This Row],[School Code]]","v":40}]
[810,"STEWART COUNTY",{"$f":"School_Listing[[#This Row],[System Code]]","v":810},10,{"$f":"School_Listing[[#This Row],[System Code]]&School_Listing[[#This Row],[School Code]]","v":"81010"},"Stewart County Middle School",{"$f":"School_Listing[[#This Row],[School Code]]","v":10}]
[820,"SULLIVAN COUNTY",{"$f":"School_Listing[[#This Row],[System Code]]","v":820},35,{"$f":"School_Listing[[#This Row],[System Code]]&School_Listing[[#This Row],[School Code]]","v":"82035"},"Bluff City Elementary",{"$f":"School_Listing[[#This Row],[School Code]]","v":35}]
[820,"SULLIVAN COUNTY",{"$f":"School_Listing[[#This Row],[System Code]]","v":820},55,{"$f":"School_Listing[[#This Row],[System Code]]&School_Listing[[#This Row],[School Code]]","v":"82055"},"Central Heights Elementary",{"$f":"School_Listing[[#This Row],[School Code]]","v":55}]
[820,"SULLIVAN COUNTY",{"$f":"School_Listing[[#This Row],[System Code]]","v":820},85,{"$f":"School_Listing[[#This Row],[System Code]]&School_Listing[[#This Row],[School Code]]","v":"82085"},"Emmett Elementary",{"$f":"School_Listing[[#This Row],[School Code]]","v":85}]
[820,"SULLIVAN COUNTY",{"$f":"School_Listing[[#This Row],[System Code]]","v":820},95,{"$f":"School_Listing[[#This Row],[System Code]]&School_Listing[[#This Row],[School Code]]","v":"82095"},"Holston Elementary",{"$f":"School_Listing[[#This Row],[School Code]]","v":95}]
[820,"SULLIVAN COUNTY",{"$f":"School_Listing[[#This Row],[System Code]]","v":820},115,{"$f":"School_Listing[[#This Row],[System Code]]&School_Listing[[#This Row],[School Code]]","v":"820115"},"Indian Springs Elementary",{"$f":"School_Listing[[#This Row],[School Code]]","v":115}]
[820,"SULLIVAN COUNTY",{"$f":"School_Listing[[#This Row],[System Code]]","v":820},220,{"$f":"School_Listing[[#This Row],[System Code]]&School_Listing[[#This Row],[School Code]]","v":"820220"},"Innovation Academy",{"$f":"School_Listing[[#This Row],[School Code]]","v":220}]
[820,"SULLIVAN COUNTY",{"$f":"School_Listing[[#This Row],[System Code]]","v":820},215,{"$f":"School_Listing[[#This Row],[System Code]]&School_Listing[[#This Row],[School Code]]","v":"820215"},"Ketron Elementary School",{"$f":"School_Listing[[#This Row],[School Code]]","v":215}]
[820,"SULLIVAN COUNTY",{"$f":"School_Listing[[#This Row],[System Code]]","v":820},150,{"$f":"School_Listing[[#This Row],[System Code]]&School_Listing[[#This Row],[School Code]]","v":"820150"},"Mary Hughes School",{"$f":"School_Listing[[#This Row],[School Code]]","v":150}]
[820,"SULLIVAN COUNTY",{"$f":"School_Listing[[#This Row],[System Code]]","v":820},155,{"$f":"School_Listing[[#This Row],[System Code]]&School_Listing[[#This Row],[School Code]]","v":"820155"},"Miller Perry Elementary",{"$f":"School_Listing[[#This Row],[School Code]]","v":155}]
[820,"SULLIVAN COUNTY",{"$f":"School_Listing[[#This Row],[System Code]]","v":820},170,{"$f":"School_Listing[[#This Row],[System Code]]&School_Listing[[#This Row],[School Code]]","v":"820170"},"Rock Springs Elementary",{"$f":"School_Listing[[#This Row],[School Code]]","v":170}]
[820,"SULLIVAN COUNTY",{"$f":"School_Listing[[#This Row],[System Code]]","v":820},64,{"$f":"School_Listing[[#This Row],[System Code]]&School_Listing[[#This Row],[School Code]]","v":"82064"},"Sullivan Central Middle School",{"$f":"School_Listing[[#This Row],[School Code]]","v":64}]
[820,"SULLIVAN COUNTY",{"$f":"School_Listing[[#This Row],[System Code]]","v":820},63,{"$f":"School_Listing[[#This Row],[System Code]]&School_Listing[[#This Row],[School Code]]","v":"82063"},"Sullivan County Virtual Learning Academy",{"$f":"School_Listing[[#This Row],[School Code]]","v":63}]
[820,"SULLIVAN COUNTY",{"$f":"School_Listing[[#This Row],[System Code]]","v":820},80,{"$f":"School_Listing[[#This Row],[System Code]]&School_Listing[[#This Row],[School Code]]","v":"82080"},"Sullivan East High School",{"$f":"School_Listing[[#This Row],[School Code]]","v":80}]
[820,"SULLIVAN COUNTY",{"$f":"School_Listing[[#This Row],[System Code]]","v":820},225,{"$f":"School_Listing[[#This Row],[System Code]]&School_Listing[[#This Row],[School Code]]","v":"820225"},"Sullivan East Middle School",{"$f":"School_Listing[[#This Row],[School Code]]","v":225}]
[820,"SULLIVAN COUNTY",{"$f":"School_Listing[[#This Row],[System Code]]","v":820},175,{"$f":"School_Listing[[#This Row],[System Code]]&School_Listing[[#This Row],[School Code]]","v":"820175"},"Sullivan Gardens Elementary",{"$f":"School_Listing[[#This Row],[School Code]]","v":175}]
[820,"SULLIVAN COUNTY",{"$f":"School_Listing[[#This Row],[System Code]]","v":820},179,{"$f":"School_Listing[[#This Row],[System Code]]&School_Listing[[#This Row],[School Code]]","v":"820179"},"Sullivan Heights Middle School",{"$f":"School_Listing[[#This Row],[School Code]]","v":179}]
[820,"SULLIVAN COUNTY",{"$f":"School_Listing[[#This Row],[System Code]]","v":820},230,{"$f":"School_Listing[[#This Row],[System Code]]&School_Listing[[#This Row],[School Code]]","v":"820230"},"West Ridge High School",{"$f":"School_Listing[[#This Row],[School Code]]","v":230}]
[821,"BRISTOL",{"$f":"School_Listing[[#This Row],[System Code]]","v":821},5,{"$f":"School_Listing[[#This Row],[System Code]]&School_Listing[[#This Row],[School Code]]","v":"8215"},"Anderson Elementary",{"$f":"School_Listing[[#This Row],[School Code]]","v":5}]
[821,"BRISTOL",{"$f":"School_Listing[[#This Row],[System Code]]","v":821},7,{"$f":"School_Listing[[#This Row],[System Code]]&School_Listing[[#This Row],[School Code]]","v":"8217"},"Avoca Elementary",{"$f":"School_Listing[[#This Row],[School Code]]","v":7}]
[821,"BRISTOL",{"$f":"School_Listing[[#This Row],[System Code]]","v":821},35,{"$f":"School_Listing[[#This Row],[System Code]]&School_Listing[[#This Row],[School Code]]","v":"82135"},"Bristol Tennessee Middle School",{"$f":"School_Listing[[#This Row],[School Code]]","v":35}]
[821,"BRISTOL",{"$f":"School_Listing[[#This Row],[System Code]]","v":821},20,{"$f":"School_Listing[[#This Row],[System Code]]&School_Listing[[#This Row],[School Code]]","v":"82120"},"Fairmount Elementary",{"$f":"School_Listing[[#This Row],[School Code]]","v":20}]
[821,"BRISTOL",{"$f":"School_Listing[[#This Row],[System Code]]","v":821},25,{"$f":"School_Listing[[#This Row],[System Code]]&School_Listing[[#This Row],[School Code]]","v":"82125"},"Haynesfield Elementary",{"$f":"School_Listing[[#This Row],[School Code]]","v":25}]
[821,"BRISTOL",{"$f":"School_Listing[[#This Row],[System Code]]","v":821},30,{"$f":"School_Listing[[#This Row],[System Code]]&School_Listing[[#This Row],[School Code]]","v":"82130"},"Holston View Elementary",{"$f":"School_Listing[[#This Row],[School Code]]","v":30}]
[821,"BRISTOL",{"$f":"School_Listing[[#This Row],[System Code]]","v":821},45,{"$f":"School_Listing[[#This Row],[System Code]]&School_Listing[[#This Row],[School Code]]","v":"82145"},"Tennessee High School",{"$f":"School_Listing[[#This Row],[School Code]]","v":45}]
[821,"BRISTOL",{"$f":"School_Listing[[#This Row],[System Code]]","v":821},50,{"$f":"School_Listing[[#This Row],[System Code]]&School_Listing[[#This Row],[School Code]]","v":"82150"},"Tennessee Online Public School",{"$f":"School_Listing[[#This Row],[School Code]]","v":50}]
[821,"BRISTOL",{"$f":"School_Listing[[#This Row],[System Code]]","v":821},49,{"$f":"School_Listing[[#This Row],[System Code]]&School_Listing[[#This Row],[School Code]]","v":"82149"},"Tennessee Online Public School at Bristol",{"$f":"School_Listing[[#This Row],[School Code]]","v":49}]
[822,"KINGSPORT",{"$f":"School_Listing[[#This Row],[System Code]]","v":822},30,{"$f":"School_Listing[[#This Row],[System Code]]&School_Listing[[#This Row],[School Code]]","v":"82230"},"Abraham Lincoln Elementary School",{"$f":"School_Listing[[#This Row],[School Code]]","v":30}]
[822,"KINGSPORT",{"$f":"School_Listing[[#This Row],[System Code]]","v":822},15,{"$f":"School_Listing[[#This Row],[System Code]]&School_Listing[[#This Row],[School Code]]","v":"82215"},"Andrew Jackson Elementary School",{"$f":"School_Listing[[#This Row],[School Code]]","v":15}]
[822,"KINGSPORT",{"$f":"School_Listing[[#This Row],[System Code]]","v":822},25,{"$f":"School_Listing[[#This Row],[System Code]]&School_Listing[[#This Row],[School Code]]","v":"82225"},"Andrew Johnson Elementary School",{"$f":"School_Listing[[#This Row],[School Code]]","v":25}]
[822,"KINGSPORT",{"$f":"School_Listing[[#This Row],[System Code]]","v":822},10,{"$f":"School_Listing[[#This Row],[System Code]]&School_Listing[[#This Row],[School Code]]","v":"82210"},"Dobyns - Bennett High School",{"$f":"School_Listing[[#This Row],[School Code]]","v":10}]
[822,"KINGSPORT",{"$f":"School_Listing[[#This Row],[System Code]]","v":822},50,{"$f":"School_Listing[[#This Row],[System Code]]&School_Listing[[#This Row],[School Code]]","v":"82250"},"George Washington Elementary School",{"$f":"School_Listing[[#This Row],[School Code]]","v":50}]
[822,"KINGSPORT",{"$f":"School_Listing[[#This Row],[System Code]]","v":822},32,{"$f":"School_Listing[[#This Row],[System Code]]&School_Listing[[#This Row],[School Code]]","v":"82232"},"John Adams Elementary School",{"$f":"School_Listing[[#This Row],[School Code]]","v":32}]
[822,"KINGSPORT",{"$f":"School_Listing[[#This Row],[System Code]]","v":822},28,{"$f":"School_Listing[[#This Row],[System Code]]&School_Listing[[#This Row],[School Code]]","v":"82228"},"John F. Kennedy Elementary School",{"$f":"School_Listing[[#This Row],[School Code]]","v":28}]
[822,"KINGSPORT",{"$f":"School_Listing[[#This Row],[System Code]]","v":822},45,{"$f":"School_Listing[[#This Row],[System Code]]&School_Listing[[#This Row],[School Code]]","v":"82245"},"John Sevier Middle School",{"$f":"School_Listing[[#This Row],[School Code]]","v":45}]
[822,"KINGSPORT",{"$f":"School_Listing[[#This Row],[System Code]]","v":822},37,{"$f":"School_Listing[[#This Row],[System Code]]&School_Listing[[#This Row],[School Code]]","v":"82237"},"Palmer Early Learning Center",{"$f":"School_Listing[[#This Row],[School Code]]","v":37}]
[822,"KINGSPORT",{"$f":"School_Listing[[#This Row],[System Code]]","v":822},40,{"$f":"School_Listing[[#This Row],[System Code]]&School_Listing[[#This Row],[School Code]]","v":"82240"},"Ross N. Robinson Middle School",{"$f":"School_Listing[[#This Row],[School Code]]","v":40}]
[822,"KINGSPORT",{"$f":"School_Listing[[#This Row],[System Code]]","v":822},55,{"$f":"School_Listing[[#This Row],[System Code]]&School_Listing[[#This Row],[School Code]]","v":"82255"},"Theodore Roosevelt Elementary School",{"$f":"School_Listing[[#This Row],[School Code]]","v":55}]
[822,"KINGSPORT",{"$f":"School_Listing[[#This Row],[System Code]]","v":822},20,{"$f":"School_Listing[[#This Row],[System Code]]&School_Listing[[#This Row],[School Code]]","v":"82220"},"Thomas Jefferson Elementary School",{"$f":"School_Listing[[#This Row],[School Code]]","v":20}]
[830,"SUMNER COUNTY",{"$f":"School_Listing[[#This Row],[System Code]]","v":830},5,{"$f":"School_Listing[[#This Row],[System Code]]&School_Listing[[#This Row],[School Code]]","v":"8305"},"Beech Elementary",{"$f":"School_Listing[[#This Row],[School Code]]","v":5}]
[830,"SUMNER COUNTY",{"$f":"School_Listing[[#This Row],[System Code]]","v":830},7,{"$f":"School_Listing[[#This Row],[System Code]]&School_Listing[[#This Row],[School Code]]","v":"8307"},"Beech Sr High School",{"$f":"School_Listing[[#This Row],[School Code]]","v":7}]
[830,"SUMNER COUNTY",{"$f":"School_Listing[[#This Row],[System Code]]","v":830},104,{"$f":"School_Listing[[#This Row],[System Code]]&School_Listing[[#This Row],[School Code]]","v":"830104"},"Benny C. Bills Elementary School",{"$f":"School_Listing[[#This Row],[School Code]]","v":104}]
[830,"SUMNER COUNTY",{"$f":"School_Listing[[#This Row],[System Code]]","v":830},10,{"$f":"School_Listing[[#This Row],[System Code]]&School_Listing[[#This Row],[School Code]]","v":"83010"},"Bethpage Elementary",{"$f":"School_Listing[[#This Row],[School Code]]","v":10}]
[830,"SUMNER COUNTY",{"$f":"School_Listing[[#This Row],[System Code]]","v":830},95,{"$f":"School_Listing[[#This Row],[System Code]]&School_Listing[[#This Row],[School Code]]","v":"83095"},"Clyde Riggs Elementary",{"$f":"School_Listing[[#This Row],[School Code]]","v":95}]
[830,"SUMNER COUNTY",{"$f":"School_Listing[[#This Row],[System Code]]","v":830},160,{"$f":"School_Listing[[#This Row],[System Code]]&School_Listing[[#This Row],[School Code]]","v":"830160"},"Dr. William Burrus Elementary at Drakes Creek",{"$f":"School_Listing[[#This Row],[School Code]]","v":160}]
[830,"SUMNER COUNTY",{"$f":"School_Listing[[#This Row],[System Code]]","v":830},93,{"$f":"School_Listing[[#This Row],[System Code]]&School_Listing[[#This Row],[School Code]]","v":"83093"},"E B Wilson",{"$f":"School_Listing[[#This Row],[School Code]]","v":93}]
[830,"SUMNER COUNTY",{"$f":"School_Listing[[#This Row],[System Code]]","v":830},25,{"$f":"School_Listing[[#This Row],[System Code]]&School_Listing[[#This Row],[School Code]]","v":"83025"},"Gallatin Senior High School",{"$f":"School_Listing[[#This Row],[School Code]]","v":25}]
[830,"SUMNER COUNTY",{"$f":"School_Listing[[#This Row],[System Code]]","v":830},35,{"$f":"School_Listing[[#This Row],[System Code]]&School_Listing[[#This Row],[School Code]]","v":"83035"},"Gene W. Brown Elementary",{"$f":"School_Listing[[#This Row],[School Code]]","v":35}]
[830,"SUMNER COUNTY",{"$f":"School_Listing[[#This Row],[System Code]]","v":830},113,{"$f":"School_Listing[[#This Row],[System Code]]&School_Listing[[#This Row],[School Code]]","v":"830113"},"George A Whitten Elementary",{"$f":"School_Listing[[#This Row],[School Code]]","v":113}]
[830,"SUMNER COUNTY",{"$f":"School_Listing[[#This Row],[System Code]]","v":830},30,{"$f":"School_Listing[[#This Row],[System Code]]&School_Listing[[#This Row],[School Code]]","v":"83030"},"Guild Elementary",{"$f":"School_Listing[[#This Row],[School Code]]","v":30}]
[830,"SUMNER COUNTY",{"$f":"School_Listing[[#This Row],[System Code]]","v":830},150,{"$f":"School_Listing[[#This Row],[System Code]]&School_Listing[[#This Row],[School Code]]","v":"830150"},"Harold B. Williams Elementary School",{"$f":"School_Listing[[#This Row],[School Code]]","v":150}]
[830,"SUMNER COUNTY",{"$f":"School_Listing[[#This Row],[System Code]]","v":830},40,{"$f":"School_Listing[[#This Row],[System Code]]&School_Listing[[#This Row],[School Code]]","v":"83040"},"Hendersonville High School",{"$f":"School_Listing[[#This Row],[School Code]]","v":40}]
[830,"SUMNER COUNTY",{"$f":"School_Listing[[#This Row],[System Code]]","v":830},50,{"$f":"School_Listing[[#This Row],[System Code]]&School_Listing[[#This Row],[School Code]]","v":"83050"},"Howard Elementary",{"$f":"School_Listing[[#This Row],[School Code]]","v":50}]
[830,"SUMNER COUNTY",{"$f":"School_Listing[[#This Row],[System Code]]","v":830},52,{"$f":"School_Listing[[#This Row],[System Code]]&School_Listing[[#This Row],[School Code]]","v":"83052"},"Indian Lake Elementary",{"$f":"School_Listing[[#This Row],[School Code]]","v":52}]
[830,"SUMNER COUNTY",{"$f":"School_Listing[[#This Row],[System Code]]","v":830},54,{"$f":"School_Listing[[#This Row],[System Code]]&School_Listing[[#This Row],[School Code]]","v":"83054"},"J W Wiseman Elementary",{"$f":"School_Listing[[#This Row],[School Code]]","v":54}]
[830,"SUMNER COUNTY",{"$f":"School_Listing[[#This Row],[System Code]]","v":830},3,{"$f":"School_Listing[[#This Row],[System Code]]&School_Listing[[#This Row],[School Code]]","v":"8303"},"Jack Anderson Elementary",{"$f":"School_Listing[[#This Row],[School Code]]","v":3}]
[830,"SUMNER COUNTY",{"$f":"School_Listing[[#This Row],[System Code]]","v":830},97,{"$f":"School_Listing[[#This Row],[System Code]]&School_Listing[[#This Row],[School Code]]","v":"83097"},"Joe Shafer Middle School",{"$f":"School_Listing[[#This Row],[School Code]]","v":97}]
[830,"SUMNER COUNTY",{"$f":"School_Listing[[#This Row],[System Code]]","v":830},135,{"$f":"School_Listing[[#This Row],[System Code]]&School_Listing[[#This Row],[School Code]]","v":"830135"},"Knox Doss Middle School at Drakes Creek",{"$f":"School_Listing[[#This Row],[School Code]]","v":135}]
[830,"SUMNER COUNTY",{"$f":"School_Listing[[#This Row],[System Code]]","v":830},55,{"$f":"School_Listing[[#This Row],[System Code]]&School_Listing[[#This Row],[School Code]]","v":"83055"},"Lakeside Park Elementary",{"$f":"School_Listing[[#This Row],[School Code]]","v":55}]
[830,"SUMNER COUNTY",{"$f":"School_Listing[[#This Row],[System Code]]","v":830},58,{"$f":"School_Listing[[#This Row],[System Code]]&School_Listing[[#This Row],[School Code]]","v":"83058"},"Liberty Creek Elementary",{"$f":"School_Listing[[#This Row],[School Code]]","v":58}]
[830,"SUMNER COUNTY",{"$f":"School_Listing[[#This Row],[System Code]]","v":830},61,{"$f":"School_Listing[[#This Row],[System Code]]&School_Listing[[#This Row],[School Code]]","v":"83061"},"Liberty Creek High School",{"$f":"School_Listing[[#This Row],[School Code]]","v":61}]
[830,"SUMNER COUNTY",{"$f":"School_Listing[[#This Row],[System Code]]","v":830},59,{"$f":"School_Listing[[#This Row],[System Code]]&School_Listing[[#This Row],[School Code]]","v":"83059"},"Liberty Creek Middle School",{"$f":"School_Listing[[#This Row],[School Code]]","v":59}]
[830,"SUMNER COUNTY",{"$f":"School_Listing[[#This Row],[System Code]]","v":830},57,{"$f":"School_Listing[[#This Row],[System Code]]&School_Listing[[#This Row],[School Code]]","v":"83057"},"Madison Creek Elementary",{"$f":"School_Listing[[#This Row],[School Code]]","v":57}]
[830,"SUMNER COUNTY",{"$f":"School_Listing[[#This Row],[System Code]]","v":830},53,{"$f":"School_Listing[[#This Row],[System Code]]&School_Listing[[#This Row],[School Code]]","v":"83053"},"Merrol Hyde Magnet School",{"$f":"School_Listing[[#This Row],[School Code]]","v":53}]
[830,"SUMNER COUNTY",{"$f":"School_Listing[[#This Row],[System Code]]","v":830},60,{"$f":"School_Listing[[#This Row],[System Code]]&School_Listing[[#This Row],[School Code]]","v":"83060"},"Millersville Elementary",{"$f":"School_Listing[[#This Row],[School Code]]","v":60}]
[830,"SUMNER COUNTY",{"$f":"School_Listing[[#This Row],[System Code]]","v":830},65,{"$f":"School_Listing[[#This Row],[System Code]]&School_Listing[[#This Row],[School Code]]","v":"83065"},"Nannie Berry Elementary",{"$f":"School_Listing[[#This Row],[School Code]]","v":65}]
[830,"SUMNER COUNTY",{"$f":"School_Listing[[#This Row],[System Code]]","v":830},75,{"$f":"School_Listing[[#This Row],[System Code]]&School_Listing[[#This Row],[School Code]]","v":"83075"},"North Sumner Elementary",{"$f":"School_Listing[[#This Row],[School Code]]","v":75}]
[830,"SUMNER COUNTY",{"$f":"School_Listing[[#This Row],[System Code]]","v":830},80,{"$f":"School_Listing[[#This Row],[System Code]]&School_Listing[[#This Row],[School Code]]","v":"83080"},"Oakmont Elementary",{"$f":"School_Listing[[#This Row],[School Code]]","v":80}]
[830,"SUMNER COUNTY",{"$f":"School_Listing[[#This Row],[System Code]]","v":830},90,{"$f":"School_Listing[[#This Row],[System Code]]&School_Listing[[#This Row],[School Code]]","v":"83090"},"Portland East Middle School",{"$f":"School_Listing[[#This Row],[School Code]]","v":90}]
[830,"SUMNER COUNTY",{"$f":"School_Listing[[#This Row],[System Code]]","v":830},152,{"$f":"School_Listing[[#This Row],[System Code]]&School_Listing[[#This Row],[School Code]]","v":"830152"},"Portland Gateview Elementary School",{"$f":"School_Listing[[#This Row],[School Code]]","v":152}]
[830,"SUMNER COUNTY",{"$f":"School_Listing[[#This Row],[System Code]]","v":830},85,{"$f":"School_Listing[[#This Row],[System Code]]&School_Listing[[#This Row],[School Code]]","v":"83085"},"Portland High School",{"$f":"School_Listing[[#This Row],[School Code]]","v":85}]
[830,"SUMNER COUNTY",{"$f":"School_Listing[[#This Row],[System Code]]","v":830},140,{"$f":"School_Listing[[#This Row],[System Code]]&School_Listing[[#This Row],[School Code]]","v":"830140"},"Portland West Middle School",{"$f":"School_Listing[[#This Row],[School Code]]","v":140}]
[830,"SUMNER COUNTY",{"$f":"School_Listing[[#This Row],[System Code]]","v":830},110,{"$f":"School_Listing[[#This Row],[System Code]]&School_Listing[[#This Row],[School Code]]","v":"830110"},"R T Fisher Alternative",{"$f":"School_Listing[[#This Row],[School Code]]","v":110}]
[830,"SUMNER COUNTY",{"$f":"School_Listing[[#This Row],[System Code]]","v":830},15,{"$f":"School_Listing[[#This Row],[System Code]]&School_Listing[[#This Row],[School Code]]","v":"83015"},"Robert E Ellis Middle",{"$f":"School_Listing[[#This Row],[School Code]]","v":15}]
[830,"SUMNER COUNTY",{"$f":"School_Listing[[#This Row],[System Code]]","v":830},100,{"$f":"School_Listing[[#This Row],[System Code]]&School_Listing[[#This Row],[School Code]]","v":"830100"},"Rucker Stewart Middle",{"$f":"School_Listing[[#This Row],[School Code]]","v":100}]
[830,"SUMNER COUNTY",{"$f":"School_Listing[[#This Row],[System Code]]","v":830},101,{"$f":"School_Listing[[#This Row],[System Code]]&School_Listing[[#This Row],[School Code]]","v":"830101"},"Station Camp Elementary",{"$f":"School_Listing[[#This Row],[School Code]]","v":101}]
[830,"SUMNER COUNTY",{"$f":"School_Listing[[#This Row],[System Code]]","v":830},102,{"$f":"School_Listing[[#This Row],[System Code]]&School_Listing[[#This Row],[School Code]]","v":"830102"},"Station Camp High School",{"$f":"School_Listing[[#This Row],[School Code]]","v":102}]
[830,"SUMNER COUNTY",{"$f":"School_Listing[[#This Row],[System Code]]","v":830},56,{"$f":"School_Listing[[#This Row],[System Code]]&School_Listing[[#This Row],[School Code]]","v":"83056"},"Station Camp Middle School",{"$f":"School_Listing[[#This Row],[School Code]]","v":56}]
[830,"SUMNER COUNTY",{"$f":"School_Listing[[#This Row],[System Code]]","v":830},155,{"$f":"School_Listing[[#This Row],[System Code]]&School_Listing[[#This Row],[School Code]]","v":"830155"},"Sumner County Middle College High School",{"$f":"School_Listing[[#This Row],[School Code]]","v":155}]
[830,"SUMNER COUNTY",{"$f":"School_Listing[[#This Row],[System Code]]","v":830},1010,{"$f":"School_Listing[[#This Row],[System Code]]&School_Listing[[#This Row],[School Code]]","v":"8301010"},"Sumner County Middle Technical College High School at Portland",{"$f":"School_Listing[[#This Row],[School Code]]","v":1010}]
[830,"SUMNER COUNTY",{"$f":"School_Listing[[#This Row],[System Code]]","v":830},51,{"$f":"School_Listing[[#This Row],[System Code]]&School_Listing[[#This Row],[School Code]]","v":"83051"},"T. W. Hunter Middle School",{"$f":"School_Listing[[#This Row],[School Code]]","v":51}]
[830,"SUMNER COUNTY",{"$f":"School_Listing[[#This Row],[System Code]]","v":830},105,{"$f":"School_Listing[[#This Row],[System Code]]&School_Listing[[#This Row],[School Code]]","v":"830105"},"Union Elementary School",{"$f":"School_Listing[[#This Row],[School Code]]","v":105}]
[830,"SUMNER COUNTY",{"$f":"School_Listing[[#This Row],[System Code]]","v":830},107,{"$f":"School_Listing[[#This Row],[System Code]]&School_Listing[[#This Row],[School Code]]","v":"830107"},"V G Hawkins Middle School",{"$f":"School_Listing[[#This Row],[School Code]]","v":107}]
[830,"SUMNER COUNTY",{"$f":"School_Listing[[#This Row],[System Code]]","v":830},109,{"$f":"School_Listing[[#This Row],[System Code]]&School_Listing[[#This Row],[School Code]]","v":"830109"},"Vena Stuart Elementary",{"$f":"School_Listing[[#This Row],[School Code]]","v":109}]
[830,"SUMNER COUNTY",{"$f":"School_Listing[[#This Row],[System Code]]","v":830},112,{"$f":"School_Listing[[#This Row],[System Code]]&School_Listing[[#This Row],[School Code]]","v":"830112"},"Walton Ferry Elementary",{"$f":"School_Listing[[#This Row],[School Code]]","v":112}]
[830,"SUMNER COUNTY",{"$f":"School_Listing[[#This Row],[System Code]]","v":830},70,{"$f":"School_Listing[[#This Row],[System Code]]&School_Listing[[#This Row],[School Code]]","v":"83070"},"Watt Hardison Elementary",{"$f":"School_Listing[[#This Row],[School Code]]","v":70}]
[830,"SUMNER COUNTY",{"$f":"School_Listing[[#This Row],[System Code]]","v":830},115,{"$f":"School_Listing[[#This Row],[System Code]]&School_Listing[[#This Row],[School Code]]","v":"830115"},"Westmoreland Elementary",{"$f":"School_Listing[[#This Row],[School Code]]","v":115}]
[830,"SUMNER COUNTY",{"$f":"School_Listing[[#This Row],[System Code]]","v":830},120,{"$f":"School_Listing[[#This Row],[System Code]]&School_Listing[[#This Row],[School Code]]","v":"830120"},"Westmoreland High School",{"$f":"School_Listing[[#This Row],[School Code]]","v":120}]
[830,"SUMNER COUNTY",{"$f":"School_Listing[[#This Row],[System Code]]","v":830},117,{"$f":"School_Listing[[#This Row],[System Code]]&School_Listing[[#This Row],[School Code]]","v":"830117"},"Westmoreland Middle School",{"$f":"School_Listing[[#This Row],[School Code]]","v":117}]
[830,"SUMNER COUNTY",{"$f":"School_Listing[[#This Row],[System Code]]","v":830},125,{"$f":"School_Listing[[#This Row],[System Code]]&School_Listing[[#This Row],[School Code]]","v":"830125"},"White House High School",{"$f":"School_Listing[[#This Row],[School Code]]","v":125}]
[830,"SUMNER COUNTY",{"$f":"School_Listing[[#This Row],[System Code]]","v":830},130,{"$f":"School_Listing[[#This Row],[System Code]]&School_Listing[[#This Row],[School Code]]","v":"830130"},"White House Middle School",{"$f":"School_Listing[[#This Row],[School Code]]","v":130}]
[840,"TIPTON COUNTY",{"$f":"School_Listing[[#This Row],[System Code]]","v":840},4,{"$f":"School_Listing[[#This Row],[System Code]]&School_Listing[[#This Row],[School Code]]","v":"8404"},"Atoka Elementary School",{"$f":"School_Listing[[#This Row],[School Code]]","v":4}]
[840,"TIPTON COUNTY",{"$f":"School_Listing[[#This Row],[System Code]]","v":840},2,{"$f":"School_Listing[[#This Row],[System Code]]&School_Listing[[#This Row],[School Code]]","v":"8402"},"Austin Peay Elementary School",{"$f":"School_Listing[[#This Row],[School Code]]","v":2}]
[840,"TIPTON COUNTY",{"$f":"School_Listing[[#This Row],[System Code]]","v":840},7,{"$f":"School_Listing[[#This Row],[System Code]]&School_Listing[[#This Row],[School Code]]","v":"8407"},"Brighton Elementary",{"$f":"School_Listing[[#This Row],[School Code]]","v":7}]
[840,"TIPTON COUNTY",{"$f":"School_Listing[[#This Row],[System Code]]","v":840},11,{"$f":"School_Listing[[#This Row],[System Code]]&School_Listing[[#This Row],[School Code]]","v":"84011"},"Brighton High School",{"$f":"School_Listing[[#This Row],[School Code]]","v":11}]
[840,"TIPTON COUNTY",{"$f":"School_Listing[[#This Row],[System Code]]","v":840},12,{"$f":"School_Listing[[#This Row],[System Code]]&School_Listing[[#This Row],[School Code]]","v":"84012"},"Brighton Middle School",{"$f":"School_Listing[[#This Row],[School Code]]","v":12}]
[840,"TIPTON COUNTY",{"$f":"School_Listing[[#This Row],[System Code]]","v":840},14,{"$f":"School_Listing[[#This Row],[System Code]]&School_Listing[[#This Row],[School Code]]","v":"84014"},"Charger Academy",{"$f":"School_Listing[[#This Row],[School Code]]","v":14}]
[840,"TIPTON COUNTY",{"$f":"School_Listing[[#This Row],[System Code]]","v":840},15,{"$f":"School_Listing[[#This Row],[System Code]]&School_Listing[[#This Row],[School Code]]","v":"84015"},"Covington High School",{"$f":"School_Listing[[#This Row],[School Code]]","v":15}]
[840,"TIPTON COUNTY",{"$f":"School_Listing[[#This Row],[System Code]]","v":840},17,{"$f":"School_Listing[[#This Row],[System Code]]&School_Listing[[#This Row],[School Code]]","v":"84017"},"Crestview Elementary",{"$f":"School_Listing[[#This Row],[School Code]]","v":17}]
[840,"TIPTON COUNTY",{"$f":"School_Listing[[#This Row],[System Code]]","v":840},13,{"$f":"School_Listing[[#This Row],[System Code]]&School_Listing[[#This Row],[School Code]]","v":"84013"},"Crestview Middle School",{"$f":"School_Listing[[#This Row],[School Code]]","v":13}]
[840,"TIPTON COUNTY",{"$f":"School_Listing[[#This Row],[System Code]]","v":840},20,{"$f":"School_Listing[[#This Row],[System Code]]&School_Listing[[#This Row],[School Code]]","v":"84020"},"Drummonds Elementary",{"$f":"School_Listing[[#This Row],[School Code]]","v":20}]
[840,"TIPTON COUNTY",{"$f":"School_Listing[[#This Row],[System Code]]","v":840},45,{"$f":"School_Listing[[#This Row],[System Code]]&School_Listing[[#This Row],[School Code]]","v":"84045"},"Munford Elementary",{"$f":"School_Listing[[#This Row],[School Code]]","v":45}]
[840,"TIPTON COUNTY",{"$f":"School_Listing[[#This Row],[System Code]]","v":840},50,{"$f":"School_Listing[[#This Row],[System Code]]&School_Listing[[#This Row],[School Code]]","v":"84050"},"Munford High School",{"$f":"School_Listing[[#This Row],[School Code]]","v":50}]
[840,"TIPTON COUNTY",{"$f":"School_Listing[[#This Row],[System Code]]","v":840},48,{"$f":"School_Listing[[#This Row],[System Code]]&School_Listing[[#This Row],[School Code]]","v":"84048"},"Munford Middle School",{"$f":"School_Listing[[#This Row],[School Code]]","v":48}]
[840,"TIPTON COUNTY",{"$f":"School_Listing[[#This Row],[System Code]]","v":840},60,{"$f":"School_Listing[[#This Row],[System Code]]&School_Listing[[#This Row],[School Code]]","v":"84060"},"Tipton County Alternative Learning Center",{"$f":"School_Listing[[#This Row],[School Code]]","v":60}]
[850,"TROUSDALE COUNTY",{"$f":"School_Listing[[#This Row],[System Code]]","v":850},15,{"$f":"School_Listing[[#This Row],[System Code]]&School_Listing[[#This Row],[School Code]]","v":"85015"},"Jim Satterfield Middle School",{"$f":"School_Listing[[#This Row],[School Code]]","v":15}]
[850,"TROUSDALE COUNTY",{"$f":"School_Listing[[#This Row],[System Code]]","v":850},5,{"$f":"School_Listing[[#This Row],[System Code]]&School_Listing[[#This Row],[School Code]]","v":"8505"},"Trousdale Co Elementary",{"$f":"School_Listing[[#This Row],[School Code]]","v":5}]
[850,"TROUSDALE COUNTY",{"$f":"School_Listing[[#This Row],[System Code]]","v":850},10,{"$f":"School_Listing[[#This Row],[System Code]]&School_Listing[[#This Row],[School Code]]","v":"85010"},"Trousdale Co High School",{"$f":"School_Listing[[#This Row],[School Code]]","v":10}]
[860,"UNICOI COUNTY",{"$f":"School_Listing[[#This Row],[System Code]]","v":860},15,{"$f":"School_Listing[[#This Row],[System Code]]&School_Listing[[#This Row],[School Code]]","v":"86015"},"Love Chapel Elementary",{"$f":"School_Listing[[#This Row],[School Code]]","v":15}]
[860,"UNICOI COUNTY",{"$f":"School_Listing[[#This Row],[System Code]]","v":860},25,{"$f":"School_Listing[[#This Row],[System Code]]&School_Listing[[#This Row],[School Code]]","v":"86025"},"Rock Creek Elementary",{"$f":"School_Listing[[#This Row],[School Code]]","v":25}]
[860,"UNICOI COUNTY",{"$f":"School_Listing[[#This Row],[System Code]]","v":860},30,{"$f":"School_Listing[[#This Row],[System Code]]&School_Listing[[#This Row],[School Code]]","v":"86030"},"Temple Hill Elementary",{"$f":"School_Listing[[#This Row],[School Code]]","v":30}]
[860,"UNICOI COUNTY",{"$f":"School_Listing[[#This Row],[System Code]]","v":860},35,{"$f":"School_Listing[[#This Row],[System Code]]&School_Listing[[#This Row],[School Code]]","v":"86035"},"Unicoi Co High School",{"$f":"School_Listing[[#This Row],[School Code]]","v":35}]
[860,"UNICOI COUNTY",{"$f":"School_Listing[[#This Row],[System Code]]","v":860},5,{"$f":"School_Listing[[#This Row],[System Code]]&School_Listing[[#This Row],[School Code]]","v":"8605"},"Unicoi Co Middle School",{"$f":"School_Listing[[#This Row],[School Code]]","v":5}]
[860,"UNICOI COUNTY",{"$f":"School_Listing[[#This Row],[System Code]]","v":860},7001,{"$f":"School_Listing[[#This Row],[System Code]]&School_Listing[[#This Row],[School Code]]","v":"8607001"},"Unicoi Community Learning Center",{"$f":"School_Listing[[#This Row],[School Code]]","v":7001}]
[860,"UNICOI COUNTY",{"$f":"School_Listing[[#This Row],[System Code]]","v":860},40,{"$f":"School_Listing[[#This Row],[System Code]]&School_Listing[[#This Row],[School Code]]","v":"86040"},"Unicoi Elementary",{"$f":"School_Listing[[#This Row],[School Code]]","v":40}]
[870,"UNION COUNTY",{"$f":"School_Listing[[#This Row],[System Code]]","v":870},5,{"$f":"School_Listing[[#This Row],[System Code]]&School_Listing[[#This Row],[School Code]]","v":"8705"},"Big Ridge Elementary",{"$f":"School_Listing[[#This Row],[School Code]]","v":5}]
[870,"UNION COUNTY",{"$f":"School_Listing[[#This Row],[System Code]]","v":870},65,{"$f":"School_Listing[[#This Row],[System Code]]&School_Listing[[#This Row],[School Code]]","v":"87065"},"Elementary Middle Alternative",{"$f":"School_Listing[[#This Row],[School Code]]","v":65}]
[870,"UNION COUNTY",{"$f":"School_Listing[[#This Row],[System Code]]","v":870},25,{"$f":"School_Listing[[#This Row],[System Code]]&School_Listing[[#This Row],[School Code]]","v":"87025"},"H Maynard Middle School",{"$f":"School_Listing[[#This Row],[School Code]]","v":25}]
[870,"UNION COUNTY",{"$f":"School_Listing[[#This Row],[System Code]]","v":870},35,{"$f":"School_Listing[[#This Row],[System Code]]&School_Listing[[#This Row],[School Code]]","v":"87035"},"Luttrell Elementary",{"$f":"School_Listing[[#This Row],[School Code]]","v":35}]
[870,"UNION COUNTY",{"$f":"School_Listing[[#This Row],[System Code]]","v":870},40,{"$f":"School_Listing[[#This Row],[System Code]]&School_Listing[[#This Row],[School Code]]","v":"87040"},"Maynardville Elementary",{"$f":"School_Listing[[#This Row],[School Code]]","v":40}]
[870,"UNION COUNTY",{"$f":"School_Listing[[#This Row],[System Code]]","v":870},57,{"$f":"School_Listing[[#This Row],[System Code]]&School_Listing[[#This Row],[School Code]]","v":"87057"},"Paulette Elementary School",{"$f":"School_Listing[[#This Row],[School Code]]","v":57}]
[870,"UNION COUNTY",{"$f":"School_Listing[[#This Row],[System Code]]","v":870},45,{"$f":"School_Listing[[#This Row],[System Code]]&School_Listing[[#This Row],[School Code]]","v":"87045"},"Sharps Chapel Elementary",{"$f":"School_Listing[[#This Row],[School Code]]","v":45}]
[870,"UNION COUNTY",{"$f":"School_Listing[[#This Row],[System Code]]","v":870},60,{"$f":"School_Listing[[#This Row],[System Code]]&School_Listing[[#This Row],[School Code]]","v":"87060"},"Tennessee Virtual Academy",{"$f":"School_Listing[[#This Row],[School Code]]","v":60}]
[870,"UNION COUNTY",{"$f":"School_Listing[[#This Row],[System Code]]","v":870},53,{"$f":"School_Listing[[#This Row],[System Code]]&School_Listing[[#This Row],[School Code]]","v":"87053"},"Union County Alternative Center",{"$f":"School_Listing[[#This Row],[School Code]]","v":53}]
[870,"UNION COUNTY",{"$f":"School_Listing[[#This Row],[System Code]]","v":870},55,{"$f":"School_Listing[[#This Row],[System Code]]&School_Listing[[#This Row],[School Code]]","v":"87055"},"Union County High School",{"$f":"School_Listing[[#This Row],[School Code]]","v":55}]
[880,"VAN BUREN COUNTY",{"$f":"School_Listing[[#This Row],[System Code]]","v":880},30,{"$f":"School_Listing[[#This Row],[System Code]]&School_Listing[[#This Row],[School Code]]","v":"88030"},"Spencer Elementary",{"$f":"School_Listing[[#This Row],[School Code]]","v":30}]
[880,"VAN BUREN COUNTY",{"$f":"School_Listing[[#This Row],[System Code]]","v":880},35,{"$f":"School_Listing[[#This Row],[System Code]]&School_Listing[[#This Row],[School Code]]","v":"88035"},"Van Buren Co High School",{"$f":"School_Listing[[#This Row],[School Code]]","v":35}]
[890,"WARREN COUNTY",{"$f":"School_Listing[[#This Row],[System Code]]","v":890},63,{"$f":"School_Listing[[#This Row],[System Code]]&School_Listing[[#This Row],[School Code]]","v":"89063"},"Bobby Ray Memorial",{"$f":"School_Listing[[#This Row],[School Code]]","v":63}]
[890,"WARREN COUNTY",{"$f":"School_Listing[[#This Row],[System Code]]","v":890},10,{"$f":"School_Listing[[#This Row],[System Code]]&School_Listing[[#This Row],[School Code]]","v":"89010"},"Centertown Elementary",{"$f":"School_Listing[[#This Row],[School Code]]","v":10}]
[890,"WARREN COUNTY",{"$f":"School_Listing[[#This Row],[System Code]]","v":890},20,{"$f":"School_Listing[[#This Row],[System Code]]&School_Listing[[#This Row],[School Code]]","v":"89020"},"Dibrell Elementary",{"$f":"School_Listing[[#This Row],[School Code]]","v":20}]
[890,"WARREN COUNTY",{"$f":"School_Listing[[#This Row],[System Code]]","v":890},30,{"$f":"School_Listing[[#This Row],[System Code]]&School_Listing[[#This Row],[School Code]]","v":"89030"},"Eastside Elementary",{"$f":"School_Listing[[#This Row],[School Code]]","v":30}]
[890,"WARREN COUNTY",{"$f":"School_Listing[[#This Row],[System Code]]","v":890},38,{"$f":"School_Listing[[#This Row],[System Code]]&School_Listing[[#This Row],[School Code]]","v":"89038"},"Hickory Creek School",{"$f":"School_Listing[[#This Row],[School Code]]","v":38}]
[890,"WARREN COUNTY",{"$f":"School_Listing[[#This Row],[System Code]]","v":890},40,{"$f":"School_Listing[[#This Row],[System Code]]&School_Listing[[#This Row],[School Code]]","v":"89040"},"Irving College Elementary",{"$f":"School_Listing[[#This Row],[School Code]]","v":40}]
[890,"WARREN COUNTY",{"$f":"School_Listing[[#This Row],[System Code]]","v":890},50,{"$f":"School_Listing[[#This Row],[System Code]]&School_Listing[[#This Row],[School Code]]","v":"89050"},"Morrison Elementary",{"$f":"School_Listing[[#This Row],[School Code]]","v":50}]
[890,"WARREN COUNTY",{"$f":"School_Listing[[#This Row],[System Code]]","v":890},47,{"$f":"School_Listing[[#This Row],[System Code]]&School_Listing[[#This Row],[School Code]]","v":"89047"},"Warren Connect",{"$f":"School_Listing[[#This Row],[School Code]]","v":47}]
[890,"WARREN COUNTY",{"$f":"School_Listing[[#This Row],[System Code]]","v":890},72,{"$f":"School_Listing[[#This Row],[System Code]]&School_Listing[[#This Row],[School Code]]","v":"89072"},"Warren County Alternative Academy",{"$f":"School_Listing[[#This Row],[School Code]]","v":72}]
[890,"WARREN COUNTY",{"$f":"School_Listing[[#This Row],[System Code]]","v":890},80,{"$f":"School_Listing[[#This Row],[System Code]]&School_Listing[[#This Row],[School Code]]","v":"89080"},"Warren County High School",{"$f":"School_Listing[[#This Row],[School Code]]","v":80}]
[890,"WARREN COUNTY",{"$f":"School_Listing[[#This Row],[System Code]]","v":890},75,{"$f":"School_Listing[[#This Row],[System Code]]&School_Listing[[#This Row],[School Code]]","v":"89075"},"Warren County Middle School",{"$f":"School_Listing[[#This Row],[School Code]]","v":75}]
[890,"WARREN COUNTY",{"$f":"School_Listing[[#This Row],[System Code]]","v":890},85,{"$f":"School_Listing[[#This Row],[System Code]]&School_Listing[[#This Row],[School Code]]","v":"89085"},"West Elementary",{"$f":"School_Listing[[#This Row],[School Code]]","v":85}]
[900,"WASHINGTON COUNTY",{"$f":"School_Listing[[#This Row],[System Code]]","v":900},20,{"$f":"School_Listing[[#This Row],[System Code]]&School_Listing[[#This Row],[School Code]]","v":"90020"},"Boones Creek Elementary School",{"$f":"School_Listing[[#This Row],[School Code]]","v":20}]
[900,"WASHINGTON COUNTY",{"$f":"School_Listing[[#This Row],[System Code]]","v":900},37,{"$f":"School_Listing[[#This Row],[System Code]]&School_Listing[[#This Row],[School Code]]","v":"90037"},"Daniel Boone High School",{"$f":"School_Listing[[#This Row],[School Code]]","v":37}]
[900,"WASHINGTON COUNTY",{"$f":"School_Listing[[#This Row],[System Code]]","v":900},38,{"$f":"School_Listing[[#This Row],[System Code]]&School_Listing[[#This Row],[School Code]]","v":"90038"},"David Crockett High School",{"$f":"School_Listing[[#This Row],[School Code]]","v":38}]
[900,"WASHINGTON COUNTY",{"$f":"School_Listing[[#This Row],[System Code]]","v":900},45,{"$f":"School_Listing[[#This Row],[System Code]]&School_Listing[[#This Row],[School Code]]","v":"90045"},"Fall Branch Elementary",{"$f":"School_Listing[[#This Row],[School Code]]","v":45}]
[900,"WASHINGTON COUNTY",{"$f":"School_Listing[[#This Row],[System Code]]","v":900},50,{"$f":"School_Listing[[#This Row],[System Code]]&School_Listing[[#This Row],[School Code]]","v":"90050"},"Grandview Elementary School",{"$f":"School_Listing[[#This Row],[School Code]]","v":50}]
[900,"WASHINGTON COUNTY",{"$f":"School_Listing[[#This Row],[System Code]]","v":900},55,{"$f":"School_Listing[[#This Row],[System Code]]&School_Listing[[#This Row],[School Code]]","v":"90055"},"Gray Elementary School",{"$f":"School_Listing[[#This Row],[School Code]]","v":55}]
[900,"WASHINGTON COUNTY",{"$f":"School_Listing[[#This Row],[System Code]]","v":900},60,{"$f":"School_Listing[[#This Row],[System Code]]&School_Listing[[#This Row],[School Code]]","v":"90060"},"Jonesborough Elementary",{"$f":"School_Listing[[#This Row],[School Code]]","v":60}]
[900,"WASHINGTON COUNTY",{"$f":"School_Listing[[#This Row],[System Code]]","v":900},65,{"$f":"School_Listing[[#This Row],[System Code]]&School_Listing[[#This Row],[School Code]]","v":"90065"},"Jonesborough Middle School",{"$f":"School_Listing[[#This Row],[School Code]]","v":65}]
[900,"WASHINGTON COUNTY",{"$f":"School_Listing[[#This Row],[System Code]]","v":900},75,{"$f":"School_Listing[[#This Row],[System Code]]&School_Listing[[#This Row],[School Code]]","v":"90075"},"Lamar Elementary",{"$f":"School_Listing[[#This Row],[School Code]]","v":75}]
[900,"WASHINGTON COUNTY",{"$f":"School_Listing[[#This Row],[System Code]]","v":900},80,{"$f":"School_Listing[[#This Row],[System Code]]&School_Listing[[#This Row],[School Code]]","v":"90080"},"Ridgeview Elementary School",{"$f":"School_Listing[[#This Row],[School Code]]","v":80}]
[900,"WASHINGTON COUNTY",{"$f":"School_Listing[[#This Row],[System Code]]","v":900},90,{"$f":"School_Listing[[#This Row],[System Code]]&School_Listing[[#This Row],[School Code]]","v":"90090"},"South Central Elementary",{"$f":"School_Listing[[#This Row],[School Code]]","v":90}]
[900,"WASHINGTON COUNTY",{"$f":"School_Listing[[#This Row],[System Code]]","v":900},95,{"$f":"School_Listing[[#This Row],[System Code]]&School_Listing[[#This Row],[School Code]]","v":"90095"},"Sulphur Springs Elementary",{"$f":"School_Listing[[#This Row],[School Code]]","v":95}]
[900,"WASHINGTON COUNTY",{"$f":"School_Listing[[#This Row],[System Code]]","v":900},115,{"$f":"School_Listing[[#This Row],[System Code]]&School_Listing[[#This Row],[School Code]]","v":"900115"},"Tennessee Virtual Learning Academy",{"$f":"School_Listing[[#This Row],[School Code]]","v":115}]
[900,"WASHINGTON COUNTY",{"$f":"School_Listing[[#This Row],[System Code]]","v":900},105,{"$f":"School_Listing[[#This Row],[System Code]]&School_Listing[[#This Row],[School Code]]","v":"900105"},"University School",{"$f":"School_Listing[[#This Row],[School Code]]","v":105}]
[900,"WASHINGTON COUNTY",{"$f":"School_Listing[[#This Row],[System Code]]","v":900},5,{"$f":"School_Listing[[#This Row],[System Code]]&School_Listing[[#This Row],[School Code]]","v":"9005"},"Washington County Adult High School",{"$f":"School_Listing[[#This Row],[School Code]]","v":5}]
[900,"WASHINGTON COUNTY",{"$f":"School_Listing[[#This Row],[System Code]]","v":900},110,{"$f":"School_Listing[[#This Row],[System Code]]&School_Listing[[#This Row],[School Code]]","v":"900110"},"West View School",{"$f":"School_Listing[[#This Row],[School Code]]","v":110}]
[901,"JOHNSON CITY",{"$f":"School_Listing[[#This Row],[System Code]]","v":901},7,{"$f":"School_Listing[[#This Row],[System Code]]&School_Listing[[#This Row],[School Code]]","v":"9017"},"Cherokee Elementary",{"$f":"School_Listing[[#This Row],[School Code]]","v":7}]
[901,"JOHNSON CITY",{"$f":"School_Listing[[#This Row],[System Code]]","v":901},15,{"$f":"School_Listing[[#This Row],[System Code]]&School_Listing[[#This Row],[School Code]]","v":"90115"},"Fairmont Elementary",{"$f":"School_Listing[[#This Row],[School Code]]","v":15}]
[901,"JOHNSON CITY",{"$f":"School_Listing[[#This Row],[System Code]]","v":901},16,{"$f":"School_Listing[[#This Row],[System Code]]&School_Listing[[#This Row],[School Code]]","v":"90116"},"Indian Trail Middle School",{"$f":"School_Listing[[#This Row],[School Code]]","v":16}]
[901,"JOHNSON CITY",{"$f":"School_Listing[[#This Row],[System Code]]","v":901},17,{"$f":"School_Listing[[#This Row],[System Code]]&School_Listing[[#This Row],[School Code]]","v":"90117"},"Johnson City Virtual Academy",{"$f":"School_Listing[[#This Row],[School Code]]","v":17}]
[901,"JOHNSON CITY",{"$f":"School_Listing[[#This Row],[System Code]]","v":901},18,{"$f":"School_Listing[[#This Row],[System Code]]&School_Listing[[#This Row],[School Code]]","v":"90118"},"Lake Ridge Elementary",{"$f":"School_Listing[[#This Row],[School Code]]","v":18}]
[901,"JOHNSON CITY",{"$f":"School_Listing[[#This Row],[System Code]]","v":901},35,{"$f":"School_Listing[[#This Row],[System Code]]&School_Listing[[#This Row],[School Code]]","v":"90135"},"Liberty Bell Middle School",{"$f":"School_Listing[[#This Row],[School Code]]","v":35}]
[901,"JOHNSON CITY",{"$f":"School_Listing[[#This Row],[System Code]]","v":901},7001,{"$f":"School_Listing[[#This Row],[System Code]]&School_Listing[[#This Row],[School Code]]","v":"9017001"},"Little Buccaneers Student Child Care Center",{"$f":"School_Listing[[#This Row],[School Code]]","v":7001}]
[901,"JOHNSON CITY",{"$f":"School_Listing[[#This Row],[System Code]]","v":901},37,{"$f":"School_Listing[[#This Row],[System Code]]&School_Listing[[#This Row],[School Code]]","v":"90137"},"Mountain View Elementary",{"$f":"School_Listing[[#This Row],[School Code]]","v":37}]
[901,"JOHNSON CITY",{"$f":"School_Listing[[#This Row],[System Code]]","v":901},40,{"$f":"School_Listing[[#This Row],[System Code]]&School_Listing[[#This Row],[School Code]]","v":"90140"},"North Side Elementary",{"$f":"School_Listing[[#This Row],[School Code]]","v":40}]
[901,"JOHNSON CITY",{"$f":"School_Listing[[#This Row],[System Code]]","v":901},45,{"$f":"School_Listing[[#This Row],[System Code]]&School_Listing[[#This Row],[School Code]]","v":"90145"},"Science Hill High School",{"$f":"School_Listing[[#This Row],[School Code]]","v":45}]
[901,"JOHNSON CITY",{"$f":"School_Listing[[#This Row],[System Code]]","v":901},55,{"$f":"School_Listing[[#This Row],[System Code]]&School_Listing[[#This Row],[School Code]]","v":"90155"},"South Side Elementary",{"$f":"School_Listing[[#This Row],[School Code]]","v":55}]
[901,"JOHNSON CITY",{"$f":"School_Listing[[#This Row],[System Code]]","v":901},65,{"$f":"School_Listing[[#This Row],[System Code]]&School_Listing[[#This Row],[School Code]]","v":"90165"},"Towne Acres Elementary",{"$f":"School_Listing[[#This Row],[School Code]]","v":65}]
[901,"JOHNSON CITY",{"$f":"School_Listing[[#This Row],[System Code]]","v":901},20,{"$f":"School_Listing[[#This Row],[System Code]]&School_Listing[[#This Row],[School Code]]","v":"90120"},"Woodland Elementary",{"$f":"School_Listing[[#This Row],[School Code]]","v":20}]
[910,"WAYNE COUNTY",{"$f":"School_Listing[[#This Row],[System Code]]","v":910},5,{"$f":"School_Listing[[#This Row],[System Code]]&School_Listing[[#This Row],[School Code]]","v":"9105"},"Collinwood Elementary",{"$f":"School_Listing[[#This Row],[School Code]]","v":5}]
[910,"WAYNE COUNTY",{"$f":"School_Listing[[#This Row],[System Code]]","v":910},10,{"$f":"School_Listing[[#This Row],[System Code]]&School_Listing[[#This Row],[School Code]]","v":"91010"},"Collinwood High School",{"$f":"School_Listing[[#This Row],[School Code]]","v":10}]
[910,"WAYNE COUNTY",{"$f":"School_Listing[[#This Row],[System Code]]","v":910},15,{"$f":"School_Listing[[#This Row],[System Code]]&School_Listing[[#This Row],[School Code]]","v":"91015"},"Collinwood Middle School",{"$f":"School_Listing[[#This Row],[School Code]]","v":15}]
[910,"WAYNE COUNTY",{"$f":"School_Listing[[#This Row],[System Code]]","v":910},25,{"$f":"School_Listing[[#This Row],[System Code]]&School_Listing[[#This Row],[School Code]]","v":"91025"},"Frank Hughes School",{"$f":"School_Listing[[#This Row],[School Code]]","v":25}]
[910,"WAYNE COUNTY",{"$f":"School_Listing[[#This Row],[System Code]]","v":910},35,{"$f":"School_Listing[[#This Row],[System Code]]&School_Listing[[#This Row],[School Code]]","v":"91035"},"Wayne County High School",{"$f":"School_Listing[[#This Row],[School Code]]","v":35}]
[910,"WAYNE COUNTY",{"$f":"School_Listing[[#This Row],[System Code]]","v":910},36,{"$f":"School_Listing[[#This Row],[System Code]]&School_Listing[[#This Row],[School Code]]","v":"91036"},"Wayne County Technology Center",{"$f":"School_Listing[[#This Row],[School Code]]","v":36}]
[910,"WAYNE COUNTY",{"$f":"School_Listing[[#This Row],[System Code]]","v":910},38,{"$f":"School_Listing[[#This Row],[System Code]]&School_Listing[[#This Row],[School Code]]","v":"91038"},"Wayne County Virtual School",{"$f":"School_Listing[[#This Row],[School Code]]","v":38}]
[910,"WAYNE COUNTY",{"$f":"School_Listing[[#This Row],[System Code]]","v":910},40,{"$f":"School_Listing[[#This Row],[System Code]]&School_Listing[[#This Row],[School Code]]","v":"91040"},"Waynesboro Elementary",{"$f":"School_Listing[[#This Row],[School Code]]","v":40}]
[910,"WAYNE COUNTY",{"$f":"School_Listing[[#This Row],[System Code]]","v":910},45,{"$f":"School_Listing[[#This Row],[System Code]]&School_Listing[[#This Row],[School Code]]","v":"91045"},"Waynesboro Middle School",{"$f":"School_Listing[[#This Row],[School Code]]","v":45}]
[920,"WEAKLEY COUNTY",{"$f":"School_Listing[[#This Row],[System Code]]","v":920},5,{"$f":"School_Listing[[#This Row],[System Code]]&School_Listing[[#This Row],[School Code]]","v":"9205"},"Dresden Elementary",{"$f":"School_Listing[[#This Row],[School Code]]","v":5}]
[920,"WEAKLEY COUNTY",{"$f":"School_Listing[[#This Row],[System Code]]","v":920},10,{"$f":"School_Listing[[#This Row],[System Code]]&School_Listing[[#This Row],[School Code]]","v":"92010"},"Dresden High School",{"$f":"School_Listing[[#This Row],[School Code]]","v":10}]
[920,"WEAKLEY COUNTY",{"$f":"School_Listing[[#This Row],[System Code]]","v":920},7,{"$f":"School_Listing[[#This Row],[System Code]]&School_Listing[[#This Row],[School Code]]","v":"9207"},"Dresden Middle School",{"$f":"School_Listing[[#This Row],[School Code]]","v":7}]
[920,"WEAKLEY COUNTY",{"$f":"School_Listing[[#This Row],[System Code]]","v":920},15,{"$f":"School_Listing[[#This Row],[System Code]]&School_Listing[[#This Row],[School Code]]","v":"92015"},"Gleason School",{"$f":"School_Listing[[#This Row],[School Code]]","v":15}]
[920,"WEAKLEY COUNTY",{"$f":"School_Listing[[#This Row],[System Code]]","v":920},25,{"$f":"School_Listing[[#This Row],[System Code]]&School_Listing[[#This Row],[School Code]]","v":"92025"},"Greenfield School",{"$f":"School_Listing[[#This Row],[School Code]]","v":25}]
[920,"WEAKLEY COUNTY",{"$f":"School_Listing[[#This Row],[System Code]]","v":920},35,{"$f":"School_Listing[[#This Row],[System Code]]&School_Listing[[#This Row],[School Code]]","v":"92035"},"Martin Elementary",{"$f":"School_Listing[[#This Row],[School Code]]","v":35}]
[920,"WEAKLEY COUNTY",{"$f":"School_Listing[[#This Row],[System Code]]","v":920},45,{"$f":"School_Listing[[#This Row],[System Code]]&School_Listing[[#This Row],[School Code]]","v":"92045"},"Martin Middle School",{"$f":"School_Listing[[#This Row],[School Code]]","v":45}]
[920,"WEAKLEY COUNTY",{"$f":"School_Listing[[#This Row],[System Code]]","v":920},33,{"$f":"School_Listing[[#This Row],[System Code]]&School_Listing[[#This Row],[School Code]]","v":"92033"},"Martin Primary",{"$f":"School_Listing[[#This Row],[School Code]]","v":33}]
[920,"WEAKLEY COUNTY",{"$f":"School_Listing[[#This Row],[System Code]]","v":920},60,{"$f":"School_Listing[[#This Row],[System Code]]&School_Listing[[#This Row],[School Code]]","v":"92060"},"Sharon School",{"$f":"School_Listing[[#This Row],[School Code]]","v":60}]
[920,"WEAKLEY COUNTY",{"$f":"School_Listing[[#This Row],[System Code]]","v":920},65,{"$f":"School_Listing[[#This Row],[System Code]]&School_Listing[[#This Row],[School Code]]","v":"92065"},"Weakley County Center For Adult Continuing Education",{"$f":"School_Listing[[#This Row],[School Code]]","v":65}]
[920,"WEAKLEY COUNTY",{"$f":"School_Listing[[#This Row],[System Code]]","v":920},40,{"$f":"School_Listing[[#This Row],[System Code]]&School_Listing[[#This Row],[School Code]]","v":"92040"},"Westview High School",{"$f":"School_Listing[[#This Row],[School Code]]","v":40}]
[930,"WHITE COUNTY",{"$f":"School_Listing[[#This Row],[System Code]]","v":930},10,{"$f":"School_Listing[[#This Row],[System Code]]&School_Listing[[#This Row],[School Code]]","v":"93010"},"Bon De Croft Elementary",{"$f":"School_Listing[[#This Row],[School Code]]","v":10}]
[930,"WHITE COUNTY",{"$f":"School_Listing[[#This Row],[System Code]]","v":930},15,{"$f":"School_Listing[[#This Row],[System Code]]&School_Listing[[#This Row],[School Code]]","v":"93015"},"Cassville Elementary",{"$f":"School_Listing[[#This Row],[School Code]]","v":15}]
[930,"WHITE COUNTY",{"$f":"School_Listing[[#This Row],[System Code]]","v":930},25,{"$f":"School_Listing[[#This Row],[System Code]]&School_Listing[[#This Row],[School Code]]","v":"93025"},"Doyle Elementary",{"$f":"School_Listing[[#This Row],[School Code]]","v":25}]
[930,"WHITE COUNTY",{"$f":"School_Listing[[#This Row],[System Code]]","v":930},35,{"$f":"School_Listing[[#This Row],[System Code]]&School_Listing[[#This Row],[School Code]]","v":"93035"},"Findlay Elementary",{"$f":"School_Listing[[#This Row],[School Code]]","v":35}]
[930,"WHITE COUNTY",{"$f":"School_Listing[[#This Row],[System Code]]","v":930},37,{"$f":"School_Listing[[#This Row],[System Code]]&School_Listing[[#This Row],[School Code]]","v":"93037"},"Northfield Elementary School",{"$f":"School_Listing[[#This Row],[School Code]]","v":37}]
[930,"WHITE COUNTY",{"$f":"School_Listing[[#This Row],[System Code]]","v":930},50,{"$f":"School_Listing[[#This Row],[System Code]]&School_Listing[[#This Row],[School Code]]","v":"93050"},"White Co Middle School",{"$f":"School_Listing[[#This Row],[School Code]]","v":50}]
[930,"WHITE COUNTY",{"$f":"School_Listing[[#This Row],[System Code]]","v":930},40,{"$f":"School_Listing[[#This Row],[System Code]]&School_Listing[[#This Row],[School Code]]","v":"93040"},"White County High School",{"$f":"School_Listing[[#This Row],[School Code]]","v":40}]
[930,"WHITE COUNTY",{"$f":"School_Listing[[#This Row],[System Code]]","v":930},60,{"$f":"School_Listing[[#This Row],[System Code]]&School_Listing[[#This Row],[School Code]]","v":"93060"},"Woodland Park Elementary",{"$f":"School_Listing[[#This Row],[School Code]]","v":60}]
[940,"WILLIAMSON COUNTY",{"$f":"School_Listing[[#This Row],[System Code]]","v":940},4,{"$f":"School_Listing[[#This Row],[System Code]]&School_Listing[[#This Row],[School Code]]","v":"9404"},"Allendale Elementary School",{"$f":"School_Listing[[#This Row],[School Code]]","v":4}]
[940,"WILLIAMSON COUNTY",{"$f":"School_Listing[[#This Row],[System Code]]","v":940},5,{"$f":"School_Listing[[#This Row],[System Code]]&School_Listing[[#This Row],[School Code]]","v":"9405"},"Bethesda Elementary",{"$f":"School_Listing[[#This Row],[School Code]]","v":5}]
[940,"WILLIAMSON COUNTY",{"$f":"School_Listing[[#This Row],[System Code]]","v":940},12,{"$f":"School_Listing[[#This Row],[System Code]]&School_Listing[[#This Row],[School Code]]","v":"94012"},"Brentwood High School",{"$f":"School_Listing[[#This Row],[School Code]]","v":12}]
[940,"WILLIAMSON COUNTY",{"$f":"School_Listing[[#This Row],[System Code]]","v":940},67,{"$f":"School_Listing[[#This Row],[System Code]]&School_Listing[[#This Row],[School Code]]","v":"94067"},"Brentwood Middle School",{"$f":"School_Listing[[#This Row],[School Code]]","v":67}]
[940,"WILLIAMSON COUNTY",{"$f":"School_Listing[[#This Row],[System Code]]","v":940},17,{"$f":"School_Listing[[#This Row],[System Code]]&School_Listing[[#This Row],[School Code]]","v":"94017"},"Centennial High School",{"$f":"School_Listing[[#This Row],[School Code]]","v":17}]
[940,"WILLIAMSON COUNTY",{"$f":"School_Listing[[#This Row],[System Code]]","v":940},23,{"$f":"School_Listing[[#This Row],[System Code]]&School_Listing[[#This Row],[School Code]]","v":"94023"},"Chapman's Retreat Elementary",{"$f":"School_Listing[[#This Row],[School Code]]","v":23}]
[940,"WILLIAMSON COUNTY",{"$f":"School_Listing[[#This Row],[System Code]]","v":940},22,{"$f":"School_Listing[[#This Row],[System Code]]&School_Listing[[#This Row],[School Code]]","v":"94022"},"Clovercroft Elementary School",{"$f":"School_Listing[[#This Row],[School Code]]","v":22}]
[940,"WILLIAMSON COUNTY",{"$f":"School_Listing[[#This Row],[System Code]]","v":940},20,{"$f":"School_Listing[[#This Row],[System Code]]&School_Listing[[#This Row],[School Code]]","v":"94020"},"College Grove Elementary",{"$f":"School_Listing[[#This Row],[School Code]]","v":20}]
[940,"WILLIAMSON COUNTY",{"$f":"School_Listing[[#This Row],[System Code]]","v":940},19,{"$f":"School_Listing[[#This Row],[System Code]]&School_Listing[[#This Row],[School Code]]","v":"94019"},"Creekside Elementary School",{"$f":"School_Listing[[#This Row],[School Code]]","v":19}]
[940,"WILLIAMSON COUNTY",{"$f":"School_Listing[[#This Row],[System Code]]","v":940},28,{"$f":"School_Listing[[#This Row],[System Code]]&School_Listing[[#This Row],[School Code]]","v":"94028"},"Crockett Elementary",{"$f":"School_Listing[[#This Row],[School Code]]","v":28}]
[940,"WILLIAMSON COUNTY",{"$f":"School_Listing[[#This Row],[System Code]]","v":940},27,{"$f":"School_Listing[[#This Row],[System Code]]&School_Listing[[#This Row],[School Code]]","v":"94027"},"Edmondson Elementary",{"$f":"School_Listing[[#This Row],[School Code]]","v":27}]
[940,"WILLIAMSON COUNTY",{"$f":"School_Listing[[#This Row],[System Code]]","v":940},30,{"$f":"School_Listing[[#This Row],[System Code]]&School_Listing[[#This Row],[School Code]]","v":"94030"},"Fairview Elementary",{"$f":"School_Listing[[#This Row],[School Code]]","v":30}]
[940,"WILLIAMSON COUNTY",{"$f":"School_Listing[[#This Row],[System Code]]","v":940},35,{"$f":"School_Listing[[#This Row],[System Code]]&School_Listing[[#This Row],[School Code]]","v":"94035"},"Fairview High School",{"$f":"School_Listing[[#This Row],[School Code]]","v":35}]
[940,"WILLIAMSON COUNTY",{"$f":"School_Listing[[#This Row],[System Code]]","v":940},33,{"$f":"School_Listing[[#This Row],[System Code]]&School_Listing[[#This Row],[School Code]]","v":"94033"},"Fairview Middle School",{"$f":"School_Listing[[#This Row],[School Code]]","v":33}]
[940,"WILLIAMSON COUNTY",{"$f":"School_Listing[[#This Row],[System Code]]","v":940},40,{"$f":"School_Listing[[#This Row],[System Code]]&School_Listing[[#This Row],[School Code]]","v":"94040"},"Franklin High School",{"$f":"School_Listing[[#This Row],[School Code]]","v":40}]
[940,"WILLIAMSON COUNTY",{"$f":"School_Listing[[#This Row],[System Code]]","v":940},42,{"$f":"School_Listing[[#This Row],[System Code]]&School_Listing[[#This Row],[School Code]]","v":"94042"},"Fred J Page High School",{"$f":"School_Listing[[#This Row],[School Code]]","v":42}]
[940,"WILLIAMSON COUNTY",{"$f":"School_Listing[[#This Row],[System Code]]","v":940},41,{"$f":"School_Listing[[#This Row],[System Code]]&School_Listing[[#This Row],[School Code]]","v":"94041"},"Fred J Page Middle School",{"$f":"School_Listing[[#This Row],[School Code]]","v":41}]
[940,"WILLIAMSON COUNTY",{"$f":"School_Listing[[#This Row],[System Code]]","v":940},45,{"$f":"School_Listing[[#This Row],[System Code]]&School_Listing[[#This Row],[School Code]]","v":"94045"},"Grassland Elementary",{"$f":"School_Listing[[#This Row],[School Code]]","v":45}]
[940,"WILLIAMSON COUNTY",{"$f":"School_Listing[[#This Row],[System Code]]","v":940},46,{"$f":"School_Listing[[#This Row],[System Code]]&School_Listing[[#This Row],[School Code]]","v":"94046"},"Grassland Middle School",{"$f":"School_Listing[[#This Row],[School Code]]","v":46}]
[940,"WILLIAMSON COUNTY",{"$f":"School_Listing[[#This Row],[System Code]]","v":940},48,{"$f":"School_Listing[[#This Row],[System Code]]&School_Listing[[#This Row],[School Code]]","v":"94048"},"Heritage Elementary",{"$f":"School_Listing[[#This Row],[School Code]]","v":48}]
[940,"WILLIAMSON COUNTY",{"$f":"School_Listing[[#This Row],[System Code]]","v":940},49,{"$f":"School_Listing[[#This Row],[System Code]]&School_Listing[[#This Row],[School Code]]","v":"94049"},"Heritage Middle School",{"$f":"School_Listing[[#This Row],[School Code]]","v":49}]
[940,"WILLIAMSON COUNTY",{"$f":"School_Listing[[#This Row],[System Code]]","v":940},50,{"$f":"School_Listing[[#This Row],[System Code]]&School_Listing[[#This Row],[School Code]]","v":"94050"},"Hillsboro Elementary/ Middle School",{"$f":"School_Listing[[#This Row],[School Code]]","v":50}]
[940,"WILLIAMSON COUNTY",{"$f":"School_Listing[[#This Row],[System Code]]","v":940},57,{"$f":"School_Listing[[#This Row],[System Code]]&School_Listing[[#This Row],[School Code]]","v":"94057"},"Hunters Bend Elementary",{"$f":"School_Listing[[#This Row],[School Code]]","v":57}]
[940,"WILLIAMSON COUNTY",{"$f":"School_Listing[[#This Row],[System Code]]","v":940},52,{"$f":"School_Listing[[#This Row],[System Code]]&School_Listing[[#This Row],[School Code]]","v":"94052"},"Independence High School",{"$f":"School_Listing[[#This Row],[School Code]]","v":52}]
[940,"WILLIAMSON COUNTY",{"$f":"School_Listing[[#This Row],[System Code]]","v":940},58,{"$f":"School_Listing[[#This Row],[System Code]]&School_Listing[[#This Row],[School Code]]","v":"94058"},"Jordan Elementary School",{"$f":"School_Listing[[#This Row],[School Code]]","v":58}]
[940,"WILLIAMSON COUNTY",{"$f":"School_Listing[[#This Row],[System Code]]","v":940},59,{"$f":"School_Listing[[#This Row],[System Code]]&School_Listing[[#This Row],[School Code]]","v":"94059"},"Kenrose Elementary",{"$f":"School_Listing[[#This Row],[School Code]]","v":59}]
[940,"WILLIAMSON COUNTY",{"$f":"School_Listing[[#This Row],[System Code]]","v":940},69,{"$f":"School_Listing[[#This Row],[System Code]]&School_Listing[[#This Row],[School Code]]","v":"94069"},"Legacy Middle School",{"$f":"School_Listing[[#This Row],[School Code]]","v":69}]
[940,"WILLIAMSON COUNTY",{"$f":"School_Listing[[#This Row],[System Code]]","v":940},60,{"$f":"School_Listing[[#This Row],[System Code]]&School_Listing[[#This Row],[School Code]]","v":"94060"},"Lipscomb Elementary",{"$f":"School_Listing[[#This Row],[School Code]]","v":60}]
[940,"WILLIAMSON COUNTY",{"$f":"School_Listing[[#This Row],[System Code]]","v":940},61,{"$f":"School_Listing[[#This Row],[System Code]]&School_Listing[[#This Row],[School Code]]","v":"94061"},"Longview Elementary School",{"$f":"School_Listing[[#This Row],[School Code]]","v":61}]
[940,"WILLIAMSON COUNTY",{"$f":"School_Listing[[#This Row],[System Code]]","v":940},71,{"$f":"School_Listing[[#This Row],[System Code]]&School_Listing[[#This Row],[School Code]]","v":"94071"},"Mill Creek Elementary School",{"$f":"School_Listing[[#This Row],[School Code]]","v":71}]
[940,"WILLIAMSON COUNTY",{"$f":"School_Listing[[#This Row],[System Code]]","v":940},72,{"$f":"School_Listing[[#This Row],[System Code]]&School_Listing[[#This Row],[School Code]]","v":"94072"},"Mill Creek Middle School",{"$f":"School_Listing[[#This Row],[School Code]]","v":72}]
[940,"WILLIAMSON COUNTY",{"$f":"School_Listing[[#This Row],[System Code]]","v":940},65,{"$f":"School_Listing[[#This Row],[System Code]]&School_Listing[[#This Row],[School Code]]","v":"94065"},"Nolensville Elementary",{"$f":"School_Listing[[#This Row],[School Code]]","v":65}]
[940,"WILLIAMSON COUNTY",{"$f":"School_Listing[[#This Row],[System Code]]","v":940},66,{"$f":"School_Listing[[#This Row],[System Code]]&School_Listing[[#This Row],[School Code]]","v":"94066"},"Nolensville High School",{"$f":"School_Listing[[#This Row],[School Code]]","v":66}]
[940,"WILLIAMSON COUNTY",{"$f":"School_Listing[[#This Row],[System Code]]","v":940},68,{"$f":"School_Listing[[#This Row],[System Code]]&School_Listing[[#This Row],[School Code]]","v":"94068"},"Oak View Elem School",{"$f":"School_Listing[[#This Row],[School Code]]","v":68}]
[940,"WILLIAMSON COUNTY",{"$f":"School_Listing[[#This Row],[System Code]]","v":940},64,{"$f":"School_Listing[[#This Row],[System Code]]&School_Listing[[#This Row],[School Code]]","v":"94064"},"Pearre Creek Elementary School",{"$f":"School_Listing[[#This Row],[School Code]]","v":64}]
[940,"WILLIAMSON COUNTY",{"$f":"School_Listing[[#This Row],[System Code]]","v":940},74,{"$f":"School_Listing[[#This Row],[System Code]]&School_Listing[[#This Row],[School Code]]","v":"94074"},"Ravenwood High School",{"$f":"School_Listing[[#This Row],[School Code]]","v":74}]
[940,"WILLIAMSON COUNTY",{"$f":"School_Listing[[#This Row],[System Code]]","v":940},63,{"$f":"School_Listing[[#This Row],[System Code]]&School_Listing[[#This Row],[School Code]]","v":"94063"},"Renaissance High School",{"$f":"School_Listing[[#This Row],[School Code]]","v":63}]
[940,"WILLIAMSON COUNTY",{"$f":"School_Listing[[#This Row],[System Code]]","v":940},76,{"$f":"School_Listing[[#This Row],[System Code]]&School_Listing[[#This Row],[School Code]]","v":"94076"},"Scales Elementary",{"$f":"School_Listing[[#This Row],[School Code]]","v":76}]
[940,"WILLIAMSON COUNTY",{"$f":"School_Listing[[#This Row],[System Code]]","v":940},54,{"$f":"School_Listing[[#This Row],[System Code]]&School_Listing[[#This Row],[School Code]]","v":"94054"},"Spring Station Middle School",{"$f":"School_Listing[[#This Row],[School Code]]","v":54}]
[940,"WILLIAMSON COUNTY",{"$f":"School_Listing[[#This Row],[System Code]]","v":940},79,{"$f":"School_Listing[[#This Row],[System Code]]&School_Listing[[#This Row],[School Code]]","v":"94079"},"Summit High School",{"$f":"School_Listing[[#This Row],[School Code]]","v":79}]
[940,"WILLIAMSON COUNTY",{"$f":"School_Listing[[#This Row],[System Code]]","v":940},77,{"$f":"School_Listing[[#This Row],[System Code]]&School_Listing[[#This Row],[School Code]]","v":"94077"},"Sunset Elementary School",{"$f":"School_Listing[[#This Row],[School Code]]","v":77}]
[940,"WILLIAMSON COUNTY",{"$f":"School_Listing[[#This Row],[System Code]]","v":940},78,{"$f":"School_Listing[[#This Row],[System Code]]&School_Listing[[#This Row],[School Code]]","v":"94078"},"Sunset Middle School",{"$f":"School_Listing[[#This Row],[School Code]]","v":78}]
[940,"WILLIAMSON COUNTY",{"$f":"School_Listing[[#This Row],[System Code]]","v":940},81,{"$f":"School_Listing[[#This Row],[System Code]]&School_Listing[[#This Row],[School Code]]","v":"94081"},"Thompson's Station Elementary School",{"$f":"School_Listing[[#This Row],[School Code]]","v":81}]
[940,"WILLIAMSON COUNTY",{"$f":"School_Listing[[#This Row],[System Code]]","v":940},82,{"$f":"School_Listing[[#This Row],[System Code]]&School_Listing[[#This Row],[School Code]]","v":"94082"},"Thompson's Station Middle School",{"$f":"School_Listing[[#This Row],[School Code]]","v":82}]
[940,"WILLIAMSON COUNTY",{"$f":"School_Listing[[#This Row],[System Code]]","v":940},80,{"$f":"School_Listing[[#This Row],[System Code]]&School_Listing[[#This Row],[School Code]]","v":"94080"},"Trinity Elementary",{"$f":"School_Listing[[#This Row],[School Code]]","v":80}]
[940,"WILLIAMSON COUNTY",{"$f":"School_Listing[[#This Row],[System Code]]","v":940},93,{"$f":"School_Listing[[#This Row],[System Code]]&School_Listing[[#This Row],[School Code]]","v":"94093"},"Vanguard Virtual High School",{"$f":"School_Listing[[#This Row],[School Code]]","v":93}]
[940,"WILLIAMSON COUNTY",{"$f":"School_Listing[[#This Row],[System Code]]","v":940},83,{"$f":"School_Listing[[#This Row],[System Code]]&School_Listing[[#This Row],[School Code]]","v":"94083"},"Walnut Grove Elementary",{"$f":"School_Listing[[#This Row],[School Code]]","v":83}]
[940,"WILLIAMSON COUNTY",{"$f":"School_Listing[[#This Row],[System Code]]","v":940},88,{"$f":"School_Listing[[#This Row],[System Code]]&School_Listing[[#This Row],[School Code]]","v":"94088"},"Westwood Elementary School",{"$f":"School_Listing[[#This Row],[School Code]]","v":88}]
[940,"WILLIAMSON COUNTY",{"$f":"School_Listing[[#This Row],[System Code]]","v":940},89,{"$f":"School_Listing[[#This Row],[System Code]]&School_Listing[[#This Row],[School Code]]","v":"94089"},"Winstead Elementary School",{"$f":"School_Listing[[#This Row],[School Code]]","v":89}]
[940,"WILLIAMSON COUNTY",{"$f":"School_Listing[[#This Row],[System Code]]","v":940},84,{"$f":"School_Listing[[#This Row],[System Code]]&School_Listing[[#This Row],[School Code]]","v":"94084"},"Woodland Middle School",{"$f":"School_Listing[[#This Row],[School Code]]","v":84}]
[941,"FRANKLIN SSD",{"$f":"School_Listing[[#This Row],[System Code]]","v":941},10,{"$f":"School_Listing[[#This Row],[System Code]]&School_Listing[[#This Row],[School Code]]","v":"94110"},"Franklin Elementary",{"$f":"School_Listing[[#This Row],[School Code]]","v":10}]
[941,"FRANKLIN SSD",{"$f":"School_Listing[[#This Row],[System Code]]","v":941},21,{"$f":"School_Listing[[#This Row],[System Code]]&School_Listing[[#This Row],[School Code]]","v":"94121"},"Freedom Intermediate",{"$f":"School_Listing[[#This Row],[School Code]]","v":21}]
[941,"FRANKLIN SSD",{"$f":"School_Listing[[#This Row],[System Code]]","v":941},22,{"$f":"School_Listing[[#This Row],[System Code]]&School_Listing[[#This Row],[School Code]]","v":"94122"},"Freedom Middle School",{"$f":"School_Listing[[#This Row],[School Code]]","v":22}]
[941,"FRANKLIN SSD",{"$f":"School_Listing[[#This Row],[System Code]]","v":941},5,{"$f":"School_Listing[[#This Row],[System Code]]&School_Listing[[#This Row],[School Code]]","v":"9415"},"Johnson Elementary",{"$f":"School_Listing[[#This Row],[School Code]]","v":5}]
[941,"FRANKLIN SSD",{"$f":"School_Listing[[#This Row],[System Code]]","v":941},25,{"$f":"School_Listing[[#This Row],[System Code]]&School_Listing[[#This Row],[School Code]]","v":"94125"},"Liberty Elementary",{"$f":"School_Listing[[#This Row],[School Code]]","v":25}]
[941,"FRANKLIN SSD",{"$f":"School_Listing[[#This Row],[System Code]]","v":941},30,{"$f":"School_Listing[[#This Row],[System Code]]&School_Listing[[#This Row],[School Code]]","v":"94130"},"Moore Elementary",{"$f":"School_Listing[[#This Row],[School Code]]","v":30}]
[941,"FRANKLIN SSD",{"$f":"School_Listing[[#This Row],[System Code]]","v":941},40,{"$f":"School_Listing[[#This Row],[System Code]]&School_Listing[[#This Row],[School Code]]","v":"94140"},"Poplar Grove 5-8",{"$f":"School_Listing[[#This Row],[School Code]]","v":40}]
[941,"FRANKLIN SSD",{"$f":"School_Listing[[#This Row],[System Code]]","v":941},35,{"$f":"School_Listing[[#This Row],[System Code]]&School_Listing[[#This Row],[School Code]]","v":"94135"},"Poplar Grove K-4",{"$f":"School_Listing[[#This Row],[School Code]]","v":35}]
[950,"WILSON COUNTY",{"$f":"School_Listing[[#This Row],[System Code]]","v":950},4,{"$f":"School_Listing[[#This Row],[System Code]]&School_Listing[[#This Row],[School Code]]","v":"9504"},"Barry Tatum Academy",{"$f":"School_Listing[[#This Row],[School Code]]","v":4}]
[950,"WILSON COUNTY",{"$f":"School_Listing[[#This Row],[System Code]]","v":950},87,{"$f":"School_Listing[[#This Row],[System Code]]&School_Listing[[#This Row],[School Code]]","v":"95087"},"Barry Tatum Virtual Learning Academy",{"$f":"School_Listing[[#This Row],[School Code]]","v":87}]
[950,"WILSON COUNTY",{"$f":"School_Listing[[#This Row],[System Code]]","v":950},5,{"$f":"School_Listing[[#This Row],[System Code]]&School_Listing[[#This Row],[School Code]]","v":"9505"},"Carroll Oakland Elementary",{"$f":"School_Listing[[#This Row],[School Code]]","v":5}]
[950,"WILSON COUNTY",{"$f":"School_Listing[[#This Row],[System Code]]","v":950},90,{"$f":"School_Listing[[#This Row],[System Code]]&School_Listing[[#This Row],[School Code]]","v":"95090"},"Elzie D Patton Elementary School",{"$f":"School_Listing[[#This Row],[School Code]]","v":90}]
[950,"WILSON COUNTY",{"$f":"School_Listing[[#This Row],[System Code]]","v":950},10,{"$f":"School_Listing[[#This Row],[System Code]]&School_Listing[[#This Row],[School Code]]","v":"95010"},"Gladeville Elementary",{"$f":"School_Listing[[#This Row],[School Code]]","v":10}]
[950,"WILSON COUNTY",{"$f":"School_Listing[[#This Row],[System Code]]","v":950},11,{"$f":"School_Listing[[#This Row],[System Code]]&School_Listing[[#This Row],[School Code]]","v":"95011"},"Gladeville Middle School",{"$f":"School_Listing[[#This Row],[School Code]]","v":11}]
[950,"WILSON COUNTY",{"$f":"School_Listing[[#This Row],[System Code]]","v":950},12,{"$f":"School_Listing[[#This Row],[System Code]]&School_Listing[[#This Row],[School Code]]","v":"95012"},"Green Hill High School",{"$f":"School_Listing[[#This Row],[School Code]]","v":12}]
[950,"WILSON COUNTY",{"$f":"School_Listing[[#This Row],[System Code]]","v":950},20,{"$f":"School_Listing[[#This Row],[System Code]]&School_Listing[[#This Row],[School Code]]","v":"95020"},"Lakeview Elementary School",{"$f":"School_Listing[[#This Row],[School Code]]","v":20}]
[950,"WILSON COUNTY",{"$f":"School_Listing[[#This Row],[System Code]]","v":950},25,{"$f":"School_Listing[[#This Row],[System Code]]&School_Listing[[#This Row],[School Code]]","v":"95025"},"Lebanon High School",{"$f":"School_Listing[[#This Row],[School Code]]","v":25}]
[950,"WILSON COUNTY",{"$f":"School_Listing[[#This Row],[System Code]]","v":950},35,{"$f":"School_Listing[[#This Row],[System Code]]&School_Listing[[#This Row],[School Code]]","v":"95035"},"Mt. Juliet Elementary",{"$f":"School_Listing[[#This Row],[School Code]]","v":35}]
[950,"WILSON COUNTY",{"$f":"School_Listing[[#This Row],[System Code]]","v":950},30,{"$f":"School_Listing[[#This Row],[System Code]]&School_Listing[[#This Row],[School Code]]","v":"95030"},"Mt. Juliet High School",{"$f":"School_Listing[[#This Row],[School Code]]","v":30}]
[950,"WILSON COUNTY",{"$f":"School_Listing[[#This Row],[System Code]]","v":950},32,{"$f":"School_Listing[[#This Row],[System Code]]&School_Listing[[#This Row],[School Code]]","v":"95032"},"Mt. Juliet Middle School",{"$f":"School_Listing[[#This Row],[School Code]]","v":32}]
[950,"WILSON COUNTY",{"$f":"School_Listing[[#This Row],[System Code]]","v":950},46,{"$f":"School_Listing[[#This Row],[System Code]]&School_Listing[[#This Row],[School Code]]","v":"95046"},"Rutland Elementary",{"$f":"School_Listing[[#This Row],[School Code]]","v":46}]
[950,"WILSON COUNTY",{"$f":"School_Listing[[#This Row],[System Code]]","v":950},50,{"$f":"School_Listing[[#This Row],[System Code]]&School_Listing[[#This Row],[School Code]]","v":"95050"},"Southside Elementary",{"$f":"School_Listing[[#This Row],[School Code]]","v":50}]
[950,"WILSON COUNTY",{"$f":"School_Listing[[#This Row],[System Code]]","v":950},15,{"$f":"School_Listing[[#This Row],[System Code]]&School_Listing[[#This Row],[School Code]]","v":"95015"},"Springdale Elementary School",{"$f":"School_Listing[[#This Row],[School Code]]","v":15}]
[950,"WILSON COUNTY",{"$f":"School_Listing[[#This Row],[System Code]]","v":950},52,{"$f":"School_Listing[[#This Row],[System Code]]&School_Listing[[#This Row],[School Code]]","v":"95052"},"Stoner Creek Elementary",{"$f":"School_Listing[[#This Row],[School Code]]","v":52}]
[950,"WILSON COUNTY",{"$f":"School_Listing[[#This Row],[System Code]]","v":950},55,{"$f":"School_Listing[[#This Row],[System Code]]&School_Listing[[#This Row],[School Code]]","v":"95055"},"Tuckers Crossroads Elementary",{"$f":"School_Listing[[#This Row],[School Code]]","v":55}]
[950,"WILSON COUNTY",{"$f":"School_Listing[[#This Row],[System Code]]","v":950},80,{"$f":"School_Listing[[#This Row],[System Code]]&School_Listing[[#This Row],[School Code]]","v":"95080"},"W A Wright Elementary",{"$f":"School_Listing[[#This Row],[School Code]]","v":80}]
[950,"WILSON COUNTY",{"$f":"School_Listing[[#This Row],[System Code]]","v":950},63,{"$f":"School_Listing[[#This Row],[System Code]]&School_Listing[[#This Row],[School Code]]","v":"95063"},"Watertown Elementary",{"$f":"School_Listing[[#This Row],[School Code]]","v":63}]
[950,"WILSON COUNTY",{"$f":"School_Listing[[#This Row],[System Code]]","v":950},60,{"$f":"School_Listing[[#This Row],[System Code]]&School_Listing[[#This Row],[School Code]]","v":"95060"},"Watertown High School",{"$f":"School_Listing[[#This Row],[School Code]]","v":60}]
[950,"WILSON COUNTY",{"$f":"School_Listing[[#This Row],[System Code]]","v":950},95,{"$f":"School_Listing[[#This Row],[System Code]]&School_Listing[[#This Row],[School Code]]","v":"95095"},"Watertown Middle School",{"$f":"School_Listing[[#This Row],[School Code]]","v":95}]
[950,"WILSON COUNTY",{"$f":"School_Listing[[#This Row],[System Code]]","v":950},65,{"$f":"School_Listing[[#This Row],[System Code]]&School_Listing[[#This Row],[School Code]]","v":"95065"},"West Elementary",{"$f":"School_Listing[[#This Row],[School Code]]","v":65}]
[950,"WILSON COUNTY",{"$f":"School_Listing[[#This Row],[System Code]]","v":950},33,{"$f":"School_Listing[[#This Row],[System Code]]&School_Listing[[#This Row],[School Code]]","v":"95033"},"West Wilson Middle School",{"$f":"School_Listing[[#This Row],[School Code]]","v":33}]
[950,"WILSON COUNTY",{"$f":"School_Listing[[#This Row],[System Code]]","v":950},73,{"$f":"School_Listing[[#This Row],[System Code]]&School_Listing[[#This Row],[School Code]]","v":"95073"},"Wilson Central High School",{"$f":"School_Listing[[#This Row],[School Code]]","v":73}]
[950,"WILSON COUNTY",{"$f":"School_Listing[[#This Row],[System Code]]","v":950},85,{"$f":"School_Listing[[#This Row],[System Code]]&School_Listing[[#This Row],[School Code]]","v":"95085"},"Wilson Co Adult High School",{"$f":"School_Listing[[#This Row],[School Code]]","v":85}]
[951,"LEBANON",{"$f":"School_Listing[[#This Row],[System Code]]","v":951},5,{"$f":"School_Listing[[#This Row],[System Code]]&School_Listing[[#This Row],[School Code]]","v":"9515"},"Byars Dowdy Elementary",{"$f":"School_Listing[[#This Row],[School Code]]","v":5}]
[951,"LEBANON",{"$f":"School_Listing[[#This Row],[System Code]]","v":951},40,{"$f":"School_Listing[[#This Row],[System Code]]&School_Listing[[#This Row],[School Code]]","v":"95140"},"Castle Heights Elementary",{"$f":"School_Listing[[#This Row],[School Code]]","v":40}]
[951,"LEBANON",{"$f":"School_Listing[[#This Row],[System Code]]","v":951},7,{"$f":"School_Listing[[#This Row],[System Code]]&School_Listing[[#This Row],[School Code]]","v":"9517"},"Coles Ferry Elementary",{"$f":"School_Listing[[#This Row],[School Code]]","v":7}]
[951,"LEBANON",{"$f":"School_Listing[[#This Row],[System Code]]","v":951},12,{"$f":"School_Listing[[#This Row],[System Code]]&School_Listing[[#This Row],[School Code]]","v":"95112"},"Jones Brummett Elementary School",{"$f":"School_Listing[[#This Row],[School Code]]","v":12}]
[951,"LEBANON",{"$f":"School_Listing[[#This Row],[System Code]]","v":951},30,{"$f":"School_Listing[[#This Row],[System Code]]&School_Listing[[#This Row],[School Code]]","v":"95130"},"Sam Houston Elementary",{"$f":"School_Listing[[#This Row],[School Code]]","v":30}]
[951,"LEBANON",{"$f":"School_Listing[[#This Row],[System Code]]","v":951},35,{"$f":"School_Listing[[#This Row],[System Code]]&School_Listing[[#This Row],[School Code]]","v":"95135"},"Walter J. Baird Middle School",{"$f":"School_Listing[[#This Row],[School Code]]","v":35}]
[951,"LEBANON",{"$f":"School_Listing[[#This Row],[System Code]]","v":951},45,{"$f":"School_Listing[[#This Row],[System Code]]&School_Listing[[#This Row],[School Code]]","v":"95145"},"Winfree Bryant Middle School",{"$f":"School_Listing[[#This Row],[School Code]]","v":45}]
[960,"WEST TENNESSEE SCHOOL FOR THE DEAF",{"$f":"School_Listing[[#This Row],[System Code]]","v":960},5,{"$f":"School_Listing[[#This Row],[System Code]]&School_Listing[[#This Row],[School Code]]","v":"9605"},"West Tennessee School for the Deaf",{"$f":"School_Listing[[#This Row],[School Code]]","v":5}]
[961,"ALVIN C YORK INSTITUTE",{"$f":"School_Listing[[#This Row],[System Code]]","v":961},5,{"$f":"School_Listing[[#This Row],[System Code]]&School_Listing[[#This Row],[School Code]]","v":"9615"},"Alvin C. York Institute",{"$f":"School_Listing[[#This Row],[School Code]]","v":5}]
[963,"TENNESSEE SCHOOL FOR BLIND",{"$f":"School_Listing[[#This Row],[System Code]]","v":963},5,{"$f":"School_Listing[[#This Row],[System Code]]&School_Listing[[#This Row],[School Code]]","v":"9635"},"Tenn School For Blind",{"$f":"School_Listing[[#This Row],[School Code]]","v":5}]
[964,"TENNESSEE SCHOOLS FOR THE DEAF",{"$f":"School_Listing[[#This Row],[System Code]]","v":964},5,{"$f":"School_Listing[[#This Row],[System Code]]&School_Listing[[#This Row],[School Code]]","v":"9645"},"Tennessee School For Deaf Elementary School",{"$f":"School_Listing[[#This Row],[School Code]]","v":5}]
[964,"TENNESSEE SCHOOLS FOR THE DEAF",{"$f":"School_Listing[[#This Row],[System Code]]","v":964},15,{"$f":"School_Listing[[#This Row],[System Code]]&School_Listing[[#This Row],[School Code]]","v":"96415"},"Tennessee School for the Deaf Nashville",{"$f":"School_Listing[[#This Row],[School Code]]","v":15}]
[964,"TENNESSEE SCHOOLS FOR THE DEAF",{"$f":"School_Listing[[#This Row],[System Code]]","v":964},10,{"$f":"School_Listing[[#This Row],[System Code]]&School_Listing[[#This Row],[School Code]]","v":"96410"},"Tennessee School for the Deaf Upper School",{"$f":"School_Listing[[#This Row],[School Code]]","v":10}]
[970,"DEPARTMENT OF CHILDREN'S SERVICES EDUCATION DIVISION",{"$f":"School_Listing[[#This Row],[System Code]]","v":970},140,{"$f":"School_Listing[[#This Row],[System Code]]&School_Listing[[#This Row],[School Code]]","v":"970140"},"DCS Affiliated Schools",{"$f":"School_Listing[[#This Row],[School Code]]","v":140}]
[970,"DEPARTMENT OF CHILDREN'S SERVICES EDUCATION DIVISION",{"$f":"School_Listing[[#This Row],[System Code]]","v":970},45,{"$f":"School_Listing[[#This Row],[System Code]]&School_Listing[[#This Row],[School Code]]","v":"97045"},"Wilder Youth Development Center",{"$f":"School_Listing[[#This Row],[School Code]]","v":45}]
[971,"DEPARTMENT OF CORRECTION",{"$f":"School_Listing[[#This Row],[System Code]]","v":971},95,{"$f":"School_Listing[[#This Row],[System Code]]&School_Listing[[#This Row],[School Code]]","v":"97195"},"Trousdale Turner Correctional Center",{"$f":"School_Listing[[#This Row],[School Code]]","v":95}]
[972,"DEPT OF MENTAL HEALTH",{"$f":"School_Listing[[#This Row],[System Code]]","v":972},10,{"$f":"School_Listing[[#This Row],[System Code]]&School_Listing[[#This Row],[School Code]]","v":"97210"},"Middle Tn Mental Health Institute",{"$f":"School_Listing[[#This Row],[School Code]]","v":10}]
[985,"ACHIEVEMENT SCHOOL DISTRICT",{"$f":"School_Listing[[#This Row],[System Code]]","v":985},8005,{"$f":"School_Listing[[#This Row],[System Code]]&School_Listing[[#This Row],[School Code]]","v":"9858005"},"Brick Church: A LEAD Public School",{"$f":"School_Listing[[#This Row],[School Code]]","v":8005}]
[985,"ACHIEVEMENT SCHOOL DISTRICT",{"$f":"School_Listing[[#This Row],[System Code]]","v":985},8010,{"$f":"School_Listing[[#This Row],[System Code]]&School_Listing[[#This Row],[School Code]]","v":"9858010"},"Cornerstone Prep - Lester Campus",{"$f":"School_Listing[[#This Row],[School Code]]","v":8010}]
[985,"ACHIEVEMENT SCHOOL DISTRICT",{"$f":"School_Listing[[#This Row],[System Code]]","v":985},8055,{"$f":"School_Listing[[#This Row],[System Code]]&School_Listing[[#This Row],[School Code]]","v":"9858055"},"Fairley High School",{"$f":"School_Listing[[#This Row],[School Code]]","v":8055}]
[985,"ACHIEVEMENT SCHOOL DISTRICT",{"$f":"School_Listing[[#This Row],[System Code]]","v":985},8140,{"$f":"School_Listing[[#This Row],[System Code]]&School_Listing[[#This Row],[School Code]]","v":"9858140"},"Hillcrest High School",{"$f":"School_Listing[[#This Row],[School Code]]","v":8140}]
[985,"ACHIEVEMENT SCHOOL DISTRICT",{"$f":"School_Listing[[#This Row],[System Code]]","v":985},8015,{"$f":"School_Listing[[#This Row],[System Code]]&School_Listing[[#This Row],[School Code]]","v":"9858015"},"Humes Preparatory Academy Middle School",{"$f":"School_Listing[[#This Row],[School Code]]","v":8015}]
[985,"ACHIEVEMENT SCHOOL DISTRICT",{"$f":"School_Listing[[#This Row],[System Code]]","v":985},8050,{"$f":"School_Listing[[#This Row],[System Code]]&School_Listing[[#This Row],[School Code]]","v":"9858050"},"Journey Coleman School",{"$f":"School_Listing[[#This Row],[School Code]]","v":8050}]
[985,"ACHIEVEMENT SCHOOL DISTRICT",{"$f":"School_Listing[[#This Row],[System Code]]","v":985},8025,{"$f":"School_Listing[[#This Row],[System Code]]&School_Listing[[#This Row],[School Code]]","v":"9858025"},"Journey Hanley School",{"$f":"School_Listing[[#This Row],[School Code]]","v":8025}]
[985,"ACHIEVEMENT SCHOOL DISTRICT",{"$f":"School_Listing[[#This Row],[System Code]]","v":985},8135,{"$f":"School_Listing[[#This Row],[System Code]]&School_Listing[[#This Row],[School Code]]","v":"9858135"},"Kirby Middle School",{"$f":"School_Listing[[#This Row],[School Code]]","v":8135}]
[985,"ACHIEVEMENT SCHOOL DISTRICT",{"$f":"School_Listing[[#This Row],[System Code]]","v":985},8065,{"$f":"School_Listing[[#This Row],[System Code]]&School_Listing[[#This Row],[School Code]]","v":"9858065"},"Martin Luther King Preparatory High School",{"$f":"School_Listing[[#This Row],[School Code]]","v":8065}]
[985,"ACHIEVEMENT SCHOOL DISTRICT",{"$f":"School_Listing[[#This Row],[System Code]]","v":985},8125,{"$f":"School_Listing[[#This Row],[System Code]]&School_Listing[[#This Row],[School Code]]","v":"9858125"},"Memphis Scholars Caldwell-Guthrie",{"$f":"School_Listing[[#This Row],[School Code]]","v":8125}]
[985,"ACHIEVEMENT SCHOOL DISTRICT",{"$f":"School_Listing[[#This Row],[System Code]]","v":985},8120,{"$f":"School_Listing[[#This Row],[System Code]]&School_Listing[[#This Row],[School Code]]","v":"9858120"},"Memphis Scholars Florida Kansas",{"$f":"School_Listing[[#This Row],[School Code]]","v":8120}]
[985,"ACHIEVEMENT SCHOOL DISTRICT",{"$f":"School_Listing[[#This Row],[System Code]]","v":985},8130,{"$f":"School_Listing[[#This Row],[System Code]]&School_Listing[[#This Row],[School Code]]","v":"9858130"},"Memphis Scholars Raleigh-Egypt",{"$f":"School_Listing[[#This Row],[School Code]]","v":8130}]
[985,"ACHIEVEMENT SCHOOL DISTRICT",{"$f":"School_Listing[[#This Row],[System Code]]","v":985},8090,{"$f":"School_Listing[[#This Row],[System Code]]&School_Listing[[#This Row],[School Code]]","v":"9858090"},"Neely's Bend: A LEAD Public School",{"$f":"School_Listing[[#This Row],[School Code]]","v":8090}]
[985,"ACHIEVEMENT SCHOOL DISTRICT",{"$f":"School_Listing[[#This Row],[System Code]]","v":985},8060,{"$f":"School_Listing[[#This Row],[System Code]]&School_Listing[[#This Row],[School Code]]","v":"9858060"},"Promise Academy - Spring Hill",{"$f":"School_Listing[[#This Row],[School Code]]","v":8060}]
[985,"ACHIEVEMENT SCHOOL DISTRICT",{"$f":"School_Listing[[#This Row],[System Code]]","v":985},10,{"$f":"School_Listing[[#This Row],[System Code]]&School_Listing[[#This Row],[School Code]]","v":"98510"},"Westside Middle School",{"$f":"School_Listing[[#This Row],[School Code]]","v":10}]
[985,"ACHIEVEMENT SCHOOL DISTRICT",{"$f":"School_Listing[[#This Row],[System Code]]","v":985},8105,{"$f":"School_Listing[[#This Row],[System Code]]&School_Listing[[#This Row],[School Code]]","v":"9858105"},"Wooddale Middle School",{"$f":"School_Listing[[#This Row],[School Code]]","v":8105}]
[987,"TENNESSEE PUBLIC CHARTER SCHOOL COMMISSION",{"$f":"School_Listing[[#This Row],[System Code]]","v":987},8005,{"$f":"School_Listing[[#This Row],[System Code]]&School_Listing[[#This Row],[School Code]]","v":"9878005"},"Bluff City High School",{"$f":"School_Listing[[#This Row],[School Code]]","v":8005}]
[987,"TENNESSEE PUBLIC CHARTER SCHOOL COMMISSION",{"$f":"School_Listing[[#This Row],[System Code]]","v":987},8115,{"$f":"School_Listing[[#This Row],[System Code]]&School_Listing[[#This Row],[School Code]]","v":"9878115"},"Cornerstone Prep Denver Campus",{"$f":"School_Listing[[#This Row],[School Code]]","v":8115}]
[987,"TENNESSEE PUBLIC CHARTER SCHOOL COMMISSION",{"$f":"School_Listing[[#This Row],[System Code]]","v":987},8035,{"$f":"School_Listing[[#This Row],[System Code]]&School_Listing[[#This Row],[School Code]]","v":"9878035"},"Cornerstone Prep School",{"$f":"School_Listing[[#This Row],[School Code]]","v":8035}]
[987,"TENNESSEE PUBLIC CHARTER SCHOOL COMMISSION",{"$f":"School_Listing[[#This Row],[System Code]]","v":987},8015,{"$f":"School_Listing[[#This Row],[System Code]]&School_Listing[[#This Row],[School Code]]","v":"9878015"},"KIPP Antioch College Prep Elementary",{"$f":"School_Listing[[#This Row],[School Code]]","v":8015}]
[987,"TENNESSEE PUBLIC CHARTER SCHOOL COMMISSION",{"$f":"School_Listing[[#This Row],[System Code]]","v":987},8020,{"$f":"School_Listing[[#This Row],[System Code]]&School_Listing[[#This Row],[School Code]]","v":"9878020"},"KIPP Antioch College Prep Middle",{"$f":"School_Listing[[#This Row],[School Code]]","v":8020}]
[987,"TENNESSEE PUBLIC CHARTER SCHOOL COMMISSION",{"$f":"School_Listing[[#This Row],[System Code]]","v":987},8070,{"$f":"School_Listing[[#This Row],[System Code]]&School_Listing[[#This Row],[School Code]]","v":"9878070"},"Lester Prep",{"$f":"School_Listing[[#This Row],[School Code]]","v":8070}]
[987,"TENNESSEE PUBLIC CHARTER SCHOOL COMMISSION",{"$f":"School_Listing[[#This Row],[System Code]]","v":987},8095,{"$f":"School_Listing[[#This Row],[System Code]]&School_Listing[[#This Row],[School Code]]","v":"9878095"},"Libertas",{"$f":"School_Listing[[#This Row],[School Code]]","v":8095}]
[987,"TENNESSEE PUBLIC CHARTER SCHOOL COMMISSION",{"$f":"School_Listing[[#This Row],[System Code]]","v":987},8030,{"$f":"School_Listing[[#This Row],[System Code]]&School_Listing[[#This Row],[School Code]]","v":"9878030"},"Nashville Collegiate Prep",{"$f":"School_Listing[[#This Row],[School Code]]","v":8030}]
[987,"TENNESSEE PUBLIC CHARTER SCHOOL COMMISSION",{"$f":"School_Listing[[#This Row],[System Code]]","v":987},8045,{"$f":"School_Listing[[#This Row],[System Code]]&School_Listing[[#This Row],[School Code]]","v":"9878045"},"Rocketship NSH3 Antioch",{"$f":"School_Listing[[#This Row],[School Code]]","v":8045}]

{"sheet":"ReportCard (2)","index":12,"n_rows":51,"n_cols":11,"rows_kept":51,"hidden":true,"merged":[[4,0,6,10],[7,0,10,10],[11,0,11,4],[11,6,11,10],[12,1,12,4],[12,8,12,9],[13,1,13,4],[13,8,13,9],[15,1,15,2],[16,1,18,4],[16,7,16,8],[19,0,19,4],[19,6,19,10],[20,0,25,4],[20,6,25,10],[27,0,27,4],[27,6,27,10],[28,0,29,4],[28,6,29,8],[30,6,33,10],[32,0,35,4],[34,6,34,10],[35,6,35,10],[36,0,36,1],[36,2,36,4],[36,6,36,10],[37,2,38,4],[37,6,37,10],[38,6,38,10],[39,0,39,1],[39,2,39,4],[39,6,39,10],[40,6,40,10],[41,0,41,1],[41,2,41,4],[41,6,41,10],[42,6,42,10],[43,0,43,1],[43,2,43,4],[44,6,44,10],[45,0,45,1],[45,2,45,4],[45,6,46,10],[46,0,49,4],[48,8,48,9],[50,6,50,10]]}
[]
[]
[]
[]
["Student Health Report Card \n2016-2017 "]
[]
[]
["The purpose of these screenings is to provide you with an overview of the student's current health. This screening is not a diagnosis and should not be consider a medical examination. It is advise that the student receive regular wellness check-ups with his/her pediatrician as deemed necessary. "]
[]
[]
[]
["Student Information",{"$nulls":5},"Basic Health Profile"]
["Name","Alfredo Ramirez",{"$nulls":4},"Birth Date","  10/17/1985","Blood Pressure",null,{"$f":" B31 & \"/\" & B32","v":"120/80"}]
["School","Humboldt High School",{"$nulls":4},"Gender","  Male","      Body Mass Index",null,24.5]
["Grade","HS",{"$nulls":4},"Weight","  175 lbs."]
["School ID",960223665,{"$nulls":4},"Height","  60 in."]
["Address","9500 Some Street Apt E15\nHumboldt, TN 38343",{"$nulls":4},"Exam Date","  10/4/2016"]
[]
[]
["Blood Pressure Screening",{"$nulls":5},"Body Mass Index Screening"]
["Blood pressure is the force of blood pushing against the walls of your arteries, which carry blood from your heart to other parts of your body. Blood pressure normally rises and falls throughout the day. But if it stays high for a long time, it can damage your heart and lead to health problems.",{"$nulls":5},"Body Mass Index (BMI) is a person's weight in kilograms divided by the square of height in meters For children and teens, BMI is age- and sex-specific and is often referred to as BMI-for-age. In children, a high amount of body fat can lead to weight-related diseases and other health issues and being underweight can also put one at risk for health issues."]
[]
[]
[]
[]
[]
[]
["Blood Pressure (BP) Category",{"$nulls":5},"BMI Category"]
[{"$f":"\"Your Blood Pressure Reading is \" & B31 & \"/\" & B32 & \" mmHG\"","v":"Your Blood Pressure Reading is 120/80 mmHG"},{"$nulls":5},{"$f":"\"Your BMI Reading is \" & K14 & \" kg/m2\"","v":"Your BMI Reading is 24.5 kg/m2"}]
[]
["Systolic:",120,"mmHg",{"$nulls":3},{"$f":"IF(K14=\"\",\"No information available.\",\"If the student's BMI does not fall between \" & TRIM(MID(SUBSTITUTE(G38,\" \",REPT(\" \",LEN(G38))), (5-1)*LEN(G38)+1, LEN(G38))) & \" and \" & TRIM(MID(SUBSTITUTE(G38,\" \",REPT(\" \",LEN(G38))), (8-1)*LEN(G38)+1, LEN(G38))) & \", then it is recommended taht the student follows up with his/her pediatrician. The table below can be used to help categorize the student's weight.\")","v":"If the student's BMI does not fall between 16.507 and 23.38657, then it is recommended taht the student follows up with his/her pediatrician. The table below can be used to help categorize the student's weight."}]
["Diastolic:",80,"mmHg"]
[{"$f":" IF( OR(B31=\"\",B32=\"\"),\"No information available.\",\"If  the student's systolic BP is above \" & A45 & \" OR diasoltic BP is above \" & B45 & \", then it is recommended that the student follows up with his/her pediatrician. The table below can be used to help categorize the student's BP.\")","v":"If  the student's systolic BP is above 108 OR diasoltic BP is above 64, then it is recommended that the student follows up with his/her pediatrician. The table below can be used to help categorize the student's BP."}]
[]
[{"$nulls":6},"If the student's Body Mass Index (BMI)…"]
[{"$nulls":6},"Is below 16.507"]
["BLOOD PRESSURE",null,"BLOOD PRESSURE CATEGORY",{"$nulls":3},"then the student may be Underweight."]
["Systolic","Diastolic",{"$nulls":4},"Is at OR above 16.507 but below 23.38657"]
[{"$nulls":6},"then the student may be Normal weight."]
[null,null,"Stage 2 Hypertension",{"$nulls":3},"Is at OR above 23.38657 but below 26.77374"]
[125,82,{"$nulls":4},"then the student may be Overweight."]
[null,null,"Stage 1 Hypertension",{"$nulls":3},"Is at OR above 26.77374"]
[121,78,{"$nulls":4},"then the student may be Obese."]
[null,null,"Pre-Hypertension"]
[108,64,{"$nulls":4},"Additional Health Screenings"]
[null,null,"Normal",{"$nulls":3},"If the student failed any of these screenings it suggested that you follow-up with his/her pediatrician."]
["Instructions: Find where the student's systolic BP is located on left side of the graph and then find where the diastolic is located on the right side of the graph. Select the highest category (with normal being the lowest and Stage 2 being the highest). "]
[{"$nulls":6},"Vision","Failed",null,"Dental","Passed"]
[{"$nulls":6},"Hearing","Passed","    Color Vision",null,"NA"]
[{"$nulls":6},"Scoliosis","Passed"]
[{"$nulls":6},"*NOTE: NA indicates that no information is available."]

{"sheet":"PACER Report","index":13,"n_rows":2,"n_cols":23,"rows_kept":2}
["LEA Code","School Code","System Name","School Name","Exam Date","Grade Level","Student ID Number","Student Last Name","Student First Name","Student Middle Name","Date of Birth","Gender","Height (inches)","Weight (pounds)","PACER 15m ","PACER 20m","BMI","Gender Code","Age in Years","V02 Max","Low Fitness Level","High Fitness Level","Fitness Level"]
[940,88,"Williamson County","Westwood Elementary School","2015-10-03","HS",1234567890,"Doe","Jane","G","2000-10-03","F",60.5,90,45,null,{"$f":"IFERROR(Table4[Weight (pounds)]/(Table4[Height (inches)]^2)*703,\"\")","v":17.28570452837921},{"$f":"IF(Table4[Gender]=\"F\",2,1)","v":2},{"$f":"IF(INT((Table4[Exam Date]-Table4[Date of Birth])/365)>17,18,INT((Table4[Exam Date]-Table4[Date of Birth])/365))","v":15},{"$f":"IF(OR(Table4[[PACER 15m ]]<>\"\",Table4[PACER 20m]<>\"\"),IF(Table4[PACER 20m]<>\"\",0.21*(Table4[PACER 20m])-0.79*Table4[BMI]+4.27*(2-Table4[Gender Code])+0.79*Table4[Age in Years]+40.35,0.21*(Table4[[PACER 15m ]])-0.79*Table4[BMI]+4.27*(2-Table4[Gender Code])+0.79*Table4[Age in Years]+40.35),\"\")","v":47.99429342258043},{"$f":"IF(Table4[Gender Code]=1,VLOOKUP(Table4[Age in Years],HealthFitnessLevel!$H$8:$K$16,2,FALSE),IF(Table4[Gender Code]=2,VLOOKUP(Table4[Age in Years],HealthFitnessLevel!$A$8:$D$16,2,FALSE),\"\"))","v":36},{"$f":"IF(Table4[Gender Code]=1,VLOOKUP(Table4[Age in Years],HealthFitnessLevel!$H$8:$K$16,4,FALSE),IF(Table4[Gender Code]=2,VLOOKUP(Table4[Age in Years],HealthFitnessLevel!$A$8:$D$16,4,FALSE),\"\"))","v":39.1},{"$f":"IFERROR(IF(T2<>\"\",IF(T2<=U2,\"Needs Improvement (Health Risk)\",IF(T2>=V2,\"Healthy Fitness Zone\",\"Needs Improvement\")),\"\"), \"Out of Scope\")","v":"Healthy Fitness Zone"}]

{"sheet":"PACER Info","index":14,"n_rows":7,"n_cols":4,"rows_kept":7,"hidden":true}
[]
[]
[]
[null,"Count of School Name","Column Labels"]
[null,"Row Labels","Healthy Fitness Zone","Grand Total"]
[null,"Williamson County",1,1]
[null,"Grand Total",1,1]

{"sheet":"PACER Printoff","index":15,"n_rows":1,"n_cols":8,"rows_kept":1}
["District Name","School Name","Grade Level","Student Last Name","Student First Name","Student Middle Name","15M PACER Laps","20M PACER Laps"]

{"sheet":"BPTable (2020)","index":16,"n_rows":166,"n_cols":19,"rows_kept":166,"merged":[[0,0,1,0],[0,1,0,8],[0,9,0,17],[0,18,1,18],[1,4,1,5],[1,10,1,11],[1,16,1,17],[2,0,6,0],[2,4,2,5],[2,10,2,11],[2,16,2,17],[3,4,3,5],[3,10,3,11],[3,16,3,17],[4,4,4,5],[4,10,4,11],[4,16,4,17],[5,4,5,5],[5,10,5,11],[5,16,5,17],[6,4,6,5],[6,10,6,11],[6,16,6,17],[7,0,11,0],[7,4,7,5],[7,10,7,11],[7,16,7,17],[8,4,8,5],[8,10,8,11],[8,16,8,17],[9,4,9,5],[9,10,9,11],[9,16,9,17],[10,4,10,5],[10,10,10,11],[10,16,10,17],[11,4,11,5],[11,10,11,11],[11,16,11,17],[12,0,16,0],[12,4,12,5],[12,10,12,11],[12,16,12,17],[13,4,13,5],[13,10,13,11],[13,16,13,17],[14,4,14,5],[14,10,14,11],[14,16,14,17],[15,4,15,5],[15,10,15,11],[15,16,15,17],[16,4,16,5],[16,10,16,11],[16,16,16,17],[17,0,21,0],[17,4,17,5],[17,10,17,11],[17,16,17,17],[18,4,18,5],[18,10,18,11],[18,16,18,17],[19,4,19,5],[19,10,19,11],[19,16,19,17],[20,4,20,5],[20,10,20,11],[20,16,20,17],[21,4,21,5],[21,10,21,11],[21,16,21,17],[22,0,26,0],[22,4,22,5],[22,10,22,11],[22,16,22,17],[23,4,23,5],[23,10,23,11],[23,16,23,17],[24,4,24,5],[24,10,24,11],[24,16,24,17],[25,4,25,5],[25,10,25,11],[25,16,25,17],[26,4,26,5],[26,10,26,11],[26,16,26,17],[27,0,31,0],[27,4,27,5],[27,10,27,11],[27,16,27,17],[28,4,28,5],[28,10,28,11],[28,16,28,17],[29,4,29,5],[29,10,29,11],[29,16,29,17],[30,4,30,5],[30,10,30,11],[30,16,30,17],[31,4,31,5],[31,10,31,11],[31,16,31,17],[32,0,36,0],[32,4,32,5],[32,10,32,11],[32,16,32,17],[33,4,33,5],[33,10,33,11],[33,16,33,17],[34,4,34,5],[34,10,34,11],[34,16,34,17],[35,4,35,5],[35,10,35,11],[35,16,35,17],[36,4,36,5],[36,10,36,11],[36,16,36,17],[37,0,41,0],[37,4,37,5],[37,10,37,11],[37,16,37,17],[38,4,38,5],[38,10,38,11],[38,16,38,17],[39,4,39,5],[39,10,39,11],[39,16,39,17],[40,4,40,5],[40,10,40,11],[40,16,40,17],[41,4,41,5],[41,10,41,11],[41,16,41,17],[42,0,46,0],[42,4,42,5],[42,10,42,11],[42,16,42,17],[43,4,43,5],[43,10,43,11],[43,16,43,17],[44,4,44,5],[44,10,44,11],[44,16,44,17],[45,4,45,5],[45,10,45,11],[45,16,45,17],[46,4,46,5],[46,10,46,11],[46,16,46,17],[47,0,51,0],[47,4,47,5],[47,10,47,11],[47,16,47,17],[48,4,48,5],[48,10,48,11],[48,16,48,17],[49,4,49,5],[49,10,49,11],[49,16,49,17],[50,4,50,5],[50,10,50,11],[50,16,50,17],[51,4,51,5],[51,10,51,11],[51,16,51,17],[52,0,56,0],[52,4,52,5],[52,10,52,11],[52,16,52,17],[53,4,53,5],[53,10,53,11],[53,16,53,17],[54,4,54,5],[54,10,54,11],[54,16,54,17],[55,4,55,5],[55,10,55,11],[55,16,55,17],[56,4,56,5],[56,10,56,11],[56,16,56,17],[57,0,61,0],[57,4,57,5],[57,10,57,11],[57,16,57,17],[58,4,58,5],[58,10,58,11],[58,16,58,17],[59,4,59,5],[59,10,59,11],[59,16,59,17],[60,4,60,5],[60,10,60,11],[60,16,60,17],[61,4,61,5],[61,10,61,11],[61,16,61,17],[62,0,66,0],[62,4,62,5],[62,10,62,11],[62,16,62,17],[63,4,63,5],[63,10,63,11],[63,16,63,17],[64,4,64,5],[64,10,64,11],[64,16,64,17],[65,4,65,5],[65,10,65,11],[65,16,65,17],[66,4,66,5],[66,10,66,11],[66,16,66,17],[67,0,71,0],[67,4,67,5],[67,10,67,11],[67,16,67,17],[68,4,68,5],[68,10,68,11],[68,16,68,17],[69,4,69,5],[69,10,69,11],[69,16,69,17],[70,4,70,5],[70,10,70,11],[70,16,70,17],[71,4,71,5],[71,10,71,11],[71,16,71,17],[72,0,76,0],[72,4,72,5],[72,10,72,11],[72,16,72,17],[73,4,73,5],[73,10,73,11],[73,16,73,17],[74,4,74,5],[74,10,74,11],[74,16,74,17],[75,4,75,5],[75,10,75,11],[75,16,75,17],[76,4,76,5],[76,10,76,11],[76,16,76,17],[77,0,81,0],[77,4,77,5],[77,10,77,11],[77,16,77,17],[78,4,78,5],[78,10,78,11],[78,16,78,17],[79,4,79,5],[79,10,79,11],[79,16,79,17],[80,4,80,5],[80,10,80,11],[80,16,80,17],[81,4,81,5],[81,10,81,11],[81,16,81,17],[82,0,82,17],[83,0,84,0],[83,1,83,8],[83,9,83,17],[83,18,84,18],[84,3,84,4],[84,9,84,10],[84,15,84,16],[85,0,89,0],[85,3,85,4],[85,9,85,10],[85,15,85,16],[86,3,86,4],[86,9,86,10],[86,15,86,16],[87,3,87,4],[87,9,87,10],[87,15,87,16],[88,3,88,4],[88,9,88,10],[88,15,88,16],[89,3,89,4],[89,9,89,10],[89,15,89,16],[90,0,94,0],[90,3,90,4],[90,9,90,10],[90,15,90,16],[91,3,91,4],[91,9,91,10],[91,15,91,16],[92,3,92,4],[92,9,92,10],[92,15,92,16],[93,3,93,4],[93,9,93,10],[93,15,93,16],[94,3,94,4],[94,9,94,10],[94,15,94,16],[95,0,99,0],[95,3,95,4],[95,9,95,10],[95,15,95,16],[96,3,96,4],[96,9,96,10],[96,15,96,16],[97,3,97,4],[97,9,97,10],[97,15,97,16],[98,3,98,4],[98,9,98,10],[98,15,98,16],[99,3,99,4],[99,9,99,10],[99,15,99,16],[100,0,104,0],[100,3,100,4],[100,9,100,10],[100,15,100,16],[101,3,101,4],[101,9,101,10],[101,15,101,16],[102,3,102,4],[102,9,102,10],[102,15,102,16],[103,3,103,4],[103,9,103,10],[103,15,103,16],[104,3,104,4],[104,9,104,10],[104,15,104,16],[105,0,109,0],[105,3,105,4],[105,9,105,10],[105,15,105,16],[106,3,106,4],[106,9,106,10],[106,15,106,16],[107,3,107,4],[107,9,107,10],[107,15,107,16],[108,3,108,4],[108,9,108,10],[108,15,108,16],[109,3,109,4],[109,9,109,10],[109,15,109,16],[110,0,114,0],[110,3,110,4],[110,9,110,10],[110,15,110,16],[111,3,111,4],[111,9,111,10],[111,15,111,16],[112,3,112,4],[112,9,112,10],[112,15,112,16],[113,3,113,4],[113,9,113,10],[113,15,113,16],[114,3,114,4],[114,9,114,10],[114,15,114,16],[115,0,119,0],[115,3,115,4],[115,9,115,10],[115,15,115,16],[116,3,116,4],[116,9,116,10],[116,15,116,16],[117,3,117,4],[117,9,117,10],[117,15,117,16],[118,3,118,4],[118,9,118,10],[118,15,118,16],[119,3,119,4],[119,9,119,10],[119,15,119,16],[120,0,124,0],[120,3,120,4],[120,9,120,10],[120,15,120,16],[121,3,121,4],[121,9,121,10],[121,15,121,16],[122,3,122,4],[122,9,122,10],[122,15,122,16],[123,3,123,4],[123,9,123,10],[123,15,123,16],[124,3,124,4],[124,9,124,10],[124,15,124,16],[125,0,129,0],[125,3,125,4],[125,9,125,10],[125,15,125,16],[126,3,126,4],[126,9,126,10],[126,15,126,16],[127,3,127,4],[127,9,127,10],[127,15,127,16],[128,3,128,4],[128,9,128,10],[128,15,128,16],[129,3,129,4],[129,9,129,10],[129,15,129,16],[130,0,134,0],[130,3,130,4],[130,9,130,10],[130,15,130,16],[131,3,131,4],[131,9,131,10],[131,15,131,16],[132,3,132,4],[132,9,132,10],[132,15,132,16],[133,3,133,4],[133,9,133,10],[133,15,133,16],[134,3,134,4],[134,9,134,10],[134,15,134,16],[135,0,139,0],[135,3,135,4],[135,9,135,10],[135,15,135,16],[136,3,136,4],[136,9,136,10],[136,15,136,16],[137,3,137,4],[137,9,137,10],[137,15,137,16],[138,3,138,4],[138,9,138,10],[138,15,138,16],[139,3,139,4],[139,9,139,10],[139,15,139,16],[140,0,144,0],[140,3,140,4],[140,9,140,10],[140,15,140,16],[141,3,141,4],[141,9,141,10],[141,15,141,16],[142,3,142,4],[142,9,142,10],[142,15,142,16],[143,3,143,4],[143,9,143,10],[143,15,143,16],[144,3,144,4],[144,9,144,10],[144,15,144,16],[145,0,149,0],[145,3,145,4],[145,9,145,10],[145,15,145,16],[146,3,146,4],[146,9,146,10],[146,15,146,16],[147,3,147,4],[147,9,147,10],[147,15,147,16],[148,3,148,4],[148,9,148,10],[148,15,148,16],[149,3,149,4],[149,9,149,10],[149,15,149,16],[150,0,154,0],[150,3,150,4],[150,9,150,10],[150,15,150,16],[151,3,151,4],[151,9,151,10],[151,15,151,16],[152,3,152,4],[152,9,152,10],[152,15,152,16],[153,3,153,4],[153,9,153,10],[153,15,153,16],[154,3,154,4],[154,9,154,10],[154,15,154,16],[155,0,159,0],[155,3,155,4],[155,9,155,10],[155,15,155,16],[156,3,156,4],[156,9,156,10],[156,15,156,16],[157,3,157,4],[157,9,157,10],[157,15,157,16],[158,3,158,4],[158,9,158,10],[158,15,158,16],[159,3,159,4],[159,9,159,10],[159,15,159,16],[160,0,164,0],[160,3,160,4],[160,9,160,10],[160,15,160,16],[161,3,161,4],[161,9,161,10],[161,15,161,16],[162,3,162,4],[162,9,162,10],[162,15,162,16],[163,3,163,4],[163,9,163,10],[163,15,163,16],[164,3,164,4],[164,9,164,10],[164,15,164,16],[165,0,165,17]]}
["Age\nyrs","Systolic BP (mmHg)",{"$nulls":7},"Diastolic BP (mmHg)",{"$nulls":8},"BP\nPercentile"]
[null,"5th","10th","25th","50th",null,"75th","90th","95th","5th","10th",null,"25th","50th","75th","90th","95th"]
[2,31.9,32.4,33.3,34.2,null,35.1,{"v":36,"d":"36.0"},36.5,31.9,32.4,null,33.3,34.2,35.1,{"v":36,"d":"36.0"},36.5,null,"Height - inches"]
[null,84,85,87,88,null,90,92,92,39,40,null,41,42,43,44,44,null,"NT"]
[null,97,99,100,102,null,104,105,106,54,55,null,56,57,58,58,59,null,"PreHT"]
[null,101,102,104,106,null,108,109,110,59,59,null,60,61,62,63,63,null,"Stage 1 HT"]
[null,114,115,116,118,null,120,122,122,71,72,null,73,74,75,76,76,null,"Stage 2 HT"]
[3,35.1,35.6,36.5,37.5,null,38.6,39.5,40.1,35.1,35.6,null,36.5,37.5,38.6,39.5,40.1,null,"Height - inches"]
[null,86,87,89,91,null,93,94,95,44,44,null,45,46,47,48,48,null,"NT"]
[null,100,101,103,105,null,107,108,109,59,59,null,60,61,62,63,63,null,"PreHT"]
[null,104,105,107,109,null,110,112,113,63,63,null,64,65,66,67,67,null,"Stage 1 HT"]
[null,116,117,119,121,null,123,124,125,76,76,null,77,78,79,80,80,null,"Stage 2 HT"]
[4,37.6,38.2,39.3,40.4,null,41.5,42.5,43.1,37.6,38.2,null,39.3,40.4,41.5,42.5,43.1,null,"Height - inches"]
[null,88,89,91,93,null,95,96,97,47,48,null,49,50,51,51,52,null,"NT"]
[null,102,103,105,107,null,109,110,111,62,63,null,64,65,66,66,67,null,"PreHT"]
[null,106,107,109,111,null,112,114,115,66,67,null,68,69,70,71,71,null,"Stage 1 HT"]
[null,118,119,121,123,null,125,126,127,79,80,null,81,82,83,83,84,null,"Stage 2 HT"]
[5,39.9,40.6,41.7,{"v":43,"d":"43.0"},null,44.2,45.3,{"v":46,"d":"46.0"},39.9,40.6,null,41.7,{"v":43,"d":"43.0"},44.2,45.3,{"v":46,"d":"46.0"},null,"Height - inches"]
[null,90,91,93,95,null,96,98,98,50,51,null,52,53,54,55,55,null,"NT"]
[null,104,105,106,108,null,110,111,112,65,66,null,67,68,69,69,70,null,"PreHT"]
[null,108,109,110,112,null,114,115,116,69,70,null,71,72,73,74,74,null,"Stage 1 HT"]
[null,120,121,123,125,null,126,128,128,82,83,null,84,85,86,86,87,null,"Stage 2 HT"]
[6,42.2,{"v":43,"d":"43.0"},44.2,45.5,null,46.9,48.1,48.8,42.2,{"v":43,"d":"43.0"},null,44.2,45.5,46.9,48.1,48.8,null,"Height - inches"]
[null,91,92,94,96,null,98,99,100,53,53,null,54,55,56,57,57,null,"NT"]
[null,105,106,108,110,null,111,113,113,68,68,null,69,70,71,72,72,null,"PreHT"]
[null,109,110,112,114,null,115,117,117,72,72,null,73,74,75,76,76,null,"Stage 1 HT"]
[null,121,122,124,126,null,128,129,130,85,85,null,86,87,88,89,89,null,"Stage 2 HT"]
[7,44.6,45.3,46.6,{"v":48,"d":"48.0"},null,49.5,50.8,51.6,44.6,45.3,null,46.6,{"v":48,"d":"48.0"},49.5,50.8,51.6,null,"Height - inches"]
[null,92,94,95,97,null,99,100,101,55,55,null,56,57,58,59,59,null,"NT"]
[null,106,107,109,111,null,113,114,115,70,70,null,71,72,73,74,74,null,"PreHT"]
[null,110,111,113,115,null,117,118,119,74,74,null,75,76,77,78,78,null,"Stage 1 HT"]
[null,122,123,125,127,null,129,130,131,87,87,null,88,89,90,91,91,null,"Stage 2 HT"]
[8,46.8,47.6,48.9,50.4,null,{"v":52,"d":"52.0"},53.4,54.3,46.8,47.6,null,48.9,50.4,{"v":52,"d":"52.0"},53.4,54.3,null,"Height - inches"]
[null,94,95,97,99,null,100,102,102,56,57,null,58,59,60,60,61,null,"NT"]
[null,107,109,110,112,null,114,115,116,71,72,null,72,73,74,75,76,null,"PreHT"]
[null,111,112,114,116,null,118,119,120,75,76,null,77,78,79,79,80,null,"Stage 1 HT"]
[null,124,125,127,128,null,130,132,132,88,89,null,90,91,92,92,93,null,"Stage 2 HT"]
[9,48.7,49.6,{"v":51,"d":"51.0"},52.7,null,54.3,55.8,56.7,48.7,49.6,null,{"v":51,"d":"51.0"},52.7,54.3,55.8,56.7,null,"Height - inches"]
[null,95,96,98,100,null,102,103,104,57,58,null,59,60,61,61,62,null,"NT"]
[null,109,110,112,114,null,115,117,118,72,73,null,74,75,76,76,77,null,"PreHT"]
[null,113,114,116,118,null,119,121,121,76,77,null,78,79,80,81,81,null,"Stage 1 HT"]
[null,125,126,128,130,null,132,133,134,89,90,null,91,92,93,93,94,null,"Stage 2 HT"]
[10,50.5,51.4,52.9,54.7,null,56.4,{"v":58,"d":"58.0"},{"v":59,"d":"59.0"},50.5,51.4,null,52.9,54.7,56.4,{"v":58,"d":"58.0"},{"v":59,"d":"59.0"},null,"Height - inches"]
[null,97,98,100,102,null,103,105,106,58,59,null,60,61,61,62,63,null,"NT"]
[null,111,112,114,115,null,117,119,119,73,73,null,74,75,76,77,78,null,"PreHT"]
[null,115,116,117,119,null,121,122,123,77,78,null,79,80,81,81,82,null,"Stage 1 HT"]
[null,127,128,130,132,null,133,135,135,90,91,null,91,93,93,94,95,null,"Stage 2 HT"]
[11,52.1,53.1,54.7,56.6,null,58.5,60.2,61.2,52.1,53.1,null,54.7,56.6,58.5,60.2,61.2,null,"Height - inches"]
[null,99,100,102,104,null,105,107,107,59,59,null,60,61,62,63,63,null,"NT"]
[null,113,114,115,117,null,119,120,121,74,74,null,75,76,77,78,78,null,"PreHT"]
[null,117,118,119,121,null,123,124,125,78,78,null,79,80,81,82,82,null,"Stage 1 HT"]
[null,129,130,132,134,null,135,137,137,91,91,null,92,93,94,95,95,null,"Stage 2 HT"]
[12,54.1,55.1,56.8,58.8,null,60.8,62.6,63.7,54.1,55.1,null,56.8,58.8,60.8,62.6,63.7,null,"Height - inches"]
[null,101,102,104,106,null,108,109,110,59,60,null,61,62,63,63,64,null,"NT"]
[null,115,116,118,120,null,121,123,123,74,75,null,75,76,77,78,79,null,"PreHT"]
[null,119,120,122,123,null,125,127,127,78,79,null,80,81,82,82,83,null,"Stage 1 HT"]
[null,131,132,134,136,null,138,139,140,91,92,null,93,94,95,95,96,null,"Stage 2 HT"]
[13,56.5,57.6,59.5,61.6,null,63.7,65.6,66.7,56.5,57.6,null,59.5,61.6,63.7,65.6,66.7,null,"Height - inches"]
[null,104,105,106,108,null,110,111,112,60,60,null,61,62,63,64,64,null,"NT"]
[null,117,118,120,122,null,124,125,126,75,75,null,76,77,78,79,79,null,"PreHT"]
[null,121,122,124,126,null,128,129,130,79,79,null,80,81,82,83,83,null,"Stage 1 HT"]
[null,133,135,136,138,null,140,141,142,92,92,null,93,94,95,96,96,null,"Stage 2 HT"]
[14,59.3,60.5,62.5,64.6,null,66.7,68.6,69.7,59.3,60.5,null,62.5,64.6,66.7,68.6,69.7,null,"Height - inches"]
[null,106,107,109,111,null,113,114,115,60,61,null,62,63,64,65,65,null,"NT"]
[null,120,121,123,125,null,126,128,128,75,76,null,77,78,79,79,80,null,"PreHT"]
[null,124,125,127,128,null,130,132,132,80,80,null,81,82,83,84,84,null,"Stage 1 HT"]
[null,136,137,139,141,null,143,144,145,92,93,null,94,95,96,97,97,null,"Stage 2 HT"]
[15,61.7,62.9,64.9,{"v":67,"d":"67.0"},null,{"v":69,"d":"69.0"},70.8,71.8,61.7,62.9,null,64.9,{"v":67,"d":"67.0"},{"v":69,"d":"69.0"},70.8,71.8,null,"Height - inches"]
[null,109,110,112,113,null,115,117,117,61,62,null,63,64,65,66,66,null,"NT"]
[null,122,124,125,127,null,129,130,131,76,77,null,78,79,80,80,81,null,"PreHT"]
[null,126,127,129,131,null,133,134,135,81,81,null,82,83,84,85,85,null,"Stage 1 HT"]
[null,139,140,141,143,null,145,147,147,93,94,null,95,96,97,98,98,null,"Stage 2 HT"]
[16,63.3,64.5,66.3,68.4,null,70.3,{"v":72,"d":"72.0"},{"v":73,"d":"73.0"},63.3,64.5,null,66.3,68.4,70.3,{"v":72,"d":"72.0"},{"v":73,"d":"73.0"},null,"Height - inches"]
[null,111,112,114,116,null,118,119,120,63,63,null,64,65,66,67,67,null,"NT"]
[null,125,126,128,130,null,131,133,134,78,78,null,79,80,81,82,82,null,"PreHT"]
[null,129,130,132,134,null,135,137,137,82,83,null,83,84,85,86,87,null,"Stage 1 HT"]
[null,141,142,144,146,null,148,149,150,95,95,null,96,97,98,99,99,null,"Stage 2 HT"]
[17,64.2,65.3,67.1,{"v":69,"d":"69.0"},null,70.9,72.6,73.6,64.2,65.3,null,67.1,{"v":69,"d":"69.0"},70.9,72.6,73.6,null,"Height - inches"]
[null,114,115,116,118,null,120,121,122,65,66,null,66,67,68,69,70,null,"NT"]
[null,127,128,130,132,null,134,135,136,80,80,null,81,82,83,84,84,null,"PreHT"]
[null,131,132,134,136,null,138,139,140,84,85,null,86,87,87,88,89,null,"Stage 1 HT"]
[null,144,145,146,148,null,150,151,152,97,98,null,98,99,100,101,102,null,"Stage 2 HT"]
["The 90th percentile is 1.28 SD, the 95th percentile is 1.645 SD, and the 99th percentile is 2.326 SD over the mean.\nNT = normotensive (50th percentile   PreHT = pre-hypertensive (90th percentile)   HT = hypertensive (95th percentile for stage 1 and 99th% + 5 mmHg for stage 2)"]
["Age yrs","Systolic BP (mmHg)",{"$nulls":7},"Diastolic BP (mmHg)",{"$nulls":8},"BP Percentile"]
[null,"5th","10th","25th",null,"50th","75th","90th","95th","5th",null,"10th","25th","50th","75th","90th",null,"95th"]
[2,31.4,31.9,32.7,null,33.6,34.5,35.4,35.9,31.4,null,31.9,32.7,33.6,34.5,35.4,null,35.9,"Height - inches"]
[null,85,85,87,null,88,89,91,91,43,null,44,44,45,46,46,null,47,"NT"]
[null,98,99,100,null,101,103,104,105,57,null,58,58,59,60,61,null,61,"PreHT"]
[null,102,103,104,null,105,107,108,109,61,null,62,62,63,64,65,null,65,"Stage 1 HT"]
[null,114,115,116,null,117,119,120,121,74,null,74,75,75,76,77,null,77,"Stage 2 HT"]
[3,34.6,35.1,{"v":36,"d":"36.0"},null,37.1,38.1,39.1,39.7,34.6,null,35.1,{"v":36,"d":"36.0"},37.1,38.1,39.1,null,39.7,"Height - inches"]
[null,86,87,88,null,89,91,92,93,47,null,48,48,49,50,50,null,51,"NT"]
[null,100,100,102,null,103,104,106,106,61,null,62,62,63,64,64,null,65,"PreHT"]
[null,104,104,105,null,107,108,109,110,65,null,66,66,67,68,68,null,69,"Stage 1 HT"]
[null,116,116,118,null,119,120,121,122,78,null,78,79,79,80,81,null,81,"Stage 2 HT"]
[4,{"v":37,"d":"37.0"},37.6,38.6,null,39.8,40.9,{"v":42,"d":"42.0"},42.7,{"v":37,"d":"37.0"},null,37.6,38.6,39.8,40.9,{"v":42,"d":"42.0"},null,42.7,"Height - inches"]
[null,88,88,90,null,91,92,94,94,50,null,50,51,52,52,53,null,54,"NT"]
[null,101,102,103,null,104,106,107,108,64,null,64,65,66,67,67,null,68,"PreHT"]
[null,105,106,107,null,108,110,111,112,68,null,68,69,70,71,71,null,72,"Stage 1 HT"]
[null,117,118,119,null,120,122,123,124,81,null,81,81,82,83,84,null,84,"Stage 2 HT"]
[5,39.5,40.2,41.3,null,42.5,43.8,{"v":45,"d":"45.0"},45.7,39.5,null,40.2,41.3,42.5,43.8,{"v":45,"d":"45.0"},null,45.7,"Height - inches"]
[null,89,90,91,null,93,94,95,96,52,null,53,53,54,55,55,null,56,"NT"]
[null,103,103,105,null,106,107,109,109,66,null,67,67,68,69,69,null,70,"PreHT"]
[null,107,107,108,null,110,111,112,113,70,null,71,71,72,73,73,null,74,"Stage 1 HT"]
[null,119,119,121,null,122,123,125,125,83,null,83,84,84,85,86,null,86,"Stage 2 HT"]
[6,42.1,42.8,43.9,null,45.3,46.7,{"v":48,"d":"48.0"},48.8,42.1,null,42.8,43.9,45.3,46.7,{"v":48,"d":"48.0"},null,48.8,"Height - inches"]
[null,91,92,93,null,94,96,97,98,54,null,54,55,56,56,57,null,58,"NT"]
[null,104,105,106,null,108,109,110,111,68,null,68,69,70,70,71,null,72,"PreHT"]
[null,108,109,110,null,111,113,114,115,72,null,72,73,74,74,75,null,76,"Stage 1 HT"]
[null,120,121,122,null,124,125,126,127,85,null,85,85,86,87,88,null,88,"Stage 2 HT"]
[7,44.5,45.2,46.5,null,47.9,49.4,50.8,51.7,44.5,null,45.2,46.5,47.9,49.4,50.8,null,51.7,"Height - inches"]
[null,93,93,95,null,96,97,99,99,55,null,56,56,57,58,58,null,59,"NT"]
[null,106,107,108,null,109,111,112,113,69,null,70,70,71,72,72,null,73,"PreHT"]
[null,110,111,112,null,113,115,116,116,73,null,74,74,75,76,76,null,77,"Stage 1 HT"]
[null,122,123,124,null,125,127,128,129,86,null,86,87,87,88,89,null,89,"Stage 2 HT"]
[8,46.7,47.5,48.8,null,50.3,51.9,53.4,54.3,46.7,null,47.5,48.8,50.3,51.9,53.4,null,54.3,"Height - inches"]
[null,95,95,96,null,98,99,100,101,57,null,57,57,58,59,60,null,60,"NT"]
[null,108,109,110,null,111,113,114,114,71,null,71,71,72,73,74,null,74,"PreHT"]
[null,112,112,114,null,115,116,118,118,75,null,75,75,76,77,78,null,78,"Stage 1 HT"]
[null,124,125,126,null,127,128,130,130,87,null,87,88,88,89,90,null,91,"Stage 2 HT"]
[9,48.5,19.3,50.8,null,52.4,54.1,55.7,56.6,48.5,null,19.3,50.8,52.4,54.1,55.7,null,56.6,"Height - inches"]
[null,96,97,98,null,100,101,102,103,58,null,58,58,59,60,61,null,61,"NT"]
[null,110,110,112,null,113,114,116,116,72,null,72,72,73,74,75,null,75,"PreHT"]
[null,114,114,115,null,117,118,119,120,76,null,76,76,77,78,79,null,79,"Stage 1 HT"]
[null,126,126,128,null,129,130,132,132,88,null,88,89,89,90,91,null,92,"Stage 2 HT"]
[10,50.2,51.1,52.6,null,54.4,56.2,57.9,58.9,50.2,null,51.1,52.6,54.4,56.2,57.9,null,58.9,"Height - inches"]
[null,98,99,100,null,102,103,104,105,59,null,59,59,60,61,62,null,62,"NT"]
[null,112,112,114,null,115,116,118,118,73,null,73,73,74,75,76,null,76,"PreHT"]
[null,116,116,117,null,119,120,121,122,77,null,77,77,78,79,80,null,80,"Stage 1 HT"]
[null,128,128,130,null,131,132,134,134,89,null,89,90,91,91,92,null,93,"Stage 2 HT"]
[11,52.1,53.1,54.9,null,56.8,58.7,60.5,61.6,52.1,null,53.1,54.9,56.8,"58.7.",60.5,null,61.6,"Height - inches"]
[null,100,101,102,null,103,105,106,107,60,null,60,60,61,62,63,null,63,"NT"]
[null,114,114,116,null,117,118,119,120,74,null,74,74,75,76,77,null,77,"PreHT"]
[null,118,118,119,null,121,122,123,124,78,null,78,78,79,80,81,null,81,"Stage 1 HT"]
[null,130,130,131,null,133,134,135,136,90,null,90,91,92,92,93,null,94,"Stage 2 HT"]
[12,54.8,55.9,57.7,null,59.6,61.6,63.3,64.4,54.8,null,55.9,57.7,59.6,61.6,63.3,null,64.4,"Height - inches"]
[null,102,103,104,null,105,107,108,109,61,null,61,61,62,63,64,null,64,"NT"]
[null,116,116,117,null,119,120,121,122,75,null,75,75,76,77,78,null,78,"PreHT"]
[null,119,120,121,null,123,124,125,126,79,null,79,79,80,81,82,null,82,"Stage 1 HT"]
[null,132,132,133,null,135,136,137,138,91,null,91,92,93,93,94,null,95,"Stage 2 HT"]
[13,57.4,58.4,60.1,null,61.9,63.8,65.4,66.4,57.4,null,58.4,60.1,61.9,63.8,65.4,null,66.4,"Height - inches"]
[null,104,105,106,null,107,109,110,110,62,null,62,62,63,64,65,null,65,"NT"]
[null,117,118,119,null,121,122,123,124,76,null,76,76,77,78,79,null,79,"PreHT"]
[null,121,122,123,null,124,126,127,128,80,null,80,80,81,82,83,null,83,"Stage 1 HT"]
[null,133,134,135,null,137,138,139,140,92,null,92,93,94,94,95,null,96,"Stage 2 HT"]
[14,58.9,59.9,61.4,null,63.2,64.9,66.5,67.4,58.9,null,59.9,61.4,63.2,64.9,66.5,null,67.4,"Height - inches"]
[null,106,106,107,null,109,110,111,112,63,null,63,63,64,65,66,null,66,"NT"]
[null,119,120,121,null,122,124,125,125,77,null,77,77,78,79,80,null,80,"PreHT"]
[null,123,123,125,null,126,127,129,129,81,null,81,81,82,83,84,null,84,"Stage 1 HT"]
[null,135,136,137,null,138,140,141,141,93,null,93,94,95,95,96,null,97,"Stage 2 HT"]
[15,59.6,60.5,{"v":62,"d":"62.0"},null,63.7,65.5,{"v":67,"d":"67.0"},{"v":68,"d":"68.0"},59.6,null,60.5,{"v":62,"d":"62.0"},63.7,65.5,{"v":67,"d":"67.0"},null,{"v":68,"d":"68.0"},"Height - inches"]
[null,107,108,109,null,110,111,113,113,64,null,64,64,65,66,67,null,67,"NT"]
[null,120,121,122,null,123,125,126,127,78,null,78,78,79,80,81,null,81,"PreHT"]
[null,124,125,126,null,127,129,130,131,82,null,82,82,83,84,85,null,85,"Stage 1 HT"]
[null,136,137,138,null,139,141,142,143,94,null,94,95,96,96,97,null,98,"Stage 2 HT"]
[16,59.8,60.7,62.3,null,{"v":64,"d":"64.0"},65.7,67.3,68.2,59.8,null,60.7,62.3,{"v":64,"d":"64.0"},65.7,67.3,null,68.2,"Height - inches"]
[null,108,108,110,null,111,112,114,114,64,null,64,65,66,66,67,null,68,"NT"]
[null,121,122,123,null,124,126,127,128,78,null,78,79,80,81,81,null,82,"PreHT"]
[null,125,126,127,null,128,130,131,132,82,null,82,83,84,85,85,null,86,"Stage 1 HT"]
[null,137,138,139,null,140,142,143,144,95,null,95,95,96,97,98,null,98,"Stage 2 HT"]
[17,{"v":60,"d":"60.0"},60.9,62.4,null,64.1,65.9,67.4,68.3,{"v":60,"d":"60.0"},null,60.9,62.4,64.1,65.9,67.4,null,68.3,"Height - inches"]
[null,108,109,110,null,111,113,114,115,64,null,65,65,66,67,67,null,68,"NT"]
[null,122,122,123,null,125,126,127,128,78,null,79,79,80,81,81,null,82,"PreHT"]
[null,125,126,127,null,129,130,131,132,82,null,83,83,84,85,85,null,86,"Stage 1 HT"]
[null,138,138,139,null,141,142,143,144,95,null,95,96,96,97,98,null,98,"Stage 2 HT"]
["The 90th percentile is 1.28 SD, the 95th percentile is 1.645 SD, and the 99th percentile is 2.326 SD over the mean.\nNT = normotensive (50th percentile    PreHT = pre-hypertensive (90th percentile)    HT = hypertensive (95th percentile for stage 1 and 99th% + 5 mmHg for stage 2)"]